##TITLE=$$ Begin of the data block
##JCAMP-DX=5.00 $$ ACD/SpecManager v 10.08
##SPECTROMETER/DATA SYSTEM=Alpha
##DATE=22 Dec 2014 10:36:42
##DATA TYPE=INFRARED SPECTRUM
##DATA CLASS=XYDATA
##ORIGIN=
##OWNER=
##NPOINTS=1765
##FIRSTX=399.76428223
##LASTX=3997.64306641
##MAXX=3997.64306641
##MINX=399.76428223
##MAXY=0.82504743
##MINY=0.25361127
##XFACTOR=1.0000000000
##YFACTOR=1.000000000000000e-9
##FIRSTY=0.51292157
##DELTAX=2.03961372
##XUNITS=1/CM
##YUNITS=ARBITRARY UNITS
##XYDATA=(X++(Y..Y))
$$ plain form
399.8 512921572 508679986 506502271 505168319 504614651 505762458 508517444 511196733 512255371 511971414
418.1 511971414 511157095 509729564 507440865 504655302 502056062 499805808 497513771 495022237 493531138
436.5 493531138 494497299 497623831 501660883 505809605 510047078 513873041 516149819 516669095 516415894
454.8 516415894 516262412 515800595 514160514 511544585 508956552 506617129 503720641 500003397 496400565
473.2 496400565 493959725 492256880 490632117 489498705 489474863 490117490 490256876 489515245 488604486
491.5 488604486 487957627 486801505 484741122 482660830 481000900 479055047 476135999 472578913 469431877
509.9 469431877 466637999 463182002 458855510 454446048 450865179 448275715 446297079 444934070
526.2 444934070 444838643 446016312 447639644 449658066 453223079 458872795 465156734 470072299 473081619
$$ packed form
399.8E12921572m241586k177715j333952n53668J147807K754986K679289J058638k83957
418.1E11971414q14319j427531k288699k785563k599240k250254k292037k491534j491099
436.5D93531138R66161L126532M037052M148722M237473L825963K276778N19276k53201
454.8E16415894j53482m61817j640081k615929k588033k339423k896488l717244l602832
473.2D96400565k440840j702845j624763j133412k3842O42627J39386p41631r10759
491.5D88604486o46859j156122k060383k080292j659930j945853k919048l557086l147036
509.9D69431877k793878l455997m326492m409462l580869k589464j978636j363009
526.2D44934070r5427J177669J623332K018422L565013N649716O283939M915565L009320
$$ plain form
544.6 473081619 474836558 475614846 474880338 472592175 469842076 467271000 464076400 459505916 453989476
562.9 453989476 448263258 442258507 435956657 430595428 427730501 427765816 429963082 433654636 438978106
581.3 438978106 446081847 453837305 460347921 464866012 468025386 470264137 471388102 471347213 470810086
599.6 470810086 470687151 470998615 471087515 470940173 471515983 473217905 475257993 477134883 479512215
618 479512215 483152062 487567067 491592497 494936287 498237520 501655340 504575431 506504178 507925808
636.4 507925808 509729803 511683345 512872756 513463855 514516711 516258836 517797828 518634200 519376695
654.7 519376695 520726383 522348046 523278713 523610592 524352670 526195168 528360367 529205203 530091226
673.1 530091226 532100618 534480393 536044300 536906004 538133502 539870858 540983856 540869772 540289938
$$ packed form
544.6D73081619J754939P78288p34508k288163k750099k571076l194600m570484n516440
562.9D53989476n726218o004751o301850n361229k864927L5315K197266L691554N323470
581.3D38978106P103741P755458O510616M518091L159374K238751J123965m0889n37127
599.6D70810086j22935L11464Q8900j47342N75810J701922K040088J876890K377332
618D79512215L639847M415005M025430L343790L301233L417820K920091J928747J421630
636.4E07925808J803995J953542J189411N91099J052856J742125J538992Q36372P42495
654.7E19376695J349688J621663R30667L31879P42078J842498K165199Q44836Q86023
673.1E30091226K009392K379775J563907Q61704J227498J737356J112998j14084n79834
$$ plain form
691.4 540289938 539956450 539181590 536830127 533301055 530131519 527857780 525811076 523973703 523572862
709.8 523572862 525458932 528873265 532606483 536725998 542146921 548666418 554886162 560243785
726.1 560243785 565477788 571120024 576316535 579880416 582157969 584442198 586703420 587431908 586034119
744.5 586034119 583608031 581025898 577648640 572627068 566769183 561753213 557861567 554206967
760.8 554206967 550857365 549270332 550539792 554188907 559130728 565249443 573271573 582836807
777.1 582836807 592009783 599571586 606294990 613063574 619139850 623474717 626721442 630624533
793.4 630624533 635488510 639956176 643597126 647534847 652112603 655920208 657849491 658775091 660174489
811.8 660174489 661852002 662491798 661926925 661408901 661432862 660584211 657624006 653419614 649287999
$$ packed form
691.4E40289938l33488p74860k351463l529072l169536k273739k046704j837373m00841
709.8E23572862J886070L414333L733218M119515N420923O519497O219744N357623
726.1E60243785N234003N642236N196511L563881K277553K284229K261222P28488j397789
744.5E86034119k426088k582133l377258n021572n857885n015970l891646l654600
760.8E54206967l349602j587033J269460L649115M941821O118715Q022130R565234
777.1E82836807R172976P561803O723404O768584O076276M334867L246725L903091
793.4F30624533M863977M467666L640950L937721M577756L807605J929283R25600J399398
811.8F60174489J677513O39796n64873n18024K3961q48651k960205m204392m131615
$$ plain form
830.1 649287999 644878685 639169276 632530868 626523197 621759593 617301583 612389147 607679665
846.4 607679665 604009092 600736022 596503556 591153800 585847557 581783831 580007017 581789911
862.8 581789911 587974727 598070025 610273302 622398436 633014500 641678691 647868872 650383353
879.1 650383353 648747921 644320786 638802886 632538676 625202477 617434680 610573769 604900122
895.4 604900122 599398553 593377352 587221265 581217110 574591637 566439092 556910515 546836317
911.7 546836317 536670506 526337981 516275823 507853270 502148330 498933941 497206599 496427268
928 496427268 496849835 498648375 501321435 504322648 507821083 512113154 516330004 518404841 516600966
946.4 516600966 510598898 500921786 488155603 473144442 457071006 440730155 424108416 406954646
$$ packed form
830.1F49287999m409314n709409o638408o007671m763604m458010m912436m709482
846.4F07679665l670573l273070m232466n349756n306243m063726j776814J782894
862.8E81789911O184816J0095298J2203277J2125134J0616064Q664191O190181K514481
879.1F50383353j635432m427135n517900o264210p336199p767797o860911n673647
895.4F04900122n501569o021201o156087o004155o625473q152545r528577j0074198
911.7E46836317j0165811j0332525j0062158q422553n704940l214389j727342p79331
928D96427268M22567J798540K673060L001213L498435M292071M216850K074837j803875
946.4E16600966o002068r677112j2766183j5011161j6073436j6340851j6621739j7153770
$$ plain form
962.7 406954646 389452308 372039646 354887605 337934852 321346074 305676609 291579336
977 291579336 279480785 269610375 262161970 257227600 254573822 253611267 253748983 254648596 256169617
995.3 256169617 258115679 260101825 261832476 263276309 264404088 265073687 265214771 265020937 264967412
1013.7 264967412 265429854 266428620 267869264 269812882 272301435 275188684 278244853 281296760 284274012
1032 284274012 286976159 289030403 290268958 290967703 291521907 292133301 292882740 293963134 295816898
1050.4 295816898 298838556 303034455 308185041 314251155 321411252 329664856 338268906 345359117
1066.7 345359117 348248363 345187753 337409675 328555197 321867317 318444908 317781538 318970919
1083 318970919 321371496 324701726 328852385 333601326 338551998 343313664 347480714 350602925 352420479
$$ packed form
962.7D06954646j7502338j7412662j7152041j6952753j6588778j5669465j4097273
977B91579336j2098551r870410p448405m934370k653778r62555J37716Q99613J521021
995.3B56169617J946062J986146J730651J443833J127779O69599J41084j93834n3525
1013.7B64967412M62442R98766J440644J943618K488553K887249L056169L051907K977252
1032B84274012K702147K054244J238555O98745N54204O11394P49439J080394J853764
1050.4B95816898L021658M195899N150586O066114P160097Q253604Q604050P090211
1066.7C45359117K889246l060610p778078q854478o687880l422409o63370J189381
1083C18970919K400577L330230M150659M748941M950672M761666M167050L122211J817554
$$ plain form
1101.4 352420479 353231430 353900850 355320185 357785523 360999525 364560902 368150741 371404827 373986423
1119.8 373986423 375893891 377556831 379590362 382433325 386157870 390331209 394012004 396062583
1136.1 396062583 395562500 392270416 386812657 380256712 373473495 367018968 361339837 356809556
1152.4 356809556 353591889 351573259 350587159 350658923 351999640 354813188 359191507 365161240 372745603
1170.7 372745603 381868541 392187834 403226942 414740443 426670164 438764066 450497299
1185 450497299 461360961 471059620 479320884 485851616 490644932 494104028 496801645 499182135
1201.3 499182135 501449883 503785610 506582916 510205865 514646173 519590497 524712265 529727995
1217.7 529727995 534201324 537571132 539550245 540328324 540263057 539545715 538282335 536758661 535341978
$$ packed form
1101.4C52420479Q10951O69420J419335K465338L214002L561377L589839L254086K581596
1119.8C73986423J907468J662940K033531K842963L724545M173339L680795K050579
1136.1C96062583n00083l292084n457759o555945o783217o454527n679131m530281
1152.4C56809556l217667k018630r86100P1764J340717K813548M378319N969733P584363
1170.7C72745603R122938J0319293J1039108J1513501J1929721J2093902J1733233
1185D50497299J0863662R698659Q261264O530732M793316L459096K697617K380490
1201.3D99182135K267748K335727K797306L622949M440308M944324N121768N015730
1217.7E29727995M473329L369808J979113P78079o5267p17342j263380j523674j416683
$$ plain form
1236 535341978 534137487 533043146 532186568 531979680 532673478 534107745 535903871 537804008 539766252
1254.4 539766252 541691065 543283761 544401348 545355976 546650171 548496425 550719500 553012431
1270.7 553012431 555124342 556767166 557645023 557743669 557386339 556950927 556544662 555965602 555111527
1289 555111527 554174483 553185999 551890135 550170481 548247397 546412587 544708490 542960703 541120291
1307.4 541120291 539477587 538228512 537174881 536131322 535076618 533928156 532370090 529908478
1323.7 529908478 526270568 521656573 516561985 511492789 506881177 503160179 500591934 499062955
1340 499062955 498298228 498101950 498330384 498698860 498811632 498506546 497880012 497090608 496206403 495137095
1360.4 495137095 493824720 492609978 491795450 491251767 490984499 491201580 491835415 492501050 493058115
$$ packed form
1236E35341978j204491j094341q56578k06888O93798J434267J796126J900137J962244
1254.4E39766252J924813J592696J117587R54628J294195J846254K223075K292931
1270.7E53012431K111911J642824Q77857R8646l57330m35412m06265n79060q54075
1289E55111527r37044r88484j295864j719654j923084j834810j704097j747787j840412
1307.4E41120291j642704j249075j053631j043559j054704j148462j558066k461612
1323.7E29908478l637910m613995n094588n069196m611612l720998k568245j528979
1340D99062955p64727j96278K28434L68476J12772l05086o26534p89404q84205j069308
1360.4D95137095j312375j214742q14528n43683k67268K17081O33835O65635N57065
$$ plain form
1378.8 493058115 493648976 494731158 497044563 500862360 505035698 508340538 510764420 512150943
1395.1 512150943 512276351 511451244 510274053 509031832 507449031 505576134 503701568 501880944 500251770
1413.5 500251770 498971760 497867048 496789068 496185273 496160567 496490747 497167140 498132586 499263465
1431.8 499263465 500578403 502149343 503780186 505279779 506787598 508114576 509031594 509328485 508920074
1450.2 508920074 508074105 507032573 505299330 502909660 501798570 502096236 503567576 506219208 510000944
1468.5 510000944 515593112 523998022 533247411 541439831 549000263 556318760 563434660 570066810
1484.9 570066810 576582968 583167732 589097977 593830645 598388612 603390217 607833743 611450851
1501.2 611450851 614837766 618797839 623164833 625929594 627970338 630331159 633020282 635750651
$$ packed form
1378.8D93058115N90861J082182K313405L817797M173338L304840K423882J386523
1395.1E12150943J25408q25107j177191j242221j582801j872897j874566j820624j629174
1413.5E00251770j280010j104712j077980o03795k4706L30180O76393R65446J130879
1431.8D99263465J314938J570940J630843J499593J507819J326978R17018K96891m08411
1450.2E08920074q45969j041532j733243k389670j111090K97666J471340K651632L781736
1468.5E10000944N592168Q404910R249389Q192420P560432P318497P115900O632150
1484.9E70066810O516158O584764N930245M732668M557967N001605M443526L617108
1501.2F11450851L386915L960073M366994K764761K040744K360821K689123K730369
$$ plain form
1517.5 635750651 638206363 640549779 642576873 644298077 645907640 647408724 649079442 650742471
1533.8 650742471 652115822 653565824 655081391 655727804 655855954 655978739 656226814 656583667 656954527
1552.2 656954527 657419086 658028841 658167124 656938016 656008542 655527532 655158341 654786050 654170990
1570.5 654170990 653684199 653338850 652461648 651359916 650527656 649601519 648478746 647218525 645793915
1588.9 645793915 644092083 642093778 639833689 637442291 634977221 632274210 629288375 626207530
1605.2 626207530 623104036 619675338 616005778 612569690 608891606 604345977 600580573 597561300
1621.5 597561300 594027519 590407133 586961448 583615422 581147969 579566121 577891588 576210797
1637.8 576210797 575212121 574898064 575275242 576174736 577191830 578304470 580160737 582714319 584729016
$$ packed form
1517.5F35750651K455712K343416K027094J721204J609563J501084J670718J663029
1533.8F50742471J373351J450002J515567O46413J28150J22785K48075L56853L70860
1552.2F56954527M64559O09755J38283j229108r29474m81010l69191l72291o15060
1570.5F54170990m86791l45349q77202j101732q32260r26137j122773j260221j424610
1588.9F45793915j701832j998305k260089k391398k465070k703011k985835l080845
1605.2F26207530l103494l428698l669560l436088l678084m545629l765404l019273
1621.5E97561300l533781l620386l445685l346026k467453j581848j674533j680791
1637.8E76210797r98676l14057L77178Q99494J017094J112640J856267K553582K014697
$$ plain form
1656.2 584729016 586882710 589832366 593592048 597515941 601175368 605373442 610212028 614651740
1672.5 614651740 619297624 624305189 628972709 633690298 639109433 645257890 650145710 654323280
1688.8 654323280 658789277 662992895 667330563 671734810 675619304 679220974 681884587 684019208
1705.1 684019208 686112106 688079596 690042019 692039192 694052339 695813060 696828306 697560966
1721.5 697560966 698633730 700324595 702502906 704871476 707142711 709441125 711598277 713484406
1737.8 713484406 715432584 717448592 719718456 722394884 725264668 728154480 731065333 733989835
1754.1 733989835 736989737 739785016 742223799 744662881 746942997 748962581 750848949 752691507
1770.4 752691507 754499376 755943358 757013977 758068919 759305358 760598660 761723757 762695551
$$ packed form
1656.2E84729016K153694K949656L759682L923893L659427M198074M838586M439712
1672.5F14651740M645884N007565M667520M717589N419135O148457M887820M177570
1688.8F54323280M465997M203618M337668M404247L884494L601670K663613K134621
1705.1F84019208K092898J967490J962423J997173K013147J760721J015246P32660
1721.5F97560966J072764J690865K178311K368570K271235K298414K157152J886129
1737.8G13484406J948178K016008K269864K676428K869784K889812K910853K924502
1754.1G33989835K999902K795279K438783K439082K280116K019584J886368J842558
1770.4G52691507J807869J443982J070619J054942J236439J293302J125097R71794
$$ plain form
1786.7 762695551 763824463 765240669 766569495 767406940 768122137 769121587 770289004 771206856 771883368
1805.1 771883368 772730231 773855686 774880290 775525033 776075780 776848912 777795613 778655052 779351413
1823.4 779351413 780067027 780943573 781746686 782131553 782384276 782896101 783569515 784097016 784490705 784907460
1843.8 784907460 785347462 785691202 785843611 785947919 786245704 786705434 787045777 787192166 787407696 787923515
1864.2 787923515 788547754 788820088 788747549 788885057 789327145 789698005 789880216 790167451 790743947 791376114
1884.6 791376114 791822553 792127490 792466342 792914987 793261111 793376148 793530107 793913066 794282615 794407189
1905 794407189 794443667 794668555 795015872 795198858 795246899 795397699 795707226 795983672 796044230 796024561 796209931
1927.5 796209931 796520531 796688676 796707034 796805441 797104478 797421992 797529101 797534823 797744870 798094392
$$ packed form
1786.7G62695551J128912J416206J328826Q37445P15197R99450J167417R17852O76512
1805.1G71883368Q46863J125455J024604O44743N50747P73132R46701Q59439O96361
1823.4G79351413P15614Q76546Q03113L84867K52723N11825O73414N27501L93689M16755
1843.8G84907460M40002L43740J52409J04308K97785M59730L40343J46389K15530N15819
1864.2G87923515O24239K72334p2539J37508M42088L70860J82211K87235N76496O32167
1884.6G91376114M46439L04937L38852M48645L46124J15037J53959L82959L69549J24574
1905G94407189L6478K24888L47317J82986M8041J50800L09527K76446O0558j9669J85370
1927.5G96209931L10600J68145J8358R8407K99037L17514J07109N722K10047L49522
$$ plain form
1947.9 798094392 798311174 798380613 798551023 798928320 799288869 799448311 799537241 799821138 800245464 800473273
1968.3 800473273 800457120 800529301 800839722 801127493 801181018 801186502 801396489 801701605 801830471 801784873 801820755
1990.7 801820755 802011907 802152991 802106261 802000344 802048802 802183747 802137733 801879942 801688135 801660955
2011.1 801660955 801559269 801198244 800695360 800271809 799878061 799261332 798538804 798228860 798288941 798153460
2031.5 798153460 797695220 797235489 796974003 796760559 796381772 795909762 795607626 795524418 795418382 795149148
2051.9 795149148 794914544 794927299 795063019 795077980 795019388 795116305 795341730 795446575 795387924 795390427 795568883
2074.3 795568883 795759678 795760930 795650244 795674860 795851648 795999050 796041489 796112776 796337783 796598613
2094.7 796598613 796719134 796787381 796994567 797324359 797588348 797680318 797744453 797936678 798169911 798261404
$$ packed form
1947.9G98094392K16782O9439J70410L77297L60549J59442Q8930K83897M24326K27809
1968.3H00473273j6153P2181L10421K87771N3525N484K09987L05116J28866m5598L5882
1990.7H01820755J91152J41084m6730j05917M8458J34945m6014k57791j91807k7180
2011.1H01660955j01686l61025n02884m23551l93748o16729p22528l09944O0081j35481
2031.5G98153460m58240m59731k61486k13444l78787m72010l02136q3208j06036k69234
2051.9G95149148k34604J2755J35720J4961n8592R6917K25425J04845n8651K503J78456
2074.3G95568883J90795J252j10686K4616J76788J47402M2439P1287K25007K60830
2094.7G96598613J20521O8247K07186L29792K63989R1970O4135J92225K33233R1493
$$ plain form
2115.1 798261404 798241496 798307836 798472047 798549056 798495173 798488677 798628390 798755646 798727989 798661947 798709869
2137.5 798709869 798853815 798949540 798917830 798880160 798978388 799144328 799201608 799213052 799373031 799655616 799924791
2160 799924791 800164938 800454080 800813973 801181972 801555276 802005351 802559674 803167999 803713560 804158747
2180.4 804158747 804609656 805146515 805707633 806172550 806556463 806983769 807462871 807891250 808243096 808607101
2200.8 808607101 809047163 809512258 809935749 810319960 810744286 811259747 811753273 812112808 812414587 812789202
2221.2 812789202 813221157 813589454 813854337 814126253 814469576 814789295 815033495 815260053 815521359 815814555
2241.6 815814555 816077232 816268623 816472411 816742957 816992342 817178071 817367435 817610145 817901671 818187535
2262 818187535 818391144 818573594 818827569 819093883 819318533 819492579 819644272 819853604 820082486 820252061
$$ packed form
2115.1G98261404j9908O6340J64211P7009n3883o496J39713J27256k7657o6042M7922
2137.5G98709869J43946R5725l1710l7670R8228J65940N7280J1444J59979K82585K69175
2160G99924791K40147K89142L59893L67999L73304M50075N54323O08325N45561M45187
2180.4H04158747M50909N36859N61118M64917L83913M27306M79102M28379L51846L64005
2200.8H08607101M40062M65095M23491L84211M24326N15461M93526L59535L01779L74615
2221.2H12789202M31955L68297K64883K71916L43323L19719K44200K26558K61306K93196
2241.6H15814555K62677J91391K03788K70546K49385J85729J89364K42710K91526K85864
2262H18187535K03609J82450K53975K66314K24650J74046J51693K09332K28882J69575
$$ plain form
2282.3 820252061 820418835 820652127 820921838 821128547 821249962 821392238 821619987 821862638 822012603 822120726
2302.7 822120726 822346032 822679877 822960734 823154330 823375463 823650897 823914826 824151158 824370146 824599206
2323.1 824599206 824862838 825047433 825046122 824963331 824923158 824869514 824707568 824473262 824280381 824082255
2343.5 824082255 823596835 822984457 822808325 823272824 824056983 824640870 824905872 824915886 824680269 824256182
2363.9 824256182 823669553 822946072 822156489 821352422 820535719 819727421 819063962 818618476 818249702 817802191
2384.3 817802191 817356169 817087591 816956878 816798151 816547692 816278756 816090405 815888941 815521181 815078437
2404.7 815078437 814734995 814483583 814160645 813680708 813187957 812807739 812426805 811875105 811216652 810662031
2425.1 810662031 810218513 809697866 809036255 808403909 807894349 807347119 806662083 805951774 805323005 804764032
$$ packed form
2282.3H20252061J66774K33292K69711K06709J21415J42276K27749K42651J49965J08123
2302.7H22120726K25306L33845K80857J93596K21133K75434K63929K36332K18988K29060
2323.1H24599206K63632J84595j311q2791m0173n3644j61946k34306j92881j98126
2343.5H24082255m85420o12378j76132M64499P84159N83887K65002J0014k35617m24087
2363.9H24256182n86629p23481p89583q04067q16703q08298o63459m45486l68774m47511
2384.3H17802191m46022k68578j30713j58727k50459k68936j88351k01464l67760m42744
2404.7H15078437l43442k51412l22938m79937m92751l80218l80934n51700o58453n54621
2425.1H10662031m43518n20647o61611o32346n09560n47230o85036p10309o28769n58973
$$ plain form
2445.5 804764032 804170668 803476632 802790105 802230239 801726520 801123023 800437450 799835980 799354851 798852742
2465.9 798852742 798217058 797550976 797038674 796631396 796095908 795419037 794836998 794426024 794009268 793460011
2486.3 793460011 792896152 792497814 792209089 791826606 791351795 790993989 790797472 790524900 790057003 789606690
2506.7 789606690 789346218 789166510 788875639 788424551 787963510 787632823 787292719 786769569 786178350 785695553
2527.1 785695553 785269320 784699440 783955932 783245683 782676637 782102108 781368554 780568123 779928029 779429615
2547.5 779429615 778811097 778009534 777262151 776707947 776161909 775429368 774615407 773951232 773452044 772901356
2567.9 772901356 772188365 771479845 770934224 770408273 769715726 768964350 768356204 767893732 767393887 766742468
2588.3 766742468 766100705 765682936 765375495 764896572 764301002 763859868 763563752 763147891 762490451 761771500
$$ packed form
2445.5H04764032n93364o94036o86527n59866n03719o03497o85573o01470m81129n02109
2465.9G98852742o35684o66082n12302m07278n35488o76871n82039m10974m16756n49257
2486.3G93460011n63859l98338k88725l82483m74811l57806j96517k72572m67897m50313
2506.7G89606690k60472j79708k90871m51088m61041l30687l40104n23150n91219m82797
2527.1G85695553m26233n69880p43508p10249n69046n74529p33554q00431o40094m98414
2547.5G79429615o18518q01563p47383n54204n46038p32541q13961o64175m99188n50688
2567.9G72901356p12991p08520n45621n25951o92547p51376o08146m62472m99845o51419
2588.3G66742468o41763m17769l07441m78923n95570m41134k96116m15861o57440p18951
$$ plain form
2608.7 761771500 761172891 760593891 759805620 758810103 757865071 757057250 756144166 754990578 753805399
2627 753805399 752775252 751769781 750564218 749195099 747906983 746792793 745670080 744378805 743050396
2645.4 743050396 741887271 740819693 739618063 738293707 737088203 736041188 734939575 733688474
2661.7 733688474 732467830 731451154 730516315 729457200 728311181 727245092 726321936 725434780 724452078
2680.1 724452078 723457754 722600996 721789539 720830917 719748735 718750477 717893302 716957629 715802550
2698.4 715802550 714616895 713579476 712565184 711393595 710105777 708905578 707888067 706875026
2714.7 706875026 705711186 704552829 703583479 702703953 701719463 700659275 699721634 698960483 698203087
2733.1 698203087 697331905 696462154 695732415 695077658 694318175 693440974 692631662 691971958 691315651 690538347
$$ packed form
2608.7G61771500n98609n79000p88271r95517r45032q07821r13084j153588j185179
2627G53805399j030147j005471j205563j369119j288116j114190j122713j291275j328409
2645.4G43050396j163125j067578j201630j324356j205504j047015j101613j251101
2661.7G33688474j220644j016676r34839j059115j146019j066089r23156q87156r82702
2680.1G24452078r94324q56758q11457r58622j082182r98258q57175r35673j155079
2698.4G15802550j185655j037419j014292j171589j287818j200199j017511j013041
2714.7G06875026j163840j158357r69350q79526r84490j060188r37641p61151p57396
2733.1F98203087q71182q69751p29739o54757p59483q77201q09312o59704o56307p77304
$$ plain form
2753.5 690538347 689750850 689113736 688591480 688011289 687312126 686652541 686124086 685555279 684798717 683940291
2773.9 683940291 683120847 682315409 681379080 680307388 679254293 678252220 677158713 675883055 674512267
2792.2 674512267 673187971 671876192 670376837 668654740 666916788 665252090 663497925 661537826
2808.6 661537826 659497142 657524765 655577183 653496623 651226759 648913324 646644235 644302130
2824.9 644302130 641785324 639155924 636542737 633918285 631112754 628073573 624894500 621620834
2841.2 621620834 618145347 614337206 610270321 606212676 602431893 599055767 596058428 593340456
2857.5 593340456 590720952 587858260 584457278 580515385 576158166 571455240 566480637 561356366
2873.8 561356366 556262732 551443875 547067821 543205082 539969027 537462592 535632074 534288406
$$ packed form
2753.5F90538347p87497o37114n22256n80191o99163o59585n28455n68807p56562q58426
2773.9F83940291q19444q05438r36329j071692j053095j002073j093507j275658j370788
2792.2F74512267j324296j311779j499355j722097j737952j664698j754165j960099
2808.6F61537826k040684j972377j947582k080560k269864k313435k269089k342105
2824.9F44302130k516806k629400k613187k624452k805531l039181l179073l273666
2841.2F21620834l475487l808141m066885m057645l780783l376126k997339k717972
2857.5E93340456k619504k862692l400982l941893m357219m702926m974603n124271
2873.8E61356366n093634m818857m376054l862739l236055k506435j830518j343668
$$ plain form
2890.1 534288406 533274293 532535076 531970739 531364083 530572832 529617548 528495729 527106762 525372982
2908.5 525372982 523213267 520554602 517442346 513986230 510345578 506778181 503581226 500976324
2924.8 500976324 499106407 498044312 497857183 498700827 500670671 503664613 507461667 511882961 516778767
2943.2 516778767 521917701 527098477 532333910 537690938 543080568 548376083 553572714 558767080
2959.5 558767080 563913226 568777561 573230803 577355444 581303895 585169494 588949680 592606723
2975.8 592606723 596187592 599704444 602977931 605887234 608524323 610978067 613238335 615206063
2992.1 615206063 616803467 618119836 619198442 619947731 620321095 620344460 620102227 619691432 619103909
3010.5 619103909 618210614 616982579 615540802 613925517 612118483 610176444 608155489 606029212
$$ packed form
2890.1E34288406j014113p39217n64337o06656p91251r55284j121819j388967j733780
2908.5E25372982k159715k658665l112256l456116l640652l567397l196955k604902
2924.8E00976324j869917j062095j87129Q43644J969844K993942L797054M421294M895806
2943.2E16778767N138934N180776N235433N357028N389630N295515N196631N194366
2959.5E58767080N146146M864335M453242M124641L948451L865599L780186L657043
2975.8E92606723L580869L516852L273487K909303K637089K453744K260268J967728
2992.1F15206063J597404J316369J078606P49289L73364K3365k42233m10795n87523
3010.5F19103909q93295j228035j441777j615285j807034j942039k020955k126277
$$ plain form
3026.8 606029212 603797734 601525903 599223256 596845984 594392300 591921926 589443445 586890459
3043.1 586890459 584223032 581458986 578712165 576030195 573308408 570511162 567659140 564813316
3059.4 564813316 562091053 559487104 556872189 554133356 551278353 548437476 545719385 543143511
3075.7 543143511 540615380 537986159 535261989 532524645 529760301 527011156 524337351 521647036
3092.1 521647036 518892825 516210198 513704777 511234224 508624434 505981386 503464520 501010537
3108.4 501010537 498531669 496135294 493840933 491515011 489150643 486693293 484083265 481497765
3124.7 481497765 479100496 476827919 474527717 472175986 469899178 467775315 465679228 463445932
3141 463445932 461135000 458906680 456817895 454867959 452966392 450950176 448813170 446707994 444675177
$$ packed form
3026.8F06029212k231478k271831k302647k377272k453684k470374k478481k552986
3043.1E86890459k667427k764046k746821k681970k721787k797246k852022k845824
3059.4E64813316k722263k603949k614915k738833k855003k840877k718091k575874
3075.7E43143511k528131k629221k724170k737344k764344k749145k673805k690315
3092.1E21647036k754211k682627k505421k470553k609790k643048k516866k453983
3108.4E01010537k478868k396375k294361k325922k364368k457350k610028k585500
3124.7D81497765k397269k272577k300202k351731k276808k123863k096087k233296
3141D63445932k310932k228320k088785j949936j901567k016216k137006k105176k032817
$$ plain form
3159.4 444675177 442682445 440742671 438853592 437017500 435215592 433417261 431638628 429904252
3175.7 429904252 428204179 426520258 424843490 423178703 421556592 419992745 418456644 416915298
3192 416915298 415365636 413806081 412263513 410796255 409425557 408116311 406812251 405474067 404137880
3210.3 404137880 402860135 401602685 400341868 399108917 397907108 396724582 395552605 394417524
3226.7 394417524 393374771 392445445 391532838 390455306 389226466 388047993 387004733 386094928 385280252
3245 385280252 384407401 383412153 382440090 381588399 380754173 379861265 379001558 378218383 377450705 376705289
3265.4 376705289 376080394 375566095 374943435 374125570 373277962 372512221 371814758 371121734 370407701 369742334
3285.8 369742334 369177192 368691057 368165284 367494553 366728187 365911484 365115196 364521205 364117146 363622934
$$ packed form
3159.4D44675177j992732j939774j889079j836092j801908j798331j778633j734376
3175.7D29904252j700073j683921j676768j664787j622111j563847j536101j541346
3192D16915298j549662j559555j542568j467258j370698j309246j304060j338184j336187
3210.3D04137880j277745j257450j260817j232951j201809j182526j171977j135081
3226.7C94417524j042753r29326r12607j077532j228840j178473j043260r09805q14676
3245C85280252q72851r95248r72063q51691q34226q92908q59707p83175p67678p45416
3265.4C76705289o24895n14299o22660q17865q47608p65741o97463o93024p14033o65367
3285.8C69742334n65142m86135n25773o70731p66366q16703p96288n93991m04059m94212
$$ plain form
3306.2 363622934 362852156 361866027 360855609 359959126 359148294 358343869 357537299 356786281 356070846
3324.6 356070846 355229735 354233086 353271663 352450073 351719320 351014614 350208998 349253148 348277718 347314805
3345 347314805 346386701 345589906 344766468 343749374 342679262 341720104 340878099 340045214 339175761 338412315
3365.4 338412315 337715209 336797059 335631371 334514260 333638579 332919002 332205176 331420124 330630511
3383.7 330630511 329972148 329570591 329407990 329088062 328362197 327667415 327453077 327416748 326974213 326160133
3404.1 326160133 325500309 325172454 324975550 324749053 324396551 324010402 323765695 323592931 323431909 323400915
3424.5 323400915 323520780 323669851 323766649 323971927 324336767 324525476 324388295 324232996 324365377 324746013
3444.9 324746013 325110495 325354338 325663477 326127917 326660842 327277690 327999711 328648418 329260349 330095768
$$ packed form
3306.2C63622934p70778r86129j010418q96483q10832q04425q06570p51018p15435
3324.6C56070846q41111r96649r61423q21590p30753p04706q05616r55850r75430r62913
3345C47314805r28104p96795q23438j017094j070112r59158q42005q32885q69453p63446
3365.4C38412315o97106r18150j165688j117111q75681p19577p13826p85052p89613
3383.7C30630511o58363m01557j62601l19928p25865o94782k14338l6329m42535q14080
3404.1C26160133o59824l27855j96904k26497l52502l86149k44707j72764j61022l0994
3424.5C23400915J19865J49071R6798K05278L64840J88709j37181j55299J32381L80636
3444.9C24746013L64482K43843L09139M64440N32925O16848P22021O48707O11931Q35419
$$ plain form
3465.3 330095768 331024617 331651151 331961274 332340986 332965434 333823085 334734917 335371882 335893422 336615860
3485.7 336615860 337388277 338119626 338948727 339829743 340685010 341539741 342477828 343455911 344239324 344865203
3506.1 344865203 345607966 346548945 347629607 348668247 349547684 350461781 351586282 352847338 353951186
3524.4 353951186 354804069 355648071 356642216 357826799 359194875 360482603 361564368 362837583 364429563
3542.8 364429563 365928203 367026538 368023068 369239241 370613933 372070014 373616010 375303775
3559.1 375303775 377109140 378878534 380612463 382565677 384705722 386784852 388870835 391127914
3575.4 391127914 393526286 396103680 398942411 401881605 404651135 407202363 409886986 412752241
3591.7 412752241 415674746 418748379 422030181 425343454 428593963 431839824 435060501 438381970
$$ packed form
3465.3C30095768R28849O26534L10123L79712O24448Q57651R11832O36965N21540P22438
3485.7C36615860P72417P31349Q29101Q81016Q55267Q54731R38087R78083P83413O25879
3506.1C44865203P42763R40979J080662J038640Q79437R14097J124501J261056J103848
3524.4C53951186Q52883Q44002R94145J184583J368076J287728J081765J273215J591980
3542.8C64429563J498640J098335R96530J216173J374692J456081J545996J687765
3559.1C75303775J805365J769394J733929J953214K140045K079130K085983K257079
3575.4C91127914K398372K577394K838731K939194K769530K551228K684623K865255
3591.7D12752241K922505L073633L281802L313273L250509L245861L220677L321469
$$ plain form
3608.1 438381970 441870213 445397228 448982954 452556521 456102520 459827125 463508934 467007339
3624.4 467007339 470369160 473735541 477458179 481240720 484891236 488487542 492042810 495583564
3640.7 495583564 499201536 502890646 506572664 510270417 513886929 517263055 520548940 524092376
3657 524092376 527721286 531004250 534060597 537277222 540528715 543530166 546600997 549621999 552176058
3675.4 552176058 554693520 557420969 560197055 563091338 566099524 568927586 571124494 573064327
3691.7 573064327 575262904 577536821 579691589 581644773 583454251 585392773 587471962 589443028
3708 589443028 591064274 592424512 594072342 595897436 597599745 599171579 600674748 602068841 603351176
3726.4 603351176 604838133 606564164 608236611 609525800 610535800 611823797 613328040 614341795
$$ packed form
3608.1D38381970L488243L527015L585726L573567L545999L724605L681809L498405
3624.4D67007339L361821L366381L722638L782541L650516L596306L555268L540754
3640.7D95583564L617972L689110L682018L697753L616512L376126L285885L543436
3657E24092376L628910L282964L056347L216625L251493L001451L070831L021002K554059
3675.4E52176058K517462K727449K776086K894283L008186K828062K196908J939833
3691.7E73064327K198577K273917K154768J953184J809478J938522K079189J971066
3708E89443028J621246J360238J647830J825094J702309J571834J503169J394093J282335
3726.4F03351176J486957J726031J672447J289189J010000J287997J504243J013755
$$ plain form
3742.7 614341795 614879310 616073012 617436647 618198216 619050503 620379150 621659577 622628927 623578548
3761 623578548 624673069 625734389 626739681 627657592 628511906 629494250 630633175 631776154 632674694
3779.4 632674694 633433938 634231687 635036051 635896683 636773467 637640297 638534665 639416814 640356123 641124308
3799.8 641124308 641584635 642320037 643067002 643573046 644375503 645496130 646404386 646951318 647683382
3818.1 647683382 648323119 648719609 649401367 650195003 650963545 651713908 652500689 653414845 654066443 654268324
3838.5 654268324 654577792 655103028 655711830 656515121 657469690 658139646 657918632 657743931 658596277 659576118
3858.9 659576118 660247207 660647690 661090672 661708474 662109196 662399530 662847519 663426876 664123893 664580703
3879.3 664580703 664937973 665502548 665879428 666194499 666596293 666821420 667124748 667716265 668296158 668656111
$$ packed form
3742.7F14341795N37515J193702J363635P61569Q52287J328647J280427R69350R49621
3761F23578548J094521J061320J005292R17911Q54314R82344J138925J142979Q98540
3779.4F32674694P59244P97749Q04364Q60632Q76784Q66830Q94368Q82149R39309P68185
3799.8F41124308M60327P35402P46965N06044Q02457J120627R08256N46932P32064
3818.1F47683382O39737L96490O81758P93636P68542P50363P86781R14156O51598K01881
3838.5F54268324L09468N25236O08802Q03291R54569O69956k21014j74701Q52346R79841
3858.9F59576118O71089M00483M42982O17802M00722K90334M47989N79357O97017M56810
3879.3F64580703L57270N64575L76880L15071M01794K25127L03328N91517N79893L59953
$$ plain form
3899.7 668656111 668901443 669077814 669247925 669545233 669919133 670362651 670849204 671177626 671301126 671459377
3920.1 671459377 671706378 671879292 672092378 672476351 672804117 672996759 673184752 673381686 673612118 673853397
3940.5 673853397 674024999 674251020 674625278 675009489 675296962 675481081 675637066 675848484 676058650 676216245
3960.9 676216245 676403642 676638007 676866114 677068710 677243292 677430034 677672565 677928865 678118587 678304672
3981.3 678304672 678518891 678676486 678811014 678971410 679134429 679322481 679538786 679707468
3997.6 679707468
$$ packed form
3899.7F68656111K45332J76371J70111K97308L73900M43518M86553L28422J23500J58251
3920.1F71459377K47001J72914K13086L83973L27766J92642J87993J96934K30432K41279
3940.5F73853397J71602K26021L74258L84211K87473J84119J55985K11418K10166J57595
3960.9F76216245J87397K34365K28107K02596J74582J86742K42531K56300J89722J86085
3981.3F78304672K14219J57595J34528J60396J63019J88052K16305J68682
3997.6F79707468
##END=$$ End of the data block
