##TITLE=$$ Begin of the data block
##JCAMP-DX=5.00 $$ ACD/SpecManager v 10.08
##SPECTROMETER/DATA SYSTEM=Alpha
##DATE=22 Dec 2014 10:36:42
##DATA TYPE=INFRARED SPECTRUM
##DATA CLASS=XYDATA
##ORIGIN=
##OWNER=
##NPOINTS=1765
##FIRSTX=399.76428223
##LASTX=3997.64306641
##MAXX=3997.64306641
##MINX=399.76428223
##MAXY=0.82691103
##MINY=0.25383523
##XFACTOR=1.0000000000
##YFACTOR=1.000000000000000e-9
##FIRSTY=0.51579231
##DELTAX=2.03961372
##XUNITS=1/CM
##YUNITS=ARBITRARY UNITS
##XYDATA=(X++(Y..Y))
399.8E15792310m945099k399027j389504r78351R04680K829671K816736J775325N37872
418.1E14944613j386404k351642k485096k891839k709150k109766k291411k793968
434.4D95925337j861930Q91596L271461L838002L928483M342556L953218K636910J093388
452.8E18019021P2598k72214r33409k051294k911329k816499k367079k816379l668427
471.2E00254989l530354k191424j475543j839012j494229j907P73281Q1807p51435
489.5D89826173p80613m91082j037807k122104k353817j821905j890302k872974l572494
507.9D72883075l191590k747476l345787m336507m439652l586441k673507j996815
524.2D46565300j224667j6093J098335J530945K070666L728121N693376O064266M577100
$$ plain form
399.8 515792310 510847211 508448184 507058680 506080329 506985009 509814680 512631416 514406741 514944613
418.1 514944613 513558209 511206567 508721471 505829632 503120482 501010716 498719305 495925337
434.4 495925337 494063407 494955003 498226464 502064466 505992949 510335505 514288723 516925633 518019021
452.8 518019021 518091619 517819405 516885996 514834702 511923373 509106874 506739795 503923416 500254989
471.2 500254989 496724635 494533211 493057668 491218656 489724427 489722520 490495801 490577608 489826173
489.5 489826173 489045560 488554478 487516671 485394567 483040750 481218845 479328543 476455569 472883075
507.9 472883075 469691485 466944009 463598222 459261715 454822063 451235622 448562115 446565300
524.2 446565300 445340633 445324540 446422875 447953820 450024486 453752607 459445983 465510249 470087349
542.5D70087349K931863J973898Q67337q25256k207846k562851k654343l380537m503459
560.9D59726155n378992n731523n999297o198555n306035k854466Q1181K260000L770381
579.3D34368849N370021P037878P634520O445945M392623L019214K360553J313805
595.6D71943408K8968m68045j69874J17571J0430n8084O24776J671612K072602J978398
616D77751762K388447L482074M279345M054546L396899L350288L556430L001988J830935
634.3E07092714J270056J761258K053916J313389O21914J035750J786411J582682P70569
652.7E19288659O85930J425624J722157R73761L45111P57754J878262K038598O72400
671E29788256Q93414K038657K324462J476109Q21889J304805J828671J120448j16766
$$ plain form
542.5 470087349 473019212 474993110 475860447 475035191 472827345 470264494 467610151 464229614 459726155
560.9 459726155 454347163 448615640 442616343 436417788 431111753 428257287 428338468 430598468 434368849
579.3 434368849 439738870 446776748 454411268 460857213 465249836 468269050 470629603 471943408
595.6 471943408 471972376 471504331 471334457 471452028 471462458 471404374 472029150 473700762 475773364 477751762
616 477751762 480140209 483622283 487901628 491956174 495353073 498703361 502259791 505261779 507092714
634.3 507092714 508362770 510124028 512177944 513491333 514113247 515148997 516935408 518518090 519288659
652.7 519288659 519974589 521400213 523122370 524096131 524441242 525198996 527077258 529115856 529788256
671 529788256 530681670 532720327 535044789 536520898 537342787 538647592 540476263 541596711 541479945
689.4E41479945n41627k91646p49230k372027l636419l286541k309084k019405j801253
707.7E24472713l37898J989662L427208L625631M049182N460620O623745O329656N422473
726.1E61062992N244195N627275N149781L467501K191364K270818K294540P86066j392066
744.5E86702466k504587k647758l432333n024433n786538n004764l935754l666938
760.8E54699361l364086j608133J321971L699780M907667O109953Q078575R601653
777.1E83446741R165526P553279O755769O837368O089211M281699L232658L872454
793.4F31234705M723847M354239L665447M031181M696250L922105J948953Q20100J313150
811.8F60709977J679778N90503o33716n07057K2471q47995k924919m223168m159987
$$ plain form
689.4 541479945 540938318 540646672 539897442 537525415 533888996 530602455 528293371 526273966 524472713
707.7 524472713 524134815 526124477 529551685 533177316 537226498 542687118 549310863 555640519 561062992
726.1 561062992 566307187 571934462 577084243 580551744 582743108 585013926 587308466 588094532 586702466
744.5 586702466 584197879 581550121 578117788 573093355 567306817 562302053 558366299 554699361
760.8 554699361 551335275 549727142 551049113 554748893 559656560 565766513 573845088 583446741
777.1 583446741 592612267 600165546 606921315 613758683 619847894 624129593 627362251 631234705
793.4 631234705 635958552 640312791 643978238 648009419 652705669 656627774 658576727 659396827 660709977
811.8 660709977 662389755 662980258 662346542 661839485 661861956 661013961 658089042 653865874 649705887
830.1F49705887m403234n744993o738603o080926m734635m413665m919469m719734
846.4F07950628l690839l330350m279435n349099n263984l971994j669407J825392
862.8E82220912O150365J0043383J2182712J2149513J0633707Q619487O124556K494514
879.1F50619149j619935m441321n604267o382227p404327p768750o840825n656600
895.4F04900897n450190n947411o158769o059885o615996q138359r598195j0130585
911.7E46801507j0141372j0282696j0073482q488358n728721l175169j655102p00444
928D96556163M90725J810312K592147K933979L527164M341245M204333K014637j839996
946.4E16630709o016135r705842j2782394j5006066j6063630j6346157j6657501j7182142
$$ plain form
830.1 649705887 645302653 639557660 632819057 626738131 622003496 617589831 612670362 607950628
846.4 607950628 604259789 600929439 596650004 591300905 586036921 582064927 580395520 582220912
862.8 582220912 588371277 598414660 610597372 622746885 633380592 642000079 648124635 650619149
879.1 650619149 648999214 644557893 638953626 632571399 625167072 617398322 610557497 604900897
895.4 604900897 599450707 593503296 587344527 581284642 574668646 566530287 556932092 546801507
911.7 546801507 536660135 526377439 516303957 507815599 502086878 498911709 497256607 496556163
928 496556163 497046888 498857200 501449347 504383326 507910490 512251735 516456068 518470705 516630709
946.4 516630709 510614574 500908732 488126338 473120272 457056642 440710485 424052984 406870842
962.7D06870842j7489642j7383903j7137319j6940475j6585260j5679211j4056772
977B91598260j2001395r799391p418245m903912k642423r97663J10596R25452J535863
995.3B56407142J880824J919896J744061J477927J152248O87569J39952j70678K116
1013.7B65241057M92394R97752J425534J914620K488286K900600L043562L038913K948732
1032B84491450K657175K041936J255869P05928N50002O00427P21067J068682J878232
1050.4B95970768L071785M268497N191207O026685P074177Q185178Q581460P090926
1066.7C45460683K902597l036856p759422q819044o635487l404677o78986J191228
1083C19220036K436340L362954M121780M677981M926086M798472M198491L094405J776695
$$ plain form
962.7 406870842 389381200 371997297 354859978 337919503 321334243 305655032 291598260
977 291598260 279596865 269797474 262379229 257475317 254832894 253835231 253945827 254871279 256407142
995.3 256407142 258287966 260207862 261951923 263429850 264582098 265269667 265409619 265238941 265241057
1013.7 265241057 265733451 266731203 268156737 270071357 272559643 275460243 278503805 281542718 284491450
1032 284491450 287148625 289190561 290446430 291152358 291702360 292302787 293023854 294092536 295970768
1050.4 295970768 299042553 303311050 308502257 314528942 321603119 329788297 338369757 345460683
1066.7 345460683 348363280 345326424 337567002 328747958 322112471 318707794 318028808 319220036
1083 319220036 321656376 325019330 329141110 333819091 338745177 343543649 347742140 350836545 352613240
1101.4C52613240Q34913P35670J452386K440214L177882L560394L615260L269613K576440
1119.8C74276012J902193J655459K019912K833009L716320M178464L694922K039313
1136.1C96315604n32597l302336n426496o519437o774604o478906n709171m518658
1152.4C57053399l187686k026826j011938Q8394J396030K855062M373908N936742P577449
1170.7C73054534R126723J0294944J1029184J1524379J1914373J2053072J1718690
1185D50715899J0881901R704143Q286566O597846M823625L437102K679497K376288
1201.3D99502867K275259K363801K822101L616094M405618M900575N082071M997730
1217.7E29966116M491329L398955J978040P51853p9274p05958j235306j506448j422048
$$ plain form
1101.4 352613240 353448153 354183823 355636209 358076423 361254305 364814699 368429959 371699572 374276012
1119.8 374276012 376178205 377833664 379853576 382686585 386402905 390581369 394276291 396315604
1136.1 396315604 395783007 392480671 387054175 380534738 373760134 367281228 361572057 357053399
1152.4 357053399 353865713 351838887 350826949 350915343 352311373 355166435 359540343 365477085 373054534
1170.7 373054534 382181257 392476201 403505385 415029764 426944137 438997209 450715899
1185 450715899 461597800 471301943 479588509 486186355 491009980 494447082 497126579 499502867
1201.3 499502867 501778126 504141927 506964028 510580122 514985740 519886315 524968386 529966116
1217.7 529966116 534457445 537856400 539834440 540586293 540507019 539801061 538565755 537059307 535637259
1236E35637259j214027j084566q24571j94430O78539J431823J811385J913726J960218
1254.4E40115356J905919J590490J131952R52482J299024J871943K240479K292216
1270.7E53399861K096653J637161R02652J10686l67522m21941l96312n87165q32319
1289E55541754r09329j004338j340270j751363j909733j795709j699627j795947j897931
1307.4E41437507j661659j216769r99033j002372j037895j170457j596093k477765
1323.7E30275464l652215m613399n047799n016446m592180l730178k577066j520038
1340D99526143p57247j92285K28942L49670P8857l22789o26415q05109q96514j044810
1360.4D95538443j281708j234532q68111n67854k48611K38866O40243O87271N78881
$$ plain form
1236 535637259 534423232 533338666 532514095 532319665 532998204 534430027 536241412 538155138 540115356
1254.4 540115356 542021275 543611765 544743717 545696199 546995223 548867166 551107645 553399861
1270.7 553399861 555496514 557133675 558036327 558147013 557779491 557357550 556961238 556374073 555541754
1289 555541754 554632425 553628087 552287817 550536454 548626721 546831012 545131385 543335438 541437507
1307.4 541437507 539775848 538559079 537560046 536557674 535519779 534349322 532753229 530275464
1323.7 530275464 526623249 522009850 516962051 511945605 507353425 503623247 501046181 499526143
1340 499526143 498768896 498576611 498805553 499155223 499234080 498911291 498284876 497479767 496583253 495538443
1360.4 495538443 494256735 493022203 492154092 491586238 491337627 491576493 492216736 492904007 493482888
1378.8D93482888N73992J070589K315760L780812M123688L272891K397179J376272
1395.1E12394071J31726q25524j193285j240552j547754j841902j857222j816570j655400
1413.5E00547588j302451j082480j039803n88924l0458K98709O61582J006067J169800
1431.8D99639630J314640J565457J635134J485884J486123J337170R41456K95877m16398
1450.2E09284973q46028j026571j662254k336324j161694K38895J451969K651453L786028
1468.5E10380447N604088Q409977R252608Q193016P558346P331610P133901O646514
1484.9E70510507O544351O622911N923092M703879M553140N006849M444659L606618
1501.2F11916006L350317L887057M362464K882362K131164K397358K683342K715230
$$ plain form
1378.8 493482888 494056880 495127469 497443229 501224041 505347729 508620620 511017799 512394071
1395.1 512394071 512525797 511700273 510506988 509266436 507718682 505876780 504019558 502202988 500547588
1413.5 500547588 499245137 498162657 497122854 496533930 496503472 496802181 497463763 498469830 499639630
1431.8 499639630 500954270 502519727 504154861 505640745 507126868 508464038 509405494 509701371 509284973
1450.2 509284973 508438945 507412374 505750120 503413796 502252102 502490997 503942966 506594419 510380447
1468.5 510380447 515984535 524394512 533647120 541840136 549398482 556730092 563863993 570510507
1484.9 570510507 577054858 583677769 589600861 594304740 598857880 603864729 608309388 611916006
1501.2 611916006 615266323 619153380 623515844 626398206 628529370 630926728 633610070 636325300
1517.5F36325300K472639K380252K033353J692235J579106J476347J651705J669109
1533.8F51280046J404047J512229J605570O74010J06394R3639K30253L63826M00067
1552.2F57670081M93288O13749J16527j274586r45985m73559l55184l51310o22511
1570.5F54870510n16415l56912q73387j091838q28445r43482j158118j296222j442969
1588.9F46362722j695871j972974k234161k385616k460003k692401k982199l065348
1605.2F26874149l084064l417730l670633l446400l652513m475951l714264l007471
1621.5E98405123l562093l659785l476083l370047k449572j517117j634419j693368
1637.8E77042639r96768k82943M38988R69529J030743J115382J888931K520918J932741
$$ plain form
1517.5 636325300 638797939 641178191 643211544 644903779 646482885 647959232 649610937 651280046
1533.8 651280046 652684093 654196322 655801892 656475902 656582296 656675935 656906188 657270014 657670081
1552.2 657670081 658163369 658777118 658893645 657619059 656673074 656199515 655844331 655493021 654870510
1570.5 654870510 654354095 653997183 653123796 652031958 651203513 650260031 649101913 647805691 646362722
1588.9 646362722 644666851 642693877 640459716 638074100 635614097 632921696 629939497 626874149
1605.2 626874149 623790085 620372355 616701722 613255322 609602809 605126858 601412594 598405123
1621.5 598405123 594843030 591183245 587707162 584337115 581887543 580370426 578736007 577042639
1637.8 577042639 576045871 575762928 576201916 577171445 578202188 579317570 581206501 583727419 585660160
1656.2E85660160K101838K948165L822982L992737L679275M197836M852474M460454
1672.5F15715921M658282M998147M643560M706084N441726O180346M869997M151642
1688.8F55365705M465461M215718M342258M400312L879488L564537K625823K143800
1705.1F85003102K092182J919508J929880K028286K102792J831413R87231O89030J071036
1723.5F99654460J698852K170324K346098K255619K310097K143443J854777J961410
1739.8G16395080K061665K294779K677083K881646K901793K859831K855718K983331
1756.1G37910926K805293K443135K449751K283752K003371J884044J882195J828015
1772.4G55490482J390934J018941J056969J273871J323640J127780R58800J145721
$$ plain form
1656.2 585660160 587761998 590710163 594533145 598525882 602205157 606402993 611255467 615715921
1672.5 615715921 620374203 625372350 630015910 634721994 640163720 646344066 651214063 655365705
1688.8 655365705 659831166 664046884 668389142 672789454 676668942 680233479 682859302 685003102
1705.1 685003102 687095284 689014792 690944672 692972958 695075750 696907163 697894394 698583424 699654460
1723.5 699654460 701353312 703523636 705869734 708125353 710435450 712578893 714433670 716395080
1739.8 716395080 718456745 720751524 723428607 726310253 729212046 732071877 734927595 737910926
1756.1 737910926 740716219 743159354 745609105 747892857 749896228 751780272 753662467 755490482
1772.4 755490482 756881416 757900357 758957326 760231197 761554837 762682617 763641417 764787138
1788.8G64787138J466870J320600P70331O83903J012326J188457R29832O98090Q56161
1807.1G73713708J096189J000166O60956N86748P90238R43482Q64446O92547O85096
1825.5G81033576Q67903Q18610L78191K38300N00440O69957N59687M35233M19081M26828
1845.9G86347806L44336J35541Q7977L30627N06997L39627J12474K02060N33342O43194
1866.3G89583981K68459p7009J63019M67121L71159J75356K84374N76377O09577L95357
1886.7G92817771K83599L62158M67658L51489J03175J31965L92616L99947J38223L7015
1907.1G95485616K14994L22222J75417P2420J72555L13699K78354O3121k3663J98305
1927.5G97273040L39389J73688N185Q2851K89082L24488J29342K4199K20240L26752
$$ plain form
1788.8 764787138 766254008 767574608 768344939 769028842 770041168 771229625 772159457 772857547 773713708
1807.1 773713708 774809897 775810063 776471019 777057767 777848005 778791487 779655933 780348480 781033576
1825.5 781033576 781901479 782720089 783098280 783336580 783837020 784506977 785066664 785501897 785920978 786347806
1845.9 786347806 786692142 786827683 786915660 787246287 787753284 788092911 788205385 788407445 788940787 789583981
1866.3 789583981 789852440 789775431 789938450 790405571 790776730 790952086 791236460 791812837 792422414 792817771
1886.7 792817771 793101370 793463528 793931186 794282675 794385850 794517815 794910431 795310378 795448601 795485616
1907.1 795485616 795700610 796022832 796198249 796270669 796443224 796756923 797035277 797098398 797074735 797273040
1927.5 797273040 797612429 797786117 797791302 797874153 798163235 798487723 798617065 798641264 798861504 799188256
1947.9G99188256J50621M2081K17736M38273L72112J24216P2539L00824M24981K03014
1968.3H01534653k3067Q9943L20792K80321M5538J0073K18511K91764J08839k7121
1988.7H02850246P5162J83582R5248o6936j06573N5373J63317q703k33888j94550m0471
2011.1H02771807r9600l39031m77731m26769m45128o68406p17879k70486R9779j10269
2031.5G99316287m60148m87149k87592k12252l60131m64380l18349j11222j11461k34246
2051.9G96269357j78396M8577J22667o140n3763R6858K12192J03533o0498j2279J79529
2074.3G96721637J94013j7225j08421O9737K23637J49131N841M2438K37108K99930
2094.7G97817826J28985L2723J86443L30329K38180O4135Q6605K41280K43842Q4699
$$ plain form
1947.9 799188256 799338877 799380958 799598694 800036967 800409079 800533295 800605834 800906658 801331639 801534653
1968.3 801534653 801511586 801601529 801922321 802202642 802248180 802258253 802476764 802768528 802877367 802850246
1988.7 802850246 802925408 803108990 803204238 803137302 803030729 803086102 803249419 803240716 803006828 802812278 802771807
2011.1 802771807 802672207 802333176 801855445 801428676 800983548 800315142 799597263 799326777 799426556 799316287
2031.5 799316287 798856139 798368990 798081398 797869146 797509015 797044635 796726286 796615064 796503603 796269357
2051.9 796269357 796090961 796139538 796262205 796256065 796202302 796299160 796511352 796614885 796554387 796542108 796721637
2074.3 796721637 796915650 796898425 796790004 796859741 797083378 797232509 797238350 797280788 797517896 797817826
2094.7 797817826 797946811 797979534 798165977 798496306 798734486 798798621 798885226 799126506 799370348 799455047
2115.1G99455047J2576R1911J49667O3002n0068j788J30892J23560j5914n9545N4180
2137.5G99953520J46270R1910j0311j3232Q1896J28389L9398J6869J66475K83182K66254
2160H01150620K43425L08991L71516L47375L61920M87029N97060O23584N46455M38512
2180.4H05476487M46140N28276N32210M41373L85105M18067M60685M46617L86954L82602
2200.8H09904516M65154M84109M07458L65197M29809N06759M47393L39329L45886M33325
2221.2H14128935M73857L83497K47657K56419L41892L19720K52544K42353K60889K68221
2241.6H17175984K51651K10643K01941K35199K40744K17616K17140K53677L03865K88248
2262H19596708J79350J46270K30014K79129K35796J65999J70648K23756K17616J71125
$$ plain form
2115.1 799455047 799467623 799559534 799709201 799772203 799722135 799720347 799851239 799974799 799958885 799899340 799953520
2137.5 799953520 800099790 800191700 800181389 800168157 800250053 800378442 800417840 800434709 800601184 800884366 801150620
2160 801150620 801394045 801703036 802074552 802421927 802783847 803270876 803867936 804491520 805037975 805476487
2180.4 805476487 805922627 806450903 806983113 807424486 807809591 808227658 808688343 809134960 809521914 809904516
2200.8 809904516 810369670 810853779 811261237 811626434 812056243 812563002 813010395 813349724 813695610 814128935
2221.2 814128935 814602792 814986289 815233946 815490365 815832257 816151977 816404521 816646874 816907763 817175984
2241.6 817175984 817427635 817638278 817840219 818075418 818316162 818533778 818750918 819004595 819308460 819596708
2262 819596708 819776058 819922328 820152342 820431471 820667267 820833266 821003914 821227670 821445286 821616411
2282.3H21616411J85788K55406K81572K26379J72495J72675K05040K41339K02060J48177
2302.7H23707342K20657L10838K71618K18332K52843K97189L13937K99394K88845L03030
2323.1H26484025K69353J44124k9683j13368q1361j19864k06411j89245j06931j49727
2343.5H25900912n03838o61969k14338M59909Q47042P16746L66568m530k96592m72486
2363.9H26137424o57976q08120p82192p43389q22902q55922p22349n30541m53710m80473
2384.3H19279850m38691k82883j74523j96159k61664k62260j83165j80185l20673l97146
2404.7H16582501l11554k70247l83973n03421m93050m07815Tn39243o29425n43237
2425.1H12092721m27067m96149o73294o61910n08606n31673o84739p15971o20722n55754
$$ plain form
2282.3 821616411 821802199 822057605 822339177 822565556 822738051 822910726 823115766 823357105 823559165 823707342
2302.7 823707342 823927999 824238837 824510455 824728787 824981630 825278819 825592756 825892150 826180995 826484025
2323.1 826484025 826753378 826897502 826867819 826754451 826673090 826553226 826346815 826157570 826050639 825900912
2343.5 825900912 825397074 824735105 824520767 824980676 825827718 826544464 826911032 826906502 826609910 826137424
2363.9 826137424 825479448 824671328 823889136 823145747 822322845 821466923 820744574 820214033 819760323 819279850
2384.3 819279850 818841159 818558276 818383753 818187594 817925930 817663670 817480505 817300320 816979647 816582501
2404.7 816582501 816270947 816000700 815616727 815113306 814620256 814212441 813804626 813265383 812635958 812092721
2425.1 812092721 811665654 811169505 810496211 809834301 809325695 808794022 808109283 807393312 806772590 806216836
2445.5H06216836o09994p09355o83248n50270n13911o14822o81341n92112m70877n19872
2465.9H00271034o82294o76870m78089l99769n32806o24477n40734m31776m53710n46098
2486.3G94904411n40137l97385k90989l82305m96030l66509j73270k46048m61340m60684
2506.7G91089714k72096k01225l05355m39524m49181l31998l37004n02348n71311m81426
2527.1G87198246m51923o04153p36236o65546n31911n55099p24196q13961o81639n22315
2547.5G80911267o08802q07405p78675n80191n59032p42853q12232o40452m71652n54085
2567.9G74355888p38501o91116n03361n13733o92129p44581o03795m72844n18024o40988
2588.3G68236816n96941m05728l48926m98235n79000m49419l37124m48882o60598o99282
$$ plain form
2445.5 806216836 805606842 804897487 804214239 803663969 803150058 802535236 801853895 801261783 800790906 800271034
2465.9 800271034 799588740 798911870 798433781 798034012 797501206 796876729 796335995 795904219 795450509 794904411
2486.3 794904411 794364274 793966889 793675900 793293595 792797565 792431056 792257786 792011738 791550398 791089714
2506.7 791089714 790817618 790616393 790311038 789871514 789422333 789090335 788753331 788250983 787679672 787198246
2527.1 787198246 786746323 786142170 785405934 784740388 784208477 783653378 782929182 782115221 781433582 780911267
2547.5 780911267 780302465 779495060 778716385 778136194 777577162 776834309 776022077 775381625 774909973 774355888
2567.9 774355888 773617387 772926271 772422910 771909177 771217048 770472467 769868672 769395828 768877804 768236816
2588.3 768236816 767639875 767234147 766885221 766386986 765807986 765358567 765021443 764572561 763911963 763212681
2608.7G63212681n77450n89430q20995r86576q91924p72357r04381j154542j205563
2627G55309463j050055j002312j202047j372814j287580j124143j142323j284361j274169
2645.4G44569659j118362j099705j258612j336217j188517j030326j101732j269281
2661.7G35166907j217305r83835r46939j140713j203716j029730q52048q68678j014829
2680.1G25909114j016438q29339p69377r53972j092136r88662q53956r59516j164674
2698.4G17281044j154542j009942j030206j202882j277446j172841j026750j023590
2714.7G08382845j149774j156807r91881q95142r90033j078725r51350p40290p23898
2733.1F99704945q63790q83699p45475o79255p93457q99434p99060o09278o23107p74861
$$ plain form
2608.7 763212681 762635231 762045801 761224806 760238230 759346306 758573949 757669568 756515026 755309463
2627 755309463 754259408 753257096 752055049 750682235 749394655 748270512 747128189 745843828 744569659
2645.4 744569659 743451297 742351592 741092980 739756763 738568246 737537920 736436188 735166907
2661.7 735166907 733949602 732965767 732018828 730878115 729674399 728644669 727792621 726923943 725909114
2680.1 725909114 724892676 724063337 723293960 722339988 721247852 720259190 719405234 718445718 717281044
2698.4 717281044 716126502 715116560 714086354 712883472 711606026 710433185 709406435 708382845
2714.7 708382845 707233071 706076264 705084383 704189241 703199208 702120483 701169133 700428843 699704945
2733.1 699704945 698841155 697957456 697211981 696532726 695739269 694839835 694040775 693431497 692808390 692033529
2753.5F92033529p54237o03795n36442o00755o94334o67215n61058n80252p52210q71539
2773.9F85411692q26240p91907r36568j094222j073420r96292j053869j247764j393616
2792.2F75997794j369179j353502j505077j677096j695990j646102j743018j970888
2808.6F63036942k056658j972496j988709k154649k276957k270102k261639k362132
2824.9F45693600k503991k599120k622068k639830k792299l036976l201842l287613
2841.2F23009861l477514l831446m091263m049182l760696l368675l018260k771438
2857.5E94641387k681314k890826l402889l974556m409612m706442m950166n132913
2873.8E62492669n127192m861951m398882l838122l213883k556562j916528j380980
$$ plain form
2753.5 692033529 691279292 690675497 690139055 689538300 688843966 688176751 687615693 687035441 686283231 685411692
2773.9 685411692 684585452 683793545 682856977 681762755 680689335 679693043 678639174 677391410 675997794
2792.2 675997794 674628615 673275113 671770036 670092940 668396950 666750848 665007830 663036942
2808.6 663036942 660980284 659007788 657019079 654864430 652587473 650317371 648055732 645693600
2824.9 645693600 643189609 640590489 637968421 635328591 632536292 629499316 626297474 623009861
2841.2 623009861 619532347 615700901 611609638 607560456 603799760 600431085 597412825 594641387
2857.5 594641387 591960073 589069247 585666358 581691802 577282190 572575748 567625582 562492669
2873.8 562492669 557365477 552503526 548104644 544266522 541052639 538496077 536579549 535198569
2890.1E35198569j012981p41720n76019n89907p38263r41456j139283j361191j700759
2908.5E26396990k185643k703905l127456l448188l630936l579021l219425k615750
2924.8E01886666j891732j085848j78754Q78065J986027K979160L804743M484951M968226
2943.2E17831504N136431N128324N236089N410969N418837N299866N216957N201935
2959.5E59880912N153060M898906M477084M149615M003168L917634L794909L653705
2975.8E93928993L617882L585220L328681K951622K669513K480984K291679J990319
2992.1F16844893J586794J293540J084447P72417L79145J2457k20596l55244n72324
3010.5F20825529r19044j233041j423300j604676j831174j963317k001643k098978
$$ plain form
2890.1 535198569 534185588 533443868 532867849 532277942 531539679 530598223 529458940 528097749 526396990
2908.5 526396990 524211347 521507442 518379986 514931798 511300862 507721841 504502416 501886666
2924.8 501886666 499994934 498909086 498730332 499608397 501594424 504573584 508378327 512863278 517831504
2943.2 517831504 522967935 528096259 533332348 538743317 544162154 549462020 554678977 559880912
2959.5 559880912 565033972 569932878 574409962 578559577 582562745 586480379 590275288 593928993
2975.8 593928993 597546875 601132095 604460776 607412398 610081911 612562895 614854574 616844893
2992.1 616844893 618431687 619725227 620809674 621582091 621961236 621973693 621753097 621397853 620825529
3010.5 620825529 619906485 618673444 617250144 615645468 613814294 611850977 609849334 607750356
3026.8F07750356k189874k216876k267361k404511k564788k586603k516269k506733
3043.1E88497341k587200k713203k769291k746165k738953k759218k816439k836406
3059.4E66530466k747297k663136k665400k748311k835929k804280k690970k595962
3075.7E44779181k565741k643466k725363k740323k774954k766550k694726k714276
3092.1E23153782k771258k684415k507090k478421k607286k635837k521693k453924
3108.4E02493858k494394k466202k324879k278120k356916k507806k656430k614528
3124.7D82794583k428502k309710k315968k366543k301603k109468k059967k249539
3141D64653283k366960k265036k139300k014488j887292j956820k131343k130568k025694
$$ plain form
3026.8 607750356 605560482 603343606 601076245 598671734 596106946 593520343 591004074 588497341
3043.1 588497341 585910141 583196938 580427647 577681482 574942529 572183311 569366872 566530466
3059.4 566530466 563783169 561120033 558454633 555706322 552870393 550066113 547375143 544779181
3075.7 544779181 542213440 539569974 536844611 534104288 531329334 528562784 525868058 523153782
3092.1 523153782 520382524 517698109 515191019 512712598 510105312 507469475 504947782 502493858
3108.4 502493858 499999464 497533262 495208383 492930263 490573347 488065541 485409111 482794583
3124.7 482794583 480366081 478056371 475740403 473373860 471072257 468962789 466902822 464653283
3141 464653283 462286323 460021287 457881987 455867499 453980207 452023387 449892044 447761476 445735782
3159.4D45735782j960903j915574j897395j914233j912236j851082j762599j692563
3175.7D30829197j683861j712203j683652j622230j583636j556933j572966j585901
3192D17827815j536668j522272j543612j492500j391798j334906j337856j369625j371175
3210.3D04927403j316667j253396j197875j196474j251846j232863j146197j119315
3226.7C95212770j096756r81748r49472j128793j230120j107902r98050r60797r11653
3245C85847479r23812j003146r55642q12560q08418r12398r20385q25882p48843p00414
3265.4C77235979o20306n46962o23285p84100q52108q12053p21932o91116p00682o49154
3285.8C70234281n68330n06193n50032o70611p26998p51108p20203n96374n03093n66274
$$ plain form
3159.4 445735782 443774879 441859305 439961910 438047677 436135441 434284359 432521760 430829197
3175.7 430829197 429145336 427433133 425749481 424127251 422543615 420986682 419413716 417827815
3192 417827815 416291147 414768875 413225263 411732763 410340965 409006059 407668203 406298578 404927403
3210.3 404927403 403610736 402357340 401159465 399962991 398711145 397478282 396332085 395212770
3226.7 395212770 394116014 393134266 392184794 391056001 389825881 388717979 387719929 386759132 385847479
3245 385847479 384923667 383920521 382964879 382152319 381343901 380431503 379511118 378685236 377936393 377235979
3265.4 377235979 376615673 376068711 375445426 374661326 373809218 372997165 372275233 371584117 370883435 370234281
3285.8 370234281 369665951 369159758 368609726 367939115 367212117 366461009 365740806 365144432 364641339 364075065
3306.2C64075065q03978j022309j009196q52734p63565p90924q33422p69555p05183
3324.6C56524199q43614j019001r78142q17478o99580p04646q47846r60410r62406
3342.9C48691076r78023r28521p75099q39680j090080j147598r80735q05467p99835
3361.3C40346038q60124p56413o76334q87513j183361j171589q95739p26848p19876
3379.6C32468241p57008p63148o40214l65585j45555l04281o52731o46829k94149j43826
3400C27754915m67509p79391n92529k79844k39223k93315l34352l42250k57611k14964
3420.4C23953927j91749m5895J12742J92612J87070K36034L13878J27107j44750j12563
3440.8C24628413J47819L74347L97980K87652L08395M32402N23865O22839O95497O14404
$$ plain form
3306.2 364075065 363271087 362248778 361239582 360386848 359623283 358832359 357998937 357229382 356524199
3324.6 356524199 355680585 354661584 353683442 352865964 352166384 351461738 350613892 349653482 348691076
3342.9 348691076 347713053 346784532 346009433 345169753 344079673 342932075 341951340 341145873 340346038
3361.3 340346038 339485914 338729501 338053167 337165654 335982293 334810704 333914965 333188117 332468241
3379.6 332468241 331711233 330948085 330307871 329942286 329796731 329492450 328839719 328192890 327898741 327754915
3400 327754915 327287406 326508015 325915486 325635642 325396419 325103104 324768752 324426502 324168891 323953927
3420.4 323953927 323762178 323716283 323829025 324021637 324208707 324444741 324758619 324885726 324740976 324628413
3440.8 324628413 324776232 325150579 325548559 325836211 326144606 326577008 327100873 327723712 328419209 329033613
3461.2C29033613N94467Q31545R63538O79285K95847K92242N75095Q56907Q92937O35653
3481.6C35651129N47261P41213P78169P23361Q31694R17435R19789R15974R66251R38475
3502C43930751O77943N66662P94947J031875J132340J044184Q72939Q98153J102984
3520.4C52052778J280814J136125Q45879Q27044J008004J224011J371473J252771J086801
3538.7C62085700J289129J568497J492172J150310J070797J249701J357019J437187
3555C72700512J577974J758426J861453J822144J795262J964867K101392K068817K083213
3573.4C89734060K233207K410590K604545K809018K893447K752394K535701K721876
3589.7D10694838K977520L020584L116519L312409L356665L293753L306955L285169
$$ plain form
3461.2 329033613 329628080 330459625 331423163 332102448 332398295 332690537 333265632 334122539 335015476 335651129
3481.6 335651129 336198390 336939603 337717772 338441133 339272827 340190262 341110051 342026025 342992276 343930751
3502 343930751 344608694 345175356 345970303 347002178 348134518 349178702 350051641 350949794 352052778
3520.4 352052778 353333592 354469717 355315596 356142640 357150644 358374655 359746128 360998899 362085700
3538.7 362085700 363374829 364943326 366435498 367585808 368656605 369906306 371263325 372700512
3555 372700512 374278486 376036912 377898365 379720509 381515771 383480638 385582030 387650847 389734060
3573.4 389734060 391967267 394377857 396982402 399791420 402684867 405437261 407972962 410694838
3589.7 410694838 413672358 416692942 419809461 423121870 426478535 429772288 433079243 436364412
3606D36364412L315538L439516L522754L598928L608913L637045L763199L634066L465771
3624.4D68350142L403425L471584L723621L688276L618628L624230L615439L628850
3640.7D97124195L673554L695368L677488L640473L502905L361165L357828L591299
3657E25624275L636360L301144L083706L226757L256738K995610L065288L062726K611458
3675.4E53864062K547622K694606K698541K881110L100574K950251K203345J831234
3691.7E74771345K155363K298713K153575J939118J811028J937926K110362K052843
3708E91230273J688302J300990J505137J763523J775622J701236J540005J356661J322389
3726.4F05184138J584232J774132J639426J218319R90867J303137J510083J048327
$$ plain form
3606 436364412 439679950 443119466 446642220 450241148 453850061 457487106 461250305 464884371 468350142
3624.4 468350142 471753567 475225151 478948772 482637048 486255676 489879906 493495345 497124195
3640.7 497124195 500797749 504493117 508170605 511811078 515313983 518675148 522032976 525624275
3657 525624275 529260635 532561779 535645485 538872242 542128980 545124590 548189878 551252604 553864062
3675.4 553864062 556411684 559106290 561804831 564685941 567786515 570736766 572940111 574771345
3691.7 574771345 576926708 579225421 581378996 583318114 585129142 587067068 589177430 591230273
3708 591230273 592918575 594219565 595724702 597488225 599263847 600965083 602505088 603861749 605184138
3726.4 605184138 606768370 608542502 610181928 611400247 612391114 613694251 615204334 616252661
3742.7F16252661N87165J178324J288593O87838Q25643J336754J306653R59038R06051
3761F25328720J093149J120448J062214R00388Q46922J025081J141071J102567Q55386
3779.4F34475946P36297Q14616Q46207R14932R36389R05335R04679Q97288R62258P98463
3799.8F43192410N09501P11322O02543L71695Q15808J205564R79304N79954P15374
3818.1F49683475O27101L92139O36995P16150P47978Q31068Q65876R35555O87838K58326
3838.5F56382501K77341M34935N38110P52986R63151P54416j74164k24591Q49366J033068
3858.9F61587119P28130M17531L99172N92113M25815K70069L89755N32985O69658N08964
3879.3F66521311M21464N52476L83615L27587L79801K40266L32594N72265N57363L73125
$$ plain form
3742.7 616252661 616839826 618018150 619306743 619994581 620820224 622156978 623463631 624422669 625328720
3761 625328720 626421869 627542317 628604531 629504919 630351841 631376922 632517993 633620560 634475946
3779.4 634475946 635212243 636026859 636873066 637787998 638724387 639629722 640534401 641431689 642393947 643192410
3799.8 643192410 643701911 644413233 645015776 645387471 646203279 647408843 648388147 648968101 649683475
3818.1 649683475 650310576 650702715 651339710 652055860 652803838 653634906 654500782 655436337 656124175 656382501
3838.5 656382501 656659842 657094777 657632887 658385873 659349024 660103440 659929276 659704685 660554051 661587119
3858.9 661587119 662315249 662732780 663131952 663724065 664149880 664419949 664809704 665342689 666012347 666521311
3879.3 666521311 666942775 667495251 667878866 668206453 668586254 668826520 669159114 669731379 670288742 670661867
3899.7F70661867K19762J06633J69336L35932L75271M11332M53710L31402J99080K58565
3920.1F73522890L08811K07961J76906L05295L35336K59817K15053J63556J95562K62857
3940.5F75954044J92106K16066L57032L19958K09987J85371K14100K63869K42114J53482
3960.9F78308129J74046K60711K43485J57654J48773K31922K65777K33888J71006J68443
3981.3F80363834K13146J77205J54078J93596K28881K17677J50501J17004
3997.6F81815922
$$ plain form
3899.7 670661867 670881629 670988262 671157598 671493530 671868801 672280133 672733843 673065245 673264325 673522890
3920.1 673522890 673831701 674039662 674216568 674521863 674857199 675117016 675332069 675495625 675691187 675954044
3940.5 675954044 676146150 676362216 676719248 677039206 677249193 677434564 677648664 677912533 678154647 678308129
3960.9 678308129 678482175 678742886 678986371 679144025 679292798 679524720 679790497 680024385 680195391 680363834
3981.3 680363834 680576980 680754185 680908263 681101859 681330740 681548417 681698918 681815922
3997.6 681815922
##END=$$ End of the data block
