##TITLE=$$ Begin of the data block
##JCAMP-DX=5.00 $$ ACD/SpecManager v 10.08
##SPECTROMETER/DATA SYSTEM=Alpha
##DATE=23 Dec 2014 09:14:34
##DATA TYPE=INFRARED SPECTRUM
##DATA CLASS=XYDATA
##ORIGIN=
##OWNER=
##NPOINTS=1765
##FIRSTX=399.76428223
##LASTX=3997.64306641
##MAXX=3997.64306641
##MINX=399.76428223
##MAXY=0.81216419
##MINY=0.14922155
##XFACTOR=1.0000000000
##YFACTOR=1.000000000000000e-9
##FIRSTY=0.45791107
##DELTAX=2.03961372
##XUNITS=1/CM
##YUNITS=ARBITRARY UNITS
##XYDATA=(X++(Y..Y))
399.8 457911074 452500612 448402733 445535123 444417536 445136696 447299451 449893653 451410234 450906038
418.1 450906038 449073195 447523862 445861250 443230867 439595401 435614944 432005137 429048419
434.4 429048419 427160501 427146047 429398596 433699489 439095646 444458067 448981553 452071398 453574479
452.8 453574479 453782260 453232646 452015996 450106561 447598875 444661409 441462576 437917858 433909267
471.2 433909267 429839730 426533490 424073488 422176510 420791447 419927418 419686019 419963330 420019180
489.5 420019180 419273823 417943954 416316271 414348423 411980957 409126014 406041324 402982146 399622560
507.9 399622560 395839065 391689807 387193948 382381827 377364814 372707605 368986398 366365135
524.2 366365135 364833385 364307076 364496887 365417629 367670357 371747673 377446860 383898437 389782071
542.5 389782071 393991739 396278858 396921188 396173179 394305378 391623765 388282955 384226710 379368663
560.9 379368663 373550117 366664976 359006137 351387233 345101029 341221869 340111852 341746539
577.2 341746539 345927298 352250069 360016972 368312955 375882715 381538421 385172248 387294114
593.5 387294114 388304830 388435215 388001621 387518406 387245417 387051284 387011886 387554348 388745606 390466124
613.9 390466124 392808020 395851165 399556160 403722644 408052117 412240773 416112751 419546038
630.2 419546038 422438622 424823105 426831663 428607345 430235177 431669950 432932019 434157580
646.6 434157580 435414732 436700046 438021809 439355552 440560877 441580117 442518771 443497419 444590867
664.9 444590867 446186960 448236197 449665904 451048851 452826202 454731852 456617832 458402842
681.2 458402842 460000783 461328715 462258697 462709099 462648004 461949199 460415840 457889527 454477817
699.6 454477817 450670719 447120368 444350004 442778349 442704856 444182336 447121680 451373130 456762224
717.9 456762224 463092178 469883025 476762176 483687878 490389884 496501356 501815200 506236374
734.3 506236374 509849072 512685955 514657557 515564799 515131414 513216019 509875000 505358815 500113547
752.6 500113547 494496107 488746911 483211994 478407651 474900007 473137617 473574311 476607621 482203364
771 482203364 489901990 499216020 509674430 520444155 530498624 539294362 546878815 553449690
787.3 553449690 559195936 564328074 569100499 573794663 578710258 583954155 589202940 593951821
803.6 593951821 597793341 600534081 602382600 603785455 604952753 605881453 606508434 606712580 606400371
822 606400371 605508745 603776991 600857198 596598744 591081858 584711254 578069150 571633041 565623105
840.3 565623105 559976161 554526985 549286485 544323146 539455831 534262717 528334737 521668375
856.6 521668375 515348077 511959016 514159858 522280693 534369767 548476398 563427866 577850640
873 577850640 589896142 598092020 601971924 601886749 598640740 593199492 586462796 579122901 571683884
891.3 571683884 564580262 558090270 552180052 546531081 540662110 534066200 526375413 517403841
907.6 517403841 507140279 495744258 483473390 470796853 458604068 448107094 440332770 435515255
923.9 435515255 433044970 432108223 432373971 433968782 436956286 441145509 446287453 452197552 458282441
942.3 458282441 462896168 463768929 459471136 450220615 437223226 421727508 404716730 386857748
958.6 386857748 368487179 349710315 330520034 310970008 291215867 271419942 251866668
972.9 251866668 232996568 215253621 199101776 185060814 173499674 164510652 157958329 153534517
989.2 153534517 150876775 149573311 149221554 149539724 150310561 151294470 152229339 152807340 152836293 152447745
1009.6 152447745 151942089 151620612 151733354 152445525 153802469 155813158 158446297 161560446 164960325
1028 164960325 168428078 171771139 174765915 177085966 178520560 179258391 179692462 180149600 180881202
1046.3 180881202 182163447 184401914 187999383 193078592 199456498 206925020 215495691 225230649
1062.6 225230649 235349074 243472338 246214196 241634175 231593981 220741168 212866589 208918959
1079 208918959 208130211 209592313 212655291 216818884 221866965 227706239 233977869 240061849 245214581
1097.3 245214581 248862013 250899136 251855016 252756983 254598796 257773548 261971384 266543329 270901740
1115.7 270901740 274667025 277624756 279810667 281663179 283953488 287342995 291929573 297027290
1132 297027290 301274747 303160548 301766992 297141314 290054649 281651795 273065060 265153557 258478433
1150.3 258478433 253359348 249892473 248011857 247643828 248816475 251740128 256699294 263880819
1166.7 263880819 273280382 284665287 297638506 311750025 326515436 341544628 356548429
1180.9 356548429 371158004 384992689 397661239 408679456 417640477 424418688 429206878 432517588
1197.3 432517588 434990227 437125385 439260423 441680729 444688350 448592871 453576058 459428370
1213.6 459428370 465544134 471224129 475879461 479118377 480836034 481162637 480316490 478574216 476317853
1231.9 476317853 473928928 471639097 469575346 467853040 466660202 466271520 466917723 468571663 470903933
1250.3 470903933 473475963 475888401 477877706 479404002 480618089 481753647 483136564 485081255
1266.6 485081255 487633198 490473509 492999554 494662106 495295763 495062530 494274676 493317097 492419213
1285 492419213 491514325 490460455 489160597 487520397 485493451 483111382 480482399 477761477 475060642
1303.3 475060642 472406596 469846606 467576206 465746760 464260638 462909430 461531579 459985673
1319.6 459985673 457907349 454692453 449945092 443874747 437215269 430775344 425121814 420610905
1336 420610905 417445064 415695578 415218681 415564150 416263610 416895986 417130262 416902095 416334450 415564895
1356.4 415564895 414609373 413464785 412313282 411476880 410940140 410651386 410781771 411432922 412617654
1374.7 412617654 413960963 415181190 416443318 418146372 420895696 425242782 430240601 434121072
1391 434121072 436568350 437686503 437571943 436557293 435086548 433285594 431059867 428671479 426203579
1409.4 426203579 423622549 421213746 419188172 417469740 416296840 415982872 416302294 417083085 418210685
1427.7 418210685 419717401 421535432 423405766 425691843 428499639 430933088 433046341 434857339
1444.1 434857339 436064750 436441272 435934752 434755683 433146358 430891752 428860694 428673655 429768533
1462.4 429768533 432402879 436782569 442087173 449102968 459949672 472313732 483082771 492688209
1478.7 492688209 501810193 510609090 518470168 525774062 533401966 540991783 546983123 552120686
1495 552120686 557792902 563307166 567742348 571162820 574450016 578976810 583206058 586344540 589062154
1513.4 589062154 591536164 594100237 596645117 599417329 602148056 604381680 606501043 608330071
1529.7 608330071 609876394 611420035 612717152 613475382 614069581 614776015 615467727 616015434 616147757
1548.1 616147757 615856647 615352988 614649236 613620341 611853361 609963536 608924508 607587218 605862319
1566.4 605862319 603861392 601661980 599852920 597836792 595080793 592724860 590788603 588628650
1582.8 588628650 586313963 583860278 581247568 578510940 575738072 572941720 570147514 567321002
1599.1 567321002 564314067 561142385 557895243 554560363 551044643 547499537 544019103 540017962
1615.4 540017962 535441518 531975269 528989017 525415778 521962821 518813074 515932322 513681531
1631.7 513681531 511669159 509561300 508352458 507997096 507953882 508147001 508881032 510543883 512212992
1650.1 512212992 514316618 518453479 522348940 525656044 529379129 533996642 539042413 543446600
1666.4 543446600 548212647 554184496 559782386 565485895 571762204 577294588 582222939 587827206
1682.7 587827206 595593095 602486432 607864738 613263369 618004143 622649431 627540350 632030904
1699 632030904 636743486 640468001 643437803 646568537 649353504 651648283 653608024 655484676 657924175
1717.4 657924175 660609782 662755549 664722025 666916251 669137120 671289325 673326910 675717175
1733.7 675717175 678503633 680824041 683129549 685790956 688622475 691508412 694515169 698080480
1750 698080480 702204704 705988348 709425569 712736547 715712667 718700349 721583009 724045813 726190686
1768.4 726190686 728035808 729867518 731905878 733854353 735586882 737141430 738532424 739827156
1784.7 739827156 741178215 742509663 743695796 744978368 746312439 747469425 748577595 749880612
1801 749880612 751289189 752466440 753378272 754229188 755261183 756467640 757593632 758472741 759210587
1819.4 759210587 759915888 760634124 761499166 762333572 762923181 763521492 764247894 764982820 765745342 766382754
1839.8 766382754 766630888 766617000 766927719 767627776 768352628 768866420 769073308 769149184 769357979 769821882
1860.2 769821882 770374835 770696878 770631433 770484626 770832479 771609783 772355378 772829473 773082912 773313224
1880.5 773313224 773710907 774318159 774943292 775351763 775619209 775910258 776273727 776799262 777338862 777628005
1900.9 777628005 777653217 777651072 777802169 778117418 778474927 778677046 778644264 778551102 778742969 779170692
1921.3 779170692 779573560 779837132 779920757 779961705 780142128 780443311 780707598 780824542 780779541 780719101
1941.7 780719101 780922353 781371653 781753480 781951308 782073140 782263517 782583177 782975435 783343673 783579290
1962.1 783579290 783657014 783716440 783971667 784380257 784708381 784878850 784958601 785042226 785199940 785442948
1982.5 785442948 785646319 785690844 785635173 785604000 785696208 785916746 786088288 786083758 785967469 785847604 785779178
2005 785779178 785702407 785520673 785220385 784859180 784457564 784042835 783645034 783159256 782472730 781724751
2025.4 781724751 781225264 780958056 780688345 780339539 779906809 779392362 778847516 778381109 778053105 777798295
2045.8 777798295 777522922 777233422 776996493 776862919 776849210 776915967 776968598 776935875 776859999 776867330 777033210
2068.2 777033210 777262807 777400076 777411580 777382970 777387977 777487993 777668417 777789593 777803481 777815342 777953863
2090.6 777953863 778231919 778540432 778750896 778853416 778951406 779136062 779434264 779745579 779937685 780012906
2111 780012906 780094147 780258775 780466616 780620217 780648828 780567646 780497193 780557752 780725479 780873358 780889690
2133.5 780889690 780806184 780743539 780784965 780940771 781117499 781185687 781143725 781104147 781179845 781422794 781726360
2155.9 781726360 781965375 782158256 782394826 782766342 783268690 783804953 784338415 784876406 785409451 785994649
2176.3 785994649 786674976 787362337 787946165 788436294 788929284 789501786 790148914 790776670 791282773 791662872
2196.7 791662872 792032719 792507946 793092966 793709040 794255495 794689894 795093477 795576632 796174645 796799839
2217.1 796799839 797280312 797593594 797892392 798303366 798814356 799302638 799636662 799819648 800008953 800331593
2237.5 800331593 800775230 801203668 801481187 801626980 801791549 802068114 802417994 802756429 802989602 803110898
2257.9 803110898 803254068 803565383 804012060 804405868 804645360 804802299 804999709 805301607 805653691 805920064
2278.3 805920064 806076944 806220233 806430638 806745350 807112753 807395935 807521462 807555437 807651103 807920754
2298.7 807920754 808266282 808524191 808720350 808960259 809289098 809671581 810009599 810287058 810548723 810776293
2319.1 810776293 810974419 811223149 811580002 811962903 812164187 812054157 811822414 811741412 811830461 811928451
2339.5 811928451 811819136 811330497 810414732 809574723 809387028 809871674 810660303 811311305 811647415 811655521
2359.9 811655521 811324775 810644209 809760571 808834195 807832479 806799829 805839479 804921031 804080009
2378.2 804080009 803389311 802819848 802351296 801985562 801692009 801429451 801161945 800886810 800618649 800347984
2398.6 800347984 800044537 799674809 799250007 798820674 798387527 797900379 797351360 796774089 796190083 795613945
2419 795613945 795017958 794373333 793696165 792986870 792260289 791548073 790851891 790134609 789373279 788582444
2439.4 788582444 787782550 786998749 786219299 785434365 784657180 783852160 783023715 782271445 781617582 780955493
2459.8 780955493 780192196 779376566 778643131 777993321 777324438 776624084 775921941 775206327 774481177 773780227
2480.2 773780227 773138344 772549033 771956205 771337450 770753920 770263851 769820035 769378304 768948972 768509805
2500.6 768509805 768079638 767682552 767264664 766808093 766329467 765848875 765397549 764954567 764474094 763923347
2521 763923347 763293862 762621462 761956155 761290729 760582745 759827912 759015918 758141875 757269740 756434619
2541.4 756434619 755606174 754781246 753943563 753069043 752193749 751350284 750527680 749687612 748819232 747952163
2561.8 747952163 747130394 746375859 745631635 744852841 744058967 743250668 742426753 741629243 740883648 740112841
2582.2 740112841 739295304 738541126 737883031 737274587 736660302 736022413 735413492 734859526 734340906 733798385
2602.6 733798385 733173192 732443810 731614649 730733752 729829907 728861511 727813125 726694584 725492418
2620.9 725492418 724234164 722965777 721652329 720255256 718810022 717314839 715761662 714221060
2637.2 714221060 712738514 711289465 709816098 708280206 706711054 705158830 703666210 702236295
2653.5 702236295 700798333 699334681 697897553 696492016 695107639 693729758 692347169 691001892
2669.9 691001892 689720750 688481390 687278092 686104298 684929907 683755636 682607710 681477129
2686.2 681477129 680329442 679151893 677957594 676736236 675454557 674127638 672789574 671420276
2702.5 671420276 669994473 668534517 667056739 665570736 664125979 662756383 661459744 660193264
2718.8 660193264 658898771 657599151 656366527 655251563 654220343 653175354 652122378 651130736
2735.1 651130736 650191486 649261773 648311079 647337615 646351218 645380735 644460857 643570364 642698526 641858935
2755.5 641858935 641032457 640217006 639452398 638751268 638052285 637269020 636401772 635496438 634558976 633602381
2775.9 633602381 632591307 631457448 630214572 628915966 627552986 626121640 624646425 623052657
2792.2 623052657 621291459 619462490 617640257 615773380 613794088 611665189 609368980 606972158
2808.6 606972158 604580224 602205336 599764705 597181499 594456911 591645002 588806570 585961819
2824.9 585961819 583037794 579948604 576702058 573357582 569956899 566499591 562895238 559018970
2841.2 559018970 554844201 550435364 545910776 541408062 537063897 533048153 529454887 526177168
2857.5 526177168 522953391 519486964 515544474 510982990 505764306 500008583 493954688 487769961
2873.8 487769961 481509328 475365937 469701797 464813381 460835516 457747400 455438554 453814179
2890.1 453814179 452752382 452045232 451462835 450811058 449996293 448968291 447647542 445977837 443929821
2908.5 443929821 441455334 438446403 434832662 430737436 426388264 422020108 417948574 414448172
2924.8 414448172 411708236 409949481 409330219 409986675 412059218 415485889 420034438 425471783 431523055
2943.2 431523055 437918574 444499910 451175749 457910359 464656264 471340358 477961749 484479129
2959.5 484479129 490687191 496396303 501619458 506425738 510856092 515061557 519183040 523226380
2975.8 523226380 527209997 531138897 534841359 538144886 541069448 543686867 546064377 548161745
2992.1 548161745 549842417 551163316 552210927 552895904 553178430 553105712 552688181 551981926 551045597
3010.5 551045597 549802959 548200011 546314359 544237137 541998863 539621294 537124217 534479022
3026.8 534479022 531698227 528882563 526094675 523199916 520117164 517041147 514029384 510915160
3043.1 510915160 507655203 504354060 501107991 497900784 494649351 491325140 487953216 484604567
3059.4 484604567 481343657 478140891 474941105 471690834 468360007 465019047 461757213 458622605
3075.7 458622605 455568552 452439576 449215740 445980966 442724615 439493835 436342150 433167785
3092.1 433167785 429917037 426721811 423692942 420702875 417629629 414567858 411603242 408701211
3108.4 408701211 405777514 402894646 400171369 397485673 394655704 391643018 388563544 385601193
3124.7 385601193 382815301 380132675 377420902 374642074 371947229 369437307 366984546 364377588
3141 364377588 361647785 359001487 356489778 354117900 351882249 349578261 347057879 344517529 342127651
3159.4 342127651 339825630 337564528 335358530 333200604 331053644 328937650 326902241 324906737
3175.7 324906737 322890401 320872158 318886995 316932052 315013230 313182503 311418205 309615076
3192 309615076 307802737 306057304 304349661 302668244 301048845 299493223 297968298 296440125 294918269
3210.3 294918269 293429673 291966647 290532500 289146543 287782043 286398113 285002947 283657283
3226.7 283657283 282442868 281376511 280334502 279123247 277783304 276519507 275346756 274242610
3243 274242610 273262560 272314787 271235794 270120621 269142032 268238246 267303824 266359180 265444338 264549553
3263.4 264549553 263677835 262918949 262319982 261676878 260831058 259918898 259057611 258238494 257466227 256757975
3283.8 256757975 256079108 255406529 254826516 254310995 253674299 252893507 252076238 251314461 250709295 250258416
3304.2 250258416 249738991 248956084 247995973 247046068 246172234 245348617 244566873 243837029 243180946 242535397
3324.6 242535397 241713494 240743399 239856675 239123568 238509074 237974152 237355009 236528382 235612497 234726116
3345 234726116 233958319 233378306 232731894 231794611 230801910 230028003 229433417 228807002 228099346 227552429
3365.4 227552429 227157488 226537541 225595951 224655718 223954931 223412260 222883642 222274914 221667200 221248493
3385.7 221248493 221069589 221027046 220838860 220345721 219843373 219689727 219739527 219509542 218920186 218437985
3406.1 218437985 218265161 218166068 217998162 217754915 217492670 217335895 217283264 217247710 217267260 217444941
3426.5 217444941 217770904 218070999 218377024 218793273 219049424 218965143 218828961 218947738 219323665 219794556
3446.9 219794556 220185652 220526978 220963806 221536860 222259998 223059982 223692492 224237576 225052148 226042718
3467.3 226042718 226773560 227139473 227520913 228176862 229071185 229966640 230636224 231330648 232257143 233125910
3487.7 233125910 233855829 234707117 235706702 236736849 237718642 238688916 239671886 240499943 241182029
3506.1 241182029 241985634 243053347 244315088 245474562 246331990 247139663 248228163 249600455 250839174
3524.4 250839174 251723230 252586871 253711790 255067945 256533146 257873416 259044856 260387093 261955827
3542.8 261955827 263463676 264728248 265983313 267478287 269141078 270848364 272663236 274690151
3559.1 274690151 276765943 278610140 280371904 282728732 285622507 288332731 290834248 293433785
3575.4 293433785 296239376 299314409 302595288 305767685 308691263 311715364 315179199 318663180
3591.7 318663180 322030395 325607985 329469770 333412170 337359697 341181129 344755441 348439097
3608.1 348439097 352427423 356534302 360759884 364875466 369016767 373756200 378439516 382465392
3624.4 382465392 385980904 389828950 394757360 399624914 404159874 408599913 412934721 417262554
3640.7 417262554 421544164 425517142 429210663 433502316 438704461 443461925 447639585 452197999
3657 452197999 456942648 461125016 464936703 468696535 472111970 475282043 479035467 482719600 485998720
3675.4 485998720 489773482 493686199 497354060 500861287 504121006 506985426 509541273 512373209
3691.7 512373209 515474677 518414557 521022141 523257732 525388658 527848184 530380011 532466531
3708 532466531 533994853 535683453 538223922 540849626 542969227 544701874 546364248 548048854 549824476
3726.4 549824476 551809371 553588510 554837406 555873454 557488143 559695959 561593890 562453985
3742.7 562453985 562951565 564503849 565927804 566698194 568259478 570388496 572062075 573348939 574866295
3761 574866295 576435506 577717841 578907669 579986274 581159651 582659841 584158063 585363567 586283565
3779.4 586283565 587276697 588358223 589501083 590792120 592010319 593091130 594014347 594799638 595751166
3797.7 595751166 596466541 596901417 597997546 599066615 599955797 601365328 602808177 603531361 603777528
3816.1 603777528 604425728 604959071 605667174 607036471 608235478 609189868 609990418 610729754 611598909
3834.4 611598909 612106502 612232506 612844467 613921642 615177095 616484523 617519319 617698848 616697490
3852.8 616697490 616741717 618539155 620104194 620850384 621004403 621336102 622067034 622526288 623001873
3871.2 623001873 623813570 624761283 625654519 626015484 626420081 627242088 627789021 628387451 628963768 629150331
3891.6 629150331 629703462 630644798 631181002 631219804 631143987 631244957 631954134 633029878 633817971 634304523
3912 634304523 634647489 634757578 634864807 635296166 635773242 636045635 636361659 636758268 637005389 637295842
3932.3 637295842 637835920 638373137 638744354 638958454 639113188 639425874 639794111 640061617 640378773 640779912
3952.7 640779912 641157210 641485691 641779602 641992807 642186761 642471433 642784595 643072546 643343449 643606305
3973.1 643606305 643885136 644195497 644486666 644735634 644997716 645255685 645447612 645634532 645900607 646178603
3993.5 646178603 646408796 646646857
3997.6 646646857
##END=$$ End of the data block
