##TITLE=$$ Begin of the data block
##JCAMP-DX=5.00 $$ ACD/SpecManager v 10.08
##SPECTROMETER/DATA SYSTEM=Alpha
##DATE=23 Dec 2014 09:14:34
##DATA TYPE=INFRARED SPECTRUM
##DATA CLASS=XYDATA
##ORIGIN=
##OWNER=
##NPOINTS=1765
##FIRSTX=399.76428223
##LASTX=3997.64306641
##MAXX=3997.64306641
##MINX=399.76428223
##MAXY=0.81317651
##MINY=0.14919199
##XFACTOR=1.0000000000
##YFACTOR=1.000000000000000e-9
##FIRSTY=0.45729548
##DELTAX=2.03961372
##XUNITS=1/CM
##YUNITS=ARBITRARY UNITS
##XYDATA=(X++(Y..Y))
$$ plain form
399.8 457295477 452018589 447302341 444142252 443422616 445054591 448046327 450593054 451366484 450268120
418.1 450268120 448436230 447110653 445531279 442941189 439392030 435527176 432122588 429326743
434.4 429326743 427380174 427174598 429364771 433823735 439289719 444265813 448187888 451087475 452927709
452.8 452927709 453521490 453053802 451804996 450032711 447697610 444707185 441123545 437197536 433200896
471.2 433200896 429350078 426221371 423915178 422064304 420536041 419505626 419302613 419692516 419781536
489.5 419781536 419119418 417779893 415844113 413675368 411531091 409021169 406014115 402797580 399367303
507.9 399367303 395639360 391563833 387133151 382325858 377317697 372687936 368979752 366400838
524.2 366400838 364942431 364451289 364589304 365331292 367278129 371173084 376978964 383644402 389677703
$$ packed form
399.8D57295477n276888m716248l160089p19636J631975K991736K546727P73430j098364
418.1D50268120j831890j325577j579374k590090l549159l864854l404588k795845
434.4D29326743j946569k05576K190173M458964N465984M976094L922075K899587J840234
452.8D52927709N93781m67688j248806j772285k335101k990425l583640l926009l996640
471.2D33200896l850818l128707k306193j850874j528263j030415k03013L89903Q9020
489.5D19781536o62118j339525j935780k168745k144277k509922l007054l216535l430277
507.9C99367303l727943m075527m430682m807293n008161m629761l708184k578914
524.2C66400838j458407m91142J38015P41988J946837L894955N805880O665438O033301
$$ plain form
542.5 389677703 393954664 396241069 396834791 396079630 394266129 391557902 388087511 384027243 379262567
560.9 379262567 373428643 366501093 358846992 351288050 345067620 341208249 340086639 341672540
577.2 341672540 345851272 352234751 360117942 368441254 375803381 381274909 384909570 387051314
593.5 387051314 388078451 388412476 388261259 387727499 387119681 386859208 387108475 387805194 388908356
611.9 388908356 390545607 392876595 395933390 399607033 403726190 408104539 412396342 416297197
628.2 416297197 419707417 422650248 425142318 427184939 428919107 430499971 431882322 433097810
644.5 433097810 434314013 435566753 436868250 438214064 439465016 440608978 441777289 442926437
660.8 442926437 443936467 444905818 446469605 448659182 450115800 451453865 453222513 455108404 456945390
$$ packed form
542.5C89677703M276961K286405N93722p55161j813501k708227l470391m060268m764676
560.9C79262567n833924o927550p654101p558942o220430l859371j121610J585901
577.2C41672540M178732O383479P883191Q323312P362127N471528L634661K141744
593.5C87051314J027137L34025j51217n33760o07818k60473K49267O96719J103162
611.9C88908356J637251K330988L056795L673643M119157M378349M291803L900855
628.2D16297197L410220K942831K492070K042621J734168J580864J382351J215488
644.5D33097810J216203J252740J301497J345814J250952J143962J168311J149148
660.8D42926437J010030R69351J563787K189577J456618J338065J768648J885891J836986
$$ plain form
679.2 456945390 458786249 460529476 461914450 462827533 463284075 463261902 462575734 460975677 458362341
697.5 458362341 454907537 451094508 447550774 444771618 443181455 443115681 444643915 447647363 451956362
715.9 451956362 457365125 463610530 470341474 477303535 484279066 490929961 497030348 502415121
732.2 502415121 506926358 510569274 513366222 515308857 516238213 515824854 513884068 510520816 505983353
750.6 505983353 500662804 494934767 489095002 483563393 478800893 475274980 473525822 474027634 477070183
768.9 477070183 482660443 490427494 499810666 510228217 520913243 530991673 539880276 547482312
785.3 547482312 554005265 559709966 564814627 569567978 574282646 579255581 584521651 589729726
801.6 589729726 594412684 598219037 600973487 602845192 604218125 605313301 606220126 606871307 607110441
$$ packed form
679.2D56945390J840859J743227J384974R13083M56542k2173o86168j600057k613336
697.5D58362341l454804l813029l543734k779156j590163o5774J528234L003448M308999
715.9D51956362N408763O245405O730944O962061O975531O650895O100387N384773
732.2E02415121M511237L642916K796948J942635R29356m13359j940786l363252m537463
750.6E05983353n320549n728037n839765n531609m762500l525913j749158N01812L042549
768.9D77070183N590260P767051R383172J0417551J0685026J0078430Q888603P602036
785.3E47482312O522953N704701N104661M753351M714668M972935N266070N208075
801.6E89729726M682958L806353K754450J871705J372933J095176R06825O51181K39134
$$ plain form
819.9 607110441 606806099 605864644 604120255 601212442 596920371 591387987 584995687 578303456 571881413
838.3 571881413 565879703 560132086 554603457 549405098 544509768 539670348 534467578 528490722
854.6 528490722 521768749 515422940 512075305 514350832 522482276 534538805 548663557 563652873
870.9 563652873 578003943 589912951 598074496 601990819 601888359 598589361 593083382 586239398
887.2 586239398 578843236 571443975 564357400 557836413 551888466 546238542 540420353 533834457
903.5 533834457 526084006 517058432 506802976 495452404 483181804 470471770 458297193 447874188
919.9 447874188 440186322 435400724 432878464 431909621 432180315 433764189 436758786 440949708 446058005
938.2 446058005 451942533 458038032 462674618 463551670 459242791 449951619 436891049 421363175
$$ packed form
819.9F07110441l04342r41455j744389k907813m292071n532384o392300o692231o422043
838.3E71881413o001710n747617n528629n198359m895330m839420n202770n976856
854.6E28490722o721973o345809l347635K275527Q131444J2056529J4124752J4989316
870.9E63652873J4351070J1909008Q161545L916323j02460l298998n505979o843984
887.2E86239398p396162p399261p086575o520987n947947n649924n818189o585896
903.5E33834457p750451r025574j0255456j1350572j2270600j2710034j2174577j0423005
919.9D47874188p687866m785598k522260r68843K70694J583874K994597M190922N108297
938.2D46058005N884528O095499M636586Q77052m308879r291172j3060570j5527874
$$ plain form
954.5 421363175 404338002 386445999 368046969 349277645 330138505 310636401 290895671
968.8 290895671 271127284 251613915 232740045 214967862 198817313 184807479 173283890
983.1 173283890 164351970 157879591 153509825 150840342 149511829 149191990 149561495 150345415 151289806
1001.4 151289806 152127311 152633652 152727351 152473882 152027592 151683703 151769921 152479857 153859526 155888006
1021.8 155888006 158480182 161532760 164909706 168389514 171750233 174716860 176973715 178371817
1038.2 178371817 179121152 179602429 180120111 180906877 182233930 184470594 187992081 192996353 199361190
1056.5 199361190 206873670 215501055 225223541 235268742 243334338 246054441 241464525 231436089
1072.8 231436089 220634267 212788522 208836049 208093986 209601253 212625787 216766790 221838400
$$ packed form
954.5D21363175j7025173j7892003j8399030j8769324j9139140j9502104j9740730
968.8B90895671j9768387j9513369j8873870j7772183j6150549j4009834j1523589
983.1A73283890q931920o472379m369766k669483j328513l19839L69505P83920R44391
1001.4A51289806Q37505N06341R3699k53469m46290l43889Q6218P09936J379669K028480
1021.8A55888006K592176L052578L376946L479808L360719K966627K256855J398102
1038.2A78371817P49335M81277N17682P86766J327053K236664L521487N004272O364837
1056.5A99361190P512480Q627385R722486J0045201Q065596K720103m589916j0028436
1072.8B31436089j0801822p845745l952473p42063J507267L024534M141003N071610
$$ plain form
1089.2 221838400 227675408 233927801 240013137 245208144 248887569 250904471 251853138 252792895 254660010
1107.5 254660010 257795006 261929393 266488373 270875096 274653435 277607799 279825270 281719893
1123.8 281719893 283988029 287323028 291899651 297014743 301270664 303172171 301776469 297100961
1140.1 297100961 289999753 281669617 273142815 265218318 258521765 253400803 249943152 248097613
1156.5 248097613 247765899 248966992 251908571 256846696 264001846 273394614 284771085 297729194
1172.8 297729194 311818898 326574951 341617703 356629431 371235847 385087192 397789598
1187.1 397789598 408811122 417720377 424434215 429215014 432572126 435087711 437243789 439365208
1203.4 439365208 441747129 444768310 448744446 453761578 459578663 465639591 471283406 475935340
$$ packed form
1089.2B21838400N837008O252393O085336N195007L679425K016902R48667R39757J867115
1107.5B54660010L134996M134387M558980M386723L778339K954364K217471J894623
1123.8B81719893K268136L334999M576623N115092M255921J901507j395702m675508
1140.1B97100961p101208q330136q526802p924497o696553n120962l457651j845539
1156.5B48097613l31714J201093K941579M938125P155150R392768J1376471J2958109
1172.8B97729194J4089704J4756053J5042752J5011728J4606416J3851345J2702406
1187.1C97789598J1021524Q909255O713838M780799L357112K515585K156078K121419
1203.4D39365208K381921L021181L976136N017132N817085O060928N643815M651934
$$ plain form
1219.7 475935340 479190975 480911851 481220126 480362058 478625476 476369292 473972589 471683055 469621062
1238.1 469621062 467891693 466703176 466357619 467067212 468747437 471054375 473588258 475980341 477984101
1256.4 477984101 479550153 480793178 481937796 483314812 485234201 487759262 490596861 493125260
1272.7 493125260 494790256 495448291 495246828 494487971 493540734 492627293 491708934 490649283 489351064
1291.1 489351064 487709314 485660344 483266383 480666548 477990687 475305468 472642601 470078379
1307.4 470078379 467803389 465961397 464445591 463060260 461670548 460119754 458037019 454827577
1323.7 454827577 450097024 444055974 437422156 431003302 425385356 420873493 417658180 415906161
1340 415906161 415456235 415796101 416480154 417099625 417334408 417140335 416608393 415831923 414855808 413699657
$$ packed form
1219.7D75935340L255635J720876L08275q58068j736582k256184k396703k289534k061993
1238.1D69621062j729369j188517l45557P09593J680225K306938K533883K392083K003760
1256.4D77984101J566052J243025J144618J377016J919389K525061K837599K528399
1272.7D93125260J664996O58035k01463p58857r47237r13441r18359j059651j298219
1291.1D89351064j641750k048970k393961k599835k675861k685219k662867k564222
1307.4D70078379k274990j841992j515806j385331j389712j550794k082735l209442
1323.7D54827577m730553o041050o633818o418854n617946m511863l215313j752019
1340D15906161m49926L39866O84053O19471K34783j94073n31942p76470r76115j156151
$$ plain form
1360.4 413699657 412521631 411663890 411124051 410819083 410930663 411576182 412734985 414067626 415328860
1378.8 415328860 416623741 418335199 421090394 425424337 430377722 434192210 436595321 437745690
1395.1 437745690 437677771 436641216 435108483 433266580 431058317 428720117 426294506 423752517 421375722
1413.5 421375722 419346690 417593449 416406780 416109443 416452378 417256385 418400943 419928223 421764374
1431.8 421764374 423628628 425901502 428721666 431170940 433286011 435085863 436273992 436651021
1448.1 436651021 436177790 435023993 433399618 431107610 429073900 428914815 430033803 432676524 437039852
1466.5 437039852 442321420 449320108 460174799 472575814 483367294 492971271 502082288 510876834
1482.8 510876834 518751681 526090324 533752441 541326225 547267854 552375436 558022738 563519895
$$ packed form
1360.4D13699657j178026q57741n39839l04968J11580O45519J158803J332641J261234
1378.8D15328860J294881J711458K755195M333943M953385L814488K403111J150369
1395.1D37745690o7919j036555j532733j841903k208263k338200k425611k541989k376795
1413.5D21375722k029032j753241j186669k97337L42935Q04007J144558J527280J836151
1431.8D21764374J864254K272874K820164K449274K115071J799852J188129L77029
1448.1D36651021m73231j153797j624375k292008k033710j59085J118988K642721M363328
1466.5D37039852N281568O998688J0854691J2401015J0791480R603977R111017Q794546
1482.8E10876834P874847P338643P662117P573784N941629N107582N647302N497157
$$ plain form
1499.1 563519895 567989111 571431816 574674129 579181135 583481550 586668432 589386523 591843963
1515.4 591843963 594419122 596984506 599740326 602460563 604709923 606834114 608654141 610182285
1531.8 610182285 611730576 613069296 613809884 614338160 615135312 615941048 616513073 616647542 616337299
1550.1 616337299 615766883 614994466 613929570 612159789 610362589 609420717 608123124 606391490 604367197
1568.5 604367197 602160752 600332916 598256648 595450699 593112588 591206491 589046717 586714983
1584.8 586714983 584252536 581642747 578917503 576163888 573394299 570608497 567752063 564706087
1601.1 564706087 561519861 558281839 554960489 551453412 547905087 544401884 540382326 535825491
1617.4 535825491 532377124 529402018 525869608 522461116 519324839 516421318 514131129 512093067
$$ packed form
1499.1E63519895M469216L442705L242313M507006M300415L186882K718091K457440
1515.4E91843963K575159K565384K755820K720237K249360K124191J820027J528144
1531.8F10182285J548291J338720P40588N28276P97152Q05736N72025J34469l10243
1550.1F16337299n70416p72417j064896j769781j797200r41872j297593j731634k024293
1568.5F04367197k206445j827836k076268k805949k338111j906097k159774k331734
1584.8E86714983k462447k609789k725244k753615k769589k785802k856434l045976
1601.1E64706087l186226l238022l321350l507077l548325l503203m019558m556835
1617.4E35825491l448367k975106l532410l408492l136277k903521k290189k038062
$$ plain form
1633.7 512093067 510008097 508868337 508561254 508518100 508689582 509438097 511151373 512858331 515016079
1652.1 515016079 519229174 523148715 526459932 530177712 534768224 539782822 544178188 548980176
1668.4 548980176 555019081 560641468 566339850 572646201 578248322 583236396 588834524 596537769
1684.7 596537769 603416026 608809114 614203811 618921518 623541236 628404617 632861972 637552857
1701.1 637552857 641279042 644258380 647402644 650188446 652449727 654368699 656226873 658653557
1717.4 658653557 661340833 663510203 665490627 667660654 669854522 672025204 674084544 676449716
1733.7 676449716 679181278 681477726 683835149 686536729 689327240 692185462 695197880 698755205
1750 698755205 702864647 706650555 710119605 713463962 716450810 719452083 722344398 724785686 726885796
$$ packed form
1633.7E12093067k084970j139760l07083m3154J71482P48515J713276J706958K157748
1652.1E15016079M213095L919541L311217L717780M590512N014598M395366M801988
1668.4E48980176O038905N622387N698382O306351N602121M988074N598128P703245
1684.7E96537769O878257N393088N394697M717707M619718M863381M457355M690885
1701.1F37552857L726185K979338L144264K785802K261281J918972J858174K426684
1717.4F58653557K687276K169370J980424K170027K193868K170682K059340K365172
1733.7F76449716K731562K296448K357423K701580K790511K858222L012418L557325
1750F98755205M109442L785908L469050L344357K986848L001273K892315K441288K100110
$$ plain form
1768.4 726885796 728707612 730577707 732679963 734648168 736364186 737915814 739318848 740621865
1784.7 740621865 741967797 743275821 744447827 745728493 747039020 748164117 749254763 750558853
1801 750558853 752001107 753233552 754177332 755016923 756024539 757227063 758368492 759279013 760030329
1819.4 760030329 760709226 761411428 762281120 763096750 763655245 764263332 765036047 765803576 766568422 767204881
1839.8 767204881 767456532 767418444 767696261 768390834 769109368 769626677 769869924 769973099 770161927 770589292
1860.2 770589292 771141589 771499217 771463037 771322608 771658063 772397518 773107529 773574352 773838520 774083495
1880.5 774083495 774503648 775152683 775803328 776186407 776416063 776688993 777058482 777612627 778165221 778451145
1900.9 778451145 778475225 778457046 778597236 778931975 779308319 779505134 779461443 779372394 779569685 779979229
$$ packed form
1768.4G26885796J821816J870095K102256J968205J716018J551628J403034J303017
1784.7G40621865J345932J308024J172006J280666J310527J125097J090646J304090
1801G50558853J442254J232445R43780Q39591J007616J202524J141429R10521P51316
1819.4G60030329O78897P02202Q69692Q15630N58495O08087P72715P67529P64846O36459
1839.8G67204881K51651l8088K77817O94573P18534N17309K43247J03175J88828M27365
1860.2G70589292N52297L57628l6180j40429L35455P39455P10011M66823K64168K44975
1880.5G74083495M20153O49035O50645L83079K29656K72930L69489N54145N52594K85924
1900.9G78451145K4080j8179J40190L34739L76344J96815m3691q9049J97291M09544
$$ plain form
1921.3 779979229 780362189 780631185 780725479 780773342 780973673 781305194 781582654 781685948 781624436 781564832
1941.7 781564832 781778872 782234490 782625675 782840729 782965779 783151805 783486545 783873320 784190416 784399927
1962.1 784399927 784504592 784589767 784846723 785245955 785553157 785705209 785806417 785940886 786121249 786352694
1982.5 786352694 786540329 786572278 786508679 786488891 786618233 786859393 787023008 787025273 786918998 786788702
2002.9 786788702 786714017 786633492 786442995 786136150 785763323 785362065 784963489 784568191 784084916 783406973
2023.3 783406973 782654583 782168627 781947017 781705856 781354308 780911267 780378878 779810548 779331803 779006004
2043.7 779006004 778755426 778482974 778211057 777982235 777816117 777776062 777852774 777927160 777922630 777875245 777887046
2066.2 777887046 778025210 778219640 778349280 778380692 778372347 778409958 778556883 778751254 778849542 778838515 778837740
$$ packed form
1921.3G79979229L82960K68996R4294M7863K00331L31521K77460J03294o1512n9604
1941.7G81564832K14040M55618L91185K15054J25050J86026L34740L86775L17096K09511
1962.1G84399927J04665Q5175K56956L99232L07202J52052J01208J34469J80363K31445
1982.5G86352694J87635L1949o3599j9788J29342K41160J63615K265j06275j30296
2002.9G86788702p4685q0525j90497l06845l72827m01258l98576l95298m83275o77943
2023.3G83406973p52390m85956k21610k41161l51548m43041n32389n68330m78745l25799
2043.7G79006004k50578k72452k71917k28822j66118m0055P6712P4386m530m7385J1801
2066.2G77887046J38164J94430J29640L1412q345L7611J46925J94371R8288j1027p75
$$ plain form
2088.6 778837740 778976798 779270768 779588819 779776871 779850602 779953778 780159771 780454397 780753851 780964494
2109 780964494 781084478 781187832 781331956 781523287 781673312 781697631 781637788 781596720 781662881 781832397 781986058
2131.4 781986058 782004595 781907856 781833649 781909823 782096446 782235086 782257080 782215714 782207370 782328010 782588303
2153.9 782588303 782869279 783093989 783282578 783505201 783871174 784386933 784925997 785417736 785914719 786474168
2174.3 786474168 787117839 787826121 788517833 789110661 789607227 790098846 790688336 791352928 791971087 792466998
2194.6 792466998 792847753 793227255 793733537 794356465 794961512 795437217 795820951 796236098 796755075 797368944
2215 797368944 797979593 798444927 798756957 799047887 799453795 799984694 800480068 800799966 800997019 801200151
2235.4 801200151 801502228 801933706 802374661 802671611 802824736 802976072 803245544 803615808 803992629 804252028
$$ packed form
2088.6G78837740J39058K93970L18051J88052P3731J03176K05993K94626K99454K10643
2109G80964494J19984J03354J44124J91331J50025K4319n9843m1068O6161J69516J53661
2131.4G81986058J8537r6739p4207P6174J86623J38640K1994m1366q344J20640K60293
2153.9G82588303K80976K24710J88589K22623L65973N15759N39064M91739M96983N59449
2174.3G86474168O43671P08282O91712N92828M96566M91619N89490O64592O18159M95911
2194.6G92466998L80755L79502N06282O22928O05047M75705L83734M15147N18977O13869
2215G97368944O10649M65334L12030K90930M05908N30899M95374L19898J97053K03132
2235.4H01200151L02077M31478M40955K96950J53125J51336K69472L70264L76821K59399
$$ plain form
2255.8 804252028 804366112 804503798 804821134 805241048 805599093 805814505 805937469 806117296 806436598 806830108
2276.2 806830108 807154536 807333171 807419717 807568133 807900488 808335721 808646917 808781087 808880985 809025764
2296.6 809025764 809260190 809561133 809802175 809970260 810170650 810467243 810846269 811227262 811526239 811752737
2317 811752737 811980367 812292218 812652290 812903523 813050330 813171506 813176513 813062072 813003719 813073933 813102484
2339.5 813102484 812839389 812250435 811393797 810698807 810663104 811211944 811899543 812435389 812699914 812591791
2359.9 812591791 812245429 811665237 810869157 809954286 808953643 807991922 807102501 806226134 805402339
2378.2 805402339 804697454 804138720 803718150 803380489 803065419 802738607 802438617 802208185 801968157 801658213
2398.6 801658213 801314354 800939023 800509334 800056636 799620569 799176335 798659742 798073113 797481239 796910763
$$ packed form
2255.8H04252028J14084J37686L17336M19914L58045K15412J22964J79827L19302L93510
2276.2H06830108L24428J78635Q6546J48416L32355M35233L11196J34170R9898J44779
2296.6H09025764K34426L00943K41042J68085K00390K96593L79026L80993K98977K26498
2317H11752737K27630L11851L60072K51233J46807J21176N007j14441n8353P0214K8551
2339.5H13102484k63095n88954q56638o94990l5703N48840O87599N35846K64525j08123
2359.9H12591791l46362n80192p96080r14871j000643r61721q89421q76367q23795
2378.2H05402339p04885n58734m20570l37661l15070l26812k99990k30432k40028l09944
2398.6H01658213l43859l75331m29689m52698m36067m44234n16593n86629n91874n70476
$$ plain form
2419 796910763 796324968 795692742 795024216 794321597 793602705 792886376 792164445 791428149 790657222 789842427
2439.4 789842427 789018214 788228750 787489593 786766469 786011517 785232723 784426033 783620954 782910109 782244325
2459.8 782244325 781489313 780673444 779911399 779222548 778563976 777905166 777226388 776517689 775799155 775104523
2480.2 775104523 774472058 773884416 773273587 772663593 772105575 771606207 771161675 770741642 770310044 769858599
2500.6 769858599 769421041 769008279 768602490 768178403 767705977 767220855 766742408 766246498 765752256 765232503
2521 765232503 764634788 763978243 763292849 762585640 761858106 761108398 760297656 759446323 758656442 757886708
2541.4 757886708 757035851 756150901 755285680 754416943 753546476 752707183 751905680 751104355 750260949 749382317
2561.8 749382317 748529494 747739673 746967435 746174634 745368302 744549692 743735373 742956281 742217064 741467535
$$ packed form
2419G96910763n85795o32226o68526p02619p18892p16329p21931p36296p70927q14795
2439.4G89842427q24213p89464p39157p23124p54952p78794q06690q05079p10845o65784
2459.8G82244325p55012q15869p62045o88851o58572o58810o78778p08699p18534o94632
2480.2G75104523o32465n87642o10829o09994n58018m99368m44532m20033m31598m51445
2500.6G69858599m37558m12762m05789m24087m72426m85122m78447m95910m94242n19753
2521G65232503n97715o56545o85394p07209p27534p49708q10742q51333p89881p69734
2541.4G57886708q50857q84950q65221q68737q70467q39293q01503q01325q43406q78632
2561.8G49382317q52823p89821p72238p92801q06332q18610q14319p79092p39217p49529
$$ plain form
2582.2 741467535 740673304 739894390 739201009 738591611 738015294 737439096 736847937 736229241 735633016 735088170
2602.6 735088170 734503627 733798862 732987523 732120156 731209040 730225921 729191363 728098392 726892889
2620.9 726892889 725603819 724304080 723002553 721646428 720212758 718700290 717125893 715593100
2637.2 715593100 714137197 712666154 711157978 709648609 708119988 706585228 705089629 703617811
2653.5 703617811 702143192 700681448 699253201 697853863 696479499 695117176 693758547 692430437
2669.9 692430437 691135824 689862967 688634276 687465191 686328828 685181916 684023798 682874680
2686.2 682874680 681708634 680510640 679308712 678086281 676810086 675505340 674186051 672820747
2702.5 672820747 671417773 669986129 668492138 666979969 665529191 664147258 662834108 661569953
$$ packed form
2582.2G41467535p94231p78914o93381o09398n76317n76198n91159o18696n96225n44846
2602.6G35088170n84543p04765q11339q67367r11116r83119j034558j092971j205503
2620.9G26892889j289070j299739j301527j356125j433670j512468j574397j532793
2637.2G15593100j455903j471043j508176j509369j528621j534760j495599j471818
2653.5G03617811j474619j461744j428247j399338j374364j362323j358629j328110
2669.9F92430437j294613j272857j228691j169085j136363j146912j158118j149118
2686.2F82874680j166046j197994j201928j222431j276195j304746j319289j365304
2702.5F72820747j402974j431644j493991j512169j450778j381933j313150j264155
$$ plain form
2718.8 661569953 660306394 659039736 657793283 656637311 655608356 654609144 653564036 652501762
2735.1 652501762 651491463 650560498 649661124 648744702 647788346 646821856 645895779 644987285 644093931
2753.5 644093931 643261194 642459273 641644418 640860558 640158474 639479518 638715863 637840927 636893928 635920763
2773.9 635920763 634939551 633919418 632821620 631627738 630327523 628931940 627503216 626042187
2790.2 626042187 624461114 622739553 620913386 619024694 617104769 615118146 613000333 610748649
2806.5 610748649 608402371 606013060 603616536 601161897 598586559 595888555 593095899 590245843
2822.8 590245843 587341964 584355116 581262469 578041792 574696302 571288705 567843139 564231992
2839.1 564231992 560328066 556145728 551730037 547182262 542671263 538323939 534286857 530665874
$$ packed form
2718.8F61569953j263559j266658j246453j155972j028955r99212j045108j062274
2735.1F52501762j010299r30965q99374r16422r56356r66490r26077r08494q93354
2753.5F44093931q32737q01921q14855p83860p02084o78956p63655q74936r46999r73165
2773.9F35920763r81212j020133j097798j193882j300215j395583j428724j461029
2790.2F26042187j581073j721561j826167j888692j919925j986623k117813k251684
2806.5F10748649k346278k389311k396524k454639k575338k698004k792656k850056
2822.8E90245843k903879k986848l092647l220677l345490l407597l445566l611147
2839.1E64231992l903926m182338m415691m547775m510999m347324m037082l620983
$$ plain form
2855.5 530665874 527351916 524082422 520576000 516594231 511986971 506746888 501020849 494990647
2871.8 494990647 488763422 482449353 476287395 470601171 465676606 461680144 458595216 456291586
2888.1 456291586 454673648 453604937 452854276 452229440 451571286 450750321 449711531 448411852 446783632
2906.5 446783632 444757253 442258030 439212710 435586005 431466073 427107096 422780186 418706864
2922.8 418706864 415140241 412370414 410622984 410014361 410671830 412735909 416180342 420776397 426242381
2941.1 426242381 432299107 438692272 445252717 451942414 458744168 465532869 472225547 478815973
2957.4 478815973 485271215 491499871 497338206 502669096 507521808 511998355 516248345 520398438
2973.8 520398438 524462521 528455436 532365441 536056817 539409816 542419016 545108676 547499835
$$ packed form
2855.5E30665874l313958l269494l506422l981769m607260n240083n726039o030202
2871.8D94990647o227225o314069o161958n686224m924565l996462l084928k303630
2888.1D56291586j617938j068711p50661o24836o58154q20965j038790j299679j628220
2906.5D46783632k026379k499223l045320l626705m119932m358977m326910m073322
2922.8D18706864l566623k769827j747430o08623O57469K064079L444433M596055N465984
2941.1D26242381O056726O393165O560445O689697O801754O788701O692678O590426
2957.4D78815973O455242O228656N838335N330890M852712M476547M249990M150093
2973.8E20398438M064083L992915L910005L691376L352999L009200K689660K391159
$$ plain form
2990.1 547499835 549573183 551259100 552603662 553645909 554309368 554632843 554657042 554286599 553569734
3008.4 553569734 552647293 551461756 549916744 548046768 545944273 543671668 541260064 538730502
3024.7 538730502 536075652 533349991 530621231 527848482 524912894 521803498 518695056 515650451
3041.1 515650451 512549043 509322107 506038189 502788246 499534577 496224880 492895484 489552736
3057.4 489552736 486204386 482900053 479661047 476475626 473255545 469933271 466578215 463297606
3073.7 463297606 460153818 457086086 453934193 450679094 447421283 444150031 440892667 437728584
3090 437728584 434552997 431304783 428126514 425095856 422088444 418997377 415910184 412940085 410029739
3108.4 410029739 407049924 404110402 401372969 398686022 395848393 392846048 389775276 386786759
$$ packed form
2990.1E47499835K073348J685917J344562J042247O63459L23475K4199l70443p16865
3008.4E53569734r22441j185537j545012j869976k102495k272605k411604k529562
3024.7E38730502k654850k725661k728760k772749k935588l109396l108442l044605
3041.1E15650451l101408l226936l283918l249943l253669l309697l329396l342748
3057.4D89552736l348350l304333l239006l185421l220081l322274l355056l280609
3073.7D63297606l143788l067732l151893l255099l257811l271252l257364l164083
3090D37728584l175587l248214l178269l030658l007412l091067l087193k970099k910346
3108.4D10029739k979815k939522k737433k686947k837629l002345l070772k988517
$$ plain form
3124.7 386786759 383963138 381211370 378405184 375606358 372987628 370549172 368087292 365429312
3141 365429312 362672746 360017598 357486784 355112910 352892816 350559056 347976983 345398456 342987508
3159.4 342987508 340677798 338418812 336186677 333973885 331795275 329682112 327638954 325641811
3175.7 325641811 323673338 321696192 319694549 317725152 315822124 313969254 312147737 310330153
3192 310330153 308520466 306715280 304928988 303237826 301648915 300088495 298514247 296948493 295447052
3210.3 295447052 294015110 292585939 291115731 289640993 288228065 286870033 285508037 284165591
3226.7 284165591 282935530 281835675 280755758 279520631 278155923 276871443 275715262 274645060
3243 274645060 273670197 272705466 271632493 270538688 269562811 268643230 267658859 266649544 265728354
$$ packed form
3124.7C86786759k823621k751768k806186k798826k618730k438456k461880k657980
3141C65429312k756566k655148k530814k373874k220094k333760k582073k578527k410948
3159.4C42987508k309710k258986k232135k212792k178610k113163k043158j997143
3175.7C25641811j968473j977146k001643j969397j903028j852870j821517j817584
3192C10330153j809687j805186j786292j691162j588911j560420j574248j565754j501441
3210.3B95447052j431942j429171j470208j474738j412928j358032j361996j342446
3226.7B84165591j230061j099855j079917j235127j364708j284480j156181j070202
3243B74645060r74863r64731j072973j093805r75877r19581r84371j009315r21190
$$ plain form
3261.3 265728354 264888763 264077932 263334304 262674540 261955291 261107683 260225177 259361237 258553773 257807702
3281.7 257807702 257076412 256365746 255718261 255165547 254645377 254021198 253250599 252384037 251572132 250983715
3302.1 250983715 250540018 249993697 249223471 248303533 247366071 246465504 245613381 244819477 244069666 243402228
3322.5 243402228 242772117 241962746 240991771 240095958 239342615 238713831 238164648 237507835 236652598 235751480
3342.9 235751480 234893844 234125942 233526006 232884869 231980279 231006458 230207890 229558796 228906482 228212491
3363.3 228212491 227661818 227255881 226667747 225747362 224789366 224095300 223526552 222886086 222198993 221582010
3383.7 221582010 221142232 220937118 220924944 220829546 220412627 219875321 219635919 219669089 219437093 218809962
3404.1 218809962 218312845 218143508 218058988 217942551 217726693 217414349 217210993 217160419 217125833 217167318
$$ packed form
3261.3B65728354q39591q10831p43628o59764p19249q47608q82506q63940q07464p46071
3281.7B57807702p31290p10666o47485n52714n20170o24179p70599q66562q11905n88417
3302.1B50983715m43697n46321p70226r19938r37462r00567q52123p93904p49811o67438
3322.5B43402228o30111q09371r70975q95813p53343o28784n49183o56813q55237r01118
3342.9B35751480q57636p67902n99936o41137r04590r73821p98568o49094o52314o93991
3363.3B28212491n50673m05937n88134r20385r57996o94066n68748o40466o87093o16983
3383.7B21582010m39778k05114j2174r5398m16919n37306k39402L3170k31996o27131
3404.1B18809962m97117j69337q4520j16437k15858l12344k03356n0574l4586M1485
$$ plain form
3424.5 217167318 217409819 217780635 218058124 218312010 218715191 218958616 218840212 218737230 218935981 219350293
3444.9 219350293 219810098 220200762 220577344 221015960 221520916 222150192 222922608 223636150 224281490 225140080
3465.3 225140080 226144761 226852968 227154374 227503598 228180155 229102299 230017483 230686381 231324345
3483.6 231324345 232204705 233094350 233841091 234686479 235693455 236755297 237751141 238668278 239588067
3502 239588067 240412340 241113275 241914660 242981091 244282678 245501369 246413752 247291923 248407885
3520.4 248407885 249726146 250905126 251791507 252701879 253829867 255141139 256616622 258059561 259326309
3538.7 259326309 260675758 262203723 263693541 264990300 266284943 267783672 269449502 271196336
3555 271196336 273046046 275064945 277150989 279069752 280869156 283174008 286046594 288786113 291307002
$$ packed form
3424.5B17167318K42501L70816K77489K53886M03181K43425j18404j02982J98751M14312
3444.9B19350293M59805L90664L76582M38616N04956O29276P72416P13542O45340Q58590
3465.3B25140080J004681P08207L01406L49224O76557R22144R15184O68898O37964
3483.6B31324345Q80360Q89645P46741Q45388J006976J061842R95844R17137R19789
3502B39588067Q24273P00935Q01385J066431J301587J218691R12383Q78171J115962
3520.4B48407885J318261J178980Q86381R10372J127988J311272J475483J442939J266748
3538.7B59326309J349449J527965J489818J296759J294643J498729J665830J746834
3555B71196336J849710K018899K086044J918763J799404K304852K872586K739519K520889
$$ plain form
3573.4 291307002 293930054 296768546 299841672 303116828 306341588 309313178 312328428 315788686
3589.7 315788686 319266826 322632313 326283813 330256522 334208906 338094980 341927648 345548302
3606 345548302 349245310 353256017 357441545 361772299 365918905 370002568 374724180 379489273 383596778
3624.4 383596778 387139380 390998602 395975560 400923789 405513704 409920007 414181948 418485940
3640.7 418485940 422795236 426810086 430476516 434637010 439795345 444647342 448891759 453445792
3657 453445792 458230585 462492466 466322273 470053166 473488390 476737261 480509222 484136462 487351358
3675.4 487351358 491109550 495078385 498793662 502288640 505531549 508389175 510918021 513737619
3691.7 513737619 516844213 519793570 522409916 524658322 526844859 529381454 531938553 533984601
$$ packed form
3573.4B91307002K623052K838492L073126L275156L224760K971590L015250L460258
3589.7C15788686L478140L365487L651500L972709L952384L886074L832668L620654
3606C45548302L697008M010707M185528M330754M146606M083663M721612M765093M107505
3624.4C83596778L542602L859222M976958M948229M589915M406303M261941M303992
3640.7D18485940M309296M014850L666430M160494N158335M851997M244417M554033
3657D53445792M784793M261881L829807L730893L435224L248871L771961L627240L214896
3675.4D87351358L758192L968835L715277L494978L242909K857626K528846K819598
3691.7E13737619L106594K949357K616346K248406K186537K536595K557099K046048
$$ plain form
3708 533984601 535458326 537145793 539704025 542319715 544455886 546246707 547942519 549619019 551382959
3726.4 551382959 553391635 555208802 556472480 557543576 559224665 561434865 563231349 563953578
3742.7 563953578 564453125 566117644 567555487 568275511 569842815 572027922 573761523 575091600 576601028
3761 576601028 578105688 579299450 580435693 581556976 582825184 584402144 585923731 587123454 588078618
3779.4 588078618 589105904 590149522 591197133 592412531 593636155 594774783 595743597 596525133 597425759
3797.7 597425759 598089755 598517656 599615753 600672901 601588607 603025556 604429424 605130911 605433285
3816.1 605433285 606105328 606650591 607452691 608901560 610075593 610960066 611745358 612493396 613320231
3834.4 613320231 613737643 613805354 614487767 615675330 616938651 618168235 619143486 619316339 618336797
$$ packed form
3708E33984601J473725J687467K558232K615690K136171J790821J695812J676500J763940
3726.4E51382959K008676J817167J263678J071096J681089K210200J796484P22229
3742.7E63953578M99547J664519J437843P20024J567304K185107J733601J330077J509428
3761E76601028J504660J193762J136243J121283J268208J576960J521587J199723R55164
3779.4E88078618J027286J043618J047611J215398J223624J138628R68814P81536R00626
3797.7E97425759O63996M27901J098097J057148R15706J436949J403868P01487L02374
3816.1F05433285O72043N45263Q02100J448869J174033Q84473P85292P48038Q26835
3834.4F13320231M17412O7711O82413J187563J263321J229584R75251J72853r79542
$$ plain form
3852.8 618336797 618450344 620306790 621894717 622654021 622800052 623116255 623808742 624185503 624644876
3871.2 624644876 625566661 626618981 627532899 627897859 628291309 629012048 629469693 630085766 630704343
3889.5 630704343 630957007 631584108 632517517 632935226 632781923 632649899 632921755 633787930 634915054
3907.9 634915054 635720134 636157155 636428773 636542320 636682212 637126386 637600422 637877703 638217628 638637424
3928.3 638637424 638882756 639130771 639633417 640159547 640521824 640739501 640948057 641347528 641733944 641913593
3948.7 641913593 642140746 642526031 642920256 643254757 643579900 643875599 644137383 644448578 644740760 644964278
3969.1 644964278 645213604 645511508 645820081 646104455 646312416 646515608 646815538 647127271 647352695 647578537
3989.5 647578537 647854507 648103714 648309767 648521900
$$ packed form
3852.8F18336797J13547J856446J587927P59304J46031L16203O92487L76761M59373
3871.2F24644876R21785J052320R13918L64960L93450P20739M57645O16073O18577
3889.5F30704343K52664O27101R33409M17709j53303j32024K71856Q66175J127124
3907.9F34915054Q05080M37021K71618J13547J39892M44174M74036K77281L39925M19796
3928.3F38637424K45332K48015N02646N26130L62277K17677K08556L99471L86416J79649
3948.7F41913593K27153L85285L94225L34501L25143K95699K61784L11195K92182K23518
3969.1F44964278K49326K97904L08573K84374K07961K03192K99930L11733K25424K25842
3989.5F47578537K75970K49207K06053K12133
$$ plain form
3997.6 648521900
$$ packed form
3997.6F48521900
##END=$$ End of the data block
