##TITLE=$$ Begin of the data block
##JCAMP-DX=5.00 $$ ACD/SpecManager v 10.08
##SPECTROMETER/DATA SYSTEM=Alpha
##DATE=23 Dec 2014 09:14:34
##DATA TYPE=INFRARED SPECTRUM
##DATA CLASS=XYDATA
##ORIGIN=
##OWNER=
##NPOINTS=1765
##FIRSTX=399.76428223
##LASTX=3997.64306641
##MAXX=3997.64306641
##MINX=399.76428223
##MAXY=0.81471628
##MINY=0.14913474
##XFACTOR=1.0000000000
##YFACTOR=1.000000000000000e-9
##FIRSTY=0.45645627
##DELTAX=2.03961372
##XUNITS=1/CM
##YUNITS=ARBITRARY UNITS
##XYDATA=(X++(Y..Y))
399.8 456456274 450921863 446929783 444229543 443426192 444481462 446520269 448474109 449401438 449027508
418.1 449027508 447900921 446360976 444031179 441196561 437952638 434200287 430574954 427669674
434.4 427669674 425983906 426214635 428661734 433107316 438650101 443845093 447838575 450614005 452281594
452.8 452281594 452813298 452376366 451293796 449733883 447400004 444318891 440814823 437100142 433241874
471.2 433241874 429349571 426136971 423811108 421996981 420630336 419851422 419748694 419978201 419836402
489.5 419836402 419011354 417631477 415788591 413649201 411367357 408702314 405656815 402576596 399370492
507.9 399370492 395760328 391696066 387248069 382335901 377209783 372589290 368893683 366281509
524.2 366281509 364727914 364076197 364187390 365155280 367502898 371637255 377285779 383608639 389422446
542.5 389422446 393616766 395826161 396412373 395740807 393983781 391340703 387988716 383970052 379195243
560.9 379195243 373452216 366630107 358946502 351305038 345111877 341296971 340134352 341662467
577.2 341662467 345700949 351915479 359764278 368140757 375652224 381360263 385106772 387175173
593.5 387175173 388130188 388412148 388173550 387687027 387252480 387037039 387182474 387752682 388802946 390525758
613.9 390525758 393011838 396230191 400043309 404178381 408426881 412638366 416645944 420126438
630.2 420126438 422942609 425339907 427426606 429157436 430668890 432053357 433345050 434663415
646.6 434663415 436051577 437436253 438746363 439952850 441105127 442275345 443383098 444354564 445300519
664.9 445300519 446777642 448914349 450498223 451965541 453753561 455600590 457440645 459252715
681.2 459252715 460934132 462409943 463502020 463958114 463724077 462865114 461318403 458883941 455566913
699.6 455566913 451782495 448151290 445275247 443665773 443636864 445195794 448170811 452464402 457933962
717.9 457933962 464290649 471134394 478163123 485166162 491813064 497855812 503168762 507692575
734.3 507692575 511379778 514175594 516136050 517068982 516591549 514600873 511188090 506562054 501197040
752.6 501197040 495485038 489632666 483998626 479106128 475509286 473790675 474408746 477564216 483210653
771 483210653 490972102 500330448 510751486 521486700 531626880 540535927 548141122 554659843
787.3 554659843 560342968 565470994 570313215 575028360 579876721 585114241 590429366 595140219
803.6 595140219 598893940 601678550 603560627 604840398 605892658 606852114 607567191 607821703 607484221
822 607484221 606476963 604647875 601664841 597286522 591631532 585147619 578439951 572011650 565989435
840.3 565989435 560236454 554681242 549461424 544639468 539878011 534662545 528690577 522067547
856.6 522067547 515852451 512553453 514762819 522817373 534873605 549033284 564026058 578373551
873 578373551 590243816 598232567 601961672 601808190 598474443 592894793 585998714 578546822 571122944
891.3 571122944 564074934 557608962 551704705 546019614 540088296 533444464 525704503 516692102
907.6 516692102 506416023 494998962 482718587 470088452 457972109 447554886 439848155 435067564
923.9 435067564 432610869 431682467 431961358 433614880 436674148 440840960 445896327 451745957 457791656
942.3 457791656 462352663 463183761 458882838 449600130 436510891 420949668 403925091 386041939
958.6 386041939 367626339 348828673 329674751 310184091 290452838 270684808 251196533
972.9 251196533 232353091 214609087 198525503 184616148 173175275 164274409 157798320 153419137
989.2 153419137 150759593 149459407 149134740 149485096 150297508 151294142 152164906 152666330 152720407 152435929
1009.6 152435929 151982650 151642263 151742563 152462080 153825849 155814230 158380345 161448374 164848119
1028 164848119 168327600 171692461 174685597 176952437 178333327 179051951 179504603 180022255 180828005
1046.3 180828005 182180926 184465155 188056916 193095714 199431732 206909388 215502962 225154430
1062.6 225154430 235116705 243139312 245868936 241344765 231411472 220658481 212821662 208888128
1079 208888128 208135396 209612891 212667629 216856256 221897408 227666587 233918354 240038916 245215103
1097.3 245215103 248844787 250833571 251782745 252738535 254614353 257741958 261848599 266369551 270750284
1115.7 270750284 274578631 277591318 279811114 281677067 283954501 287335277 291928411 297003597
1132 297003597 301187277 303026348 301636487 297033697 289979488 281616628 273059726 265157759 258481443
1150.3 258481443 253383726 249978229 248162583 247824624 249019071 251974940 256960750 264132112
1166.7 264132112 273464382 284776539 297724932 311853349 326657265 341705143 356676042
1180.9 356676042 371274918 385151297 397836506 408844322 417793095 424539477 429291487 432597756
1197.3 432597756 435094684 437262028 439433753 441878438 444887787 448794335 453783959 459607482
1213.6 459607482 465655386 471278250 475887626 479093432 480836391 481195241 480322778 478565425 476327717
1231.9 476327717 473938107 471670091 469677329 468011171 466846108 466497749 467193037 468872070 471189469
1250.3 471189469 473720402 476098895 478096664 479677022 480940580 482082695 483439237 485355884
1266.6 485355884 487891078 490720928 493246973 494920433 495569617 495358288 494615704 493707776 492826104
1285 492826104 491914392 490861982 489572853 487917811 485851437 483469993 480891526 478212506 475523949
1303.3 475523949 472860485 470281541 468002886 466183662 464702308 463316679 461875975 460295737
1319.6 460295737 458247274 455088854 450387299 444348812 437710077 431285620 425649971 421144158
1336 421144158 417945415 416174561 415733159 416105688 416774124 417354226 417579710 417407185 416892409 416096032
1356.4 416096032 415075064 413908899 412769109 411914498 411339492 411037803 411180526 411824584 412976921
1374.7 412976921 414320499 415558904 416826338 418545842 421296149 425580323 430478275 434281558
1391 434281558 436694920 437802404 437660813 436623931 435163230 433378816 431171298 428815275 426379502
1409.4 426379502 423829168 421459824 419473320 417789668 416654736 416369945 416694194 417467922 418608487
1427.7 418608487 420151502 422002047 423873365 426126271 428907663 431346864 433477312 435296386
1444.1 435296386 436499357 436889082 436427623 435273230 433602035 431244910 429253191 429157078 430261642
1462.4 430261642 432865858 437245101 442559719 449549556 460377157 472776890 483576238 493195385
1478.7 493195385 502342761 511165977 519022644 526301026 533924460 541536868 547526300 552643716
1495 552643716 558314204 563868165 568359137 571767211 574940801 579439163 583814621 587050676 589763761
1513.4 589763761 592162371 594683230 597235978 600008547 602761507 605046749 607228458 609088540
1529.7 609088540 610626519 612191677 613515437 614185095 614615500 615398467 616301358 616945803 617092013
1548.1 617092013 616812170 616298318 615541160 614399910 612485826 610715568 609900773 608667433 606936336
1566.4 606936336 604858994 602598131 600761652 598693490 595941007 593687952 591808736 589608908
1582.8 589608908 587225378 584756434 582155108 579410672 576636732 573867142 571084797 568219125
1599.1 568219125 565162420 561977804 558755338 555448830 551946163 548417151 544937134 540907919
1615.4 540907919 536344111 532921851 529940546 526370049 522968948 519880533 517026126 514764011
1631.7 514764011 512713194 510594189 509471714 509235561 509274065 509492874 510255694 511994481 513709486
1650.1 513709486 515854239 520123720 524111331 527450383 531205833 535875499 540966034 545386553
1666.4 545386553 550192952 556245089 561868966 567536533 573804736 579394639 584375441 589941084
1682.7 589941084 597619772 604519725 609950900 615396857 620141447 624720097 629491270 633846045
1699 633846045 638487041 642259955 645285666 648424149 651208699 653492033 655395746 657207251 659639657
1717.4 659639657 662378550 664578915 666554391 668705821 670884848 673015773 675003767 677317321
1733.7 677317321 680082142 682424605 684782147 687465072 690240979 693079174 696069717 699650705
1750 699650705 703821123 707631350 711097658 714435875 717411935 720419765 723345220 725815237 727909863
1768.4 727909863 729692459 731539011 733643413 735611856 737329960 738874793 740278304 741607547
1784.7 741607547 742979884 744290054 745425642 746671438 748011708 749192417 750325203 751644373
1801 751644373 753053188 754239857 755166233 756013215 757045567 758263528 759399176 760294139 761044681
1819.4 761044681 761748672 762459159 763310194 764121413 764680862 765273511 766028821 766780555 767535627 768176079
1839.8 768176079 768433690 768415213 768724620 769425809 770150483 770673692 770897746 770983994 771181226 771637082
1860.2 771637082 772200465 772530079 772468090 772318900 772660255 773435891 774186909 774673164 774931133 775153935
1880.5 775153935 775554359 776187301 776828825 777218342 777456582 777727604 778086782 778621793 779161692 779455721
1900.9 779455721 779498041 779512286 779700756 780064523 780433655 780594468 780508518 780414164 780639708 781056702
1921.3 781056702 781413436 781661749 781765282 781842351 782080710 782436967 782722354 782824695 782735050 782644808
1941.7 782644808 782876015 783366144 783753216 783936560 784063697 784282267 784626305 785010576 785327077 785514474
1962.1 785514474 785609901 785727024 785998046 786384881 786697388 786859512 786943853 787045538 787228286 787489712
1982.5 787489712 787693262 787742019 787687123 787648797 787758291 787989736 788141906 788128078 788046598 787986517 787943780
2005 787943780 787841201 787642658 787363231 787010789 786605120 786212444 785836935 785349905 784653664 783900380
2025.4 783900380 783425927 783196211 782913566 782524586 782076418 781556427 781005681 780559897 780267954 780020952
2045.8 780020952 779742539 779466331 779243231 779123366 779122770 779189944 779242456 779225230 779174566 779203773 779379666
2068.2 779379666 779601753 779716253 779703259 779679060 779734433 779885590 780083299 780200541 780199230 780196965 780332327
2090.6 780332327 780618608 780929565 781128109 781236708 781365097 781584203 781902134 782196581 782372713 782471418
2111 782471418 782571077 782728732 782948554 783135414 783177257 783098221 783036530 783083022 783234477 783402503 783443987
2133.5 783443987 783367395 783322632 783398807 783563197 783715189 783765852 783731341 783723772 783834755 784074128 784348011
2155.9 784348011 784570754 784760237 785008550 785402238 785907149 786438048 786967814 787491858 788027704 788635015
2176.3 788635015 789329410 790041029 790672958 791197538 791691899 792266071 792926848 793551385 794026852 794370651
2196.7 794370651 794740438 795260489 795879960 796489000 797019720 797448993 797853947 798354566 798963189 799573898
2217.1 799573898 800043464 800355077 800659955 801111639 801682293 802178085 802472532 802627802 802801788 803124249
2237.5 803124249 803589880 804043412 804340720 804494500 804652750 804938912 805327415 805687129 805903673 806012809
2257.9 806012809 806168556 806467474 806872010 807256520 807498097 807621181 807802260 808162987 808585167 808860660
2278.3 808860660 808986723 809102774 809321105 809668183 810041964 810292780 810422122 810527682 810659945 810900092
2298.7 810900092 811233819 811519027 811707616 811890721 812172651 812548995 812930048 813225627 813422382 813592255
2319.1 813592255 813815534 814108312 814410150 814634562 814716280 814664304 814581037 814534366 814487755 814353049
2339.5 814353049 814098060 813663840 812938511 812325776 812286913 812758029 813388109 813866675 814073861 814031839
2359.9 814031839 813747048 813110948 812294424 811485589 810626090 809740901 808875859 808009267 807196081 806480050
2380.2 806480050 805889547 805469036 805160582 804877162 804590642 804290295 803996146 803723633 803449988 803168416
2400.6 803168416 802845359 802430093 801960826 801481664 801000416 800508261 799961448 799348891 798716962 798116446
2421 798116446 797518909 796842515 796100497 795377612 794685066 793963969 793204367 792458653 791720867 790938675
2441.4 790938675 790122747 789336324 788578570 787795246 786994100 786216795 785475135 784743607 784002185 783247888
2461.8 783247888 782493651 781766593 781083882 780430675 779751837 779042423 778335512 777617693 776908100 776292264
2482.2 776292264 775743365 775142372 774513006 773950875 773460329 773011446 772598028 772172034 771708071 771276236
2502.6 771276236 770868421 770425797 769994676 769584298 769126892 768631577 768155575 767674744 767125189 766502261
2523 766502261 765822291 765124738 764447451 763760030 763035417 762247086 761389017 760541916 759734154 758911729
2543.4 758911729 758074760 757211089 756299019 755415738 754608572 753827095 753010511 752140999 751261175 750433087
2563.8 750433087 749663949 748896837 748104990 747310221 746515870 745718420 744929314 744158804 743372083 742574573
2584.2 742574573 741834044 741159856 740556419 739993989 739398301 738772035 738159597 737614453 737104297 736482322
2604.6 736482322 735715747 734899402 734056592 733150542 732170463 731134117 730039954 728858709 727615118
2623 727615118 726331353 724967778 723555148 722142041 720656693 719080448 717525899 716052413 714597046
2641.3 714597046 713088810 711536705 709977031 708458841 707017124 705600083 704141557 702656925
2657.6 702656925 701201379 699790478 698416233 697041512 695649624 694314241 693068802 691866815
2673.9 691866815 690668523 689476550 688315392 687169194 686019838 684870899 683699429 682495117
2690.3 682495117 681282043 680058360 678797781 677508116 676198244 674830019 673388898 671912551
2706.6 671912551 670434117 668974817 667548001 666162550 664838433 663555622 662274599 661001980
2722.9 661001980 659771383 658636689 657596350 656570613 655529022 654498994 653502285 652562022 651663303
2741.2 651663303 650734782 649751902 648773015 647829950 646913826 646049976 645236790 644441009 643664539 642900467
2761.6 642900467 642149389 641414821 640635490 639775932 638871074 637944341 636991978 635971546 634842694
2780 634842694 633614182 632294655 630903840 629494667 628052771 626470387 624703884 622839689 620972812
2798.4 620972812 619096220 617128551 614996910 612695634 610314071 607956648 605599046 603121817
2814.7 603121817 600481570 597740531 594967127 592173338 589309990 586315572 583166480 579883993
2831 579883993 576530993 573142767 569667339 566013038 562120557 557968140 553558528 548995912 544453144
2849.3 544453144 540097237 536083758 532451332 529079020 525743961 522188187 518166423 513512790
2865.7 513512790 508225501 502434492 496323228 490050077 483734429 477574468 471877396 466929883
2882 466929883 462889701 459754556 457420826 455783457 454712003 454002231 453414559 452749521 451919347
2900.3 451919347 450888067 449575424 447894692 445824772 443330646 440303802 436690807 432582289
2916.6 432582289 428180516 423777550 419695258 416161299 413383365 411625952 411051244 411738217 413786650
2935 413786650 417185068 421756119 427259415 433375031 439785570 446350724 453049928 459842503 466648221
2953.4 466648221 473402739 480062217 486581624 492848784 498691231 504036546 508910656 513408065
2969.7 513408065 517716885 521952271 526107371 530181706 534146905 537873447 541258037 544321060
2986 544321060 547085226 549539447 551648259 553366184 554744184 555822849 556551874 556926906 556944489
3004.4 556944489 556571126 555889845 554984987 553775847 552196741 550320506 548249364 546026468 543663561
3022.7 543663561 541150391 538493633 535787702 533048928 530201256 527215242 524145961 521119118
3039 521119118 518115163 514989376 511704266 508339465 505032837 501807272 498532176 495173097 491790354
3057.4 491790354 488426685 485114574 481868565 478679925 475450426 472095966 468692988 465371877
3073.7 465371877 462213904 459161073 456028730 452769548 449473590 446152717 442863494 439668834
3090 439668834 436440021 433137804 429949671 426953137 423964232 420828789 417671919 414679140 411781698
3108.4 411781698 408797324 405833274 403059870 400334924 397498101 394511610 391406238 388349056
3124.7 388349056 385466278 382709533 379947543 377143413 374426663 371884167 369397730 366776288
3141 366776288 364054948 361398160 358833790 356404364 354129851 351792276 349217921 346592337 344133943
3159.4 344133943 341827035 339588344 337364078 335137576 332935691 330799311 328720659 326661170
3175.7 326661170 324601829 322559446 320555568 318589926 316671491 314809978 312975675 311148375
3192 311148375 309344262 307563722 305822372 304140478 302511245 300910264 299303651 297699720 296157300
3210.3 296157300 294690281 293246657 291785538 290299326 288834095 287430823 286075473 284757018
3226.7 284757018 283493966 282319754 281195968 279993117 278691709 277401894 276199967 275116056
3243 275116056 274129480 273145288 272082746 270990908 269962877 268989027 267996758 267009616 266105860
3261.3 266105860 265251309 264407068 263672113 263062954 262365133 261509418 260615408 259708792 258845925 258091748
3281.7 258091748 257394880 256705761 256064951 255530715 254992515 254284441 253449291 252626270 251889080 251283526
3302.1 251283526 250787050 250219017 249437764 248510748 247578308 246697158 245852798 245063066 244339719 243658543
3322.5 243658543 242969394 242143482 241181821 240289286 239533812 238869444 238262355 237564281 236723065 235872418
3342.9 235872418 235042512 234274551 233654425 232974187 232038856 231043130 230222240 229570121 228932023 228256628
3363.3 228256628 227714136 227283716 226656169 225733176 224796444 224097759 223529816 222943127 222330734 221750677
3383.7 221750677 221317917 221104786 221045583 220855922 220351666 219818398 219628766 219653055 219385743 218779996
3404.1 218779996 218336016 218175352 218060866 217921555 217722490 217460543 217265785 217175126 217128947 217177436
3424.5 217177436 217407495 217745021 218001395 218264535 218642294 218868345 218793109 218693018 218854308 219262049
3444.9 219262049 219739035 220151231 220544562 220991120 221508250 222162366 222935528 223590717 224170983 225033894
3465.3 225033894 226083755 226812869 227103427 227446944 228147134 229089767 229993060 230624914 231244594
3483.6 231244594 232156307 233103648 233884946 234720334 235710919 236773476 237807885 238802388 239744678
3502 239744678 240528330 241234004 242084935 243172154 244450688 245653063 246584252 247477144 248575181
3520.4 248575181 249887615 251097858 251975864 252870679 254075587 255440742 256882399 258305758 259593189
3538.7 259593189 261000931 262584358 264067531 265367091 266725898 268274218 269927204 271678388
3555 271678388 273584962 275650382 277749062 279634178 281362861 283651114 286610156 289427578 291960597
3573.4 291960597 294583559 297445923 300565690 303885490 307136744 310149610 313223213 316741347
3589.7 316741347 320311636 323772818 327430546 331356317 335351855 339333832 343174756 346786171
3606 346786171 350564241 354677349 358877003 363172114 367368102 371561140 376306921 381036669 385142386
3624.4 385142386 388690352 392489076 397411793 402407825 407083988 411578327 415911645 420237660
3640.7 420237660 424535722 428563654 432295918 436514020 441684306 446540803 450795293 455353409
3657 455353409 460104108 464336514 468206614 472019821 475472063 478647023 482396871 486069202 489317238
3675.4 489317238 493138343 497175157 500952005 504497111 507705390 510483265 512987018 515831172
3691.7 515831172 518992424 521994829 524656892 526949346 529111266 531543016 534014642 536053836
3708 536053836 537575781 539254367 541757464 544380963 546527088 548272312 549940705 551657796 553478122
3726.4 553478122 555472791 557205260 558377564 559394658 561098099 563396931 565312505 566130519
3742.7 566130519 566604972 568195343 569594562 570278227 571848214 574082792 575870514 577216506 578745782
3761 578745782 580317378 581592500 582784295 583887756 585100412 586641073 588134825 589289546 590180755
3779.4 590180755 591204822 592323542 593434811 594681740 595942438 597101808 598062277 598825455 599686921
3797.7 599686921 600328922 600797117 601936579 603054643 604073286 605554283 606945992 607609451 607854426
3816.1 607854426 608479083 608959615 609718859 611206293 612453520 613370895 614102721 614787161 615653992
3834.4 615653992 616170228 616267264 616928637 618123353 619413137 620659769 621601760 621694863 620709121
3852.8 620709121 620908678 622824848 624420285 625110567 625198960 625531495 626218617 626603186 627148449
3871.2 627148449 628103495 629108310 629992902 630332351 630709529 631526649 632110178 632721245 633275926
3889.5 633275926 633475900 634084582 635067225 635571182 635528326 635468066 635715485 636510193 637544513 638305485
3909.9 638305485 638822556 639216185 639391959 639532328 639941275 640366971 640574038 640864074 641302705 641576171
3930.3 641576171 641786098 642232895 642790794 643236995 643478811 643632233 643981576 644394755 644656956 644934773
3950.7 644934773 645307600 645675480 645993590 646299362 646574736 646835566 647127807 647398949 647699058 648034930
3971.1 648034930 648238420 648364604 648625433 648932815 649188340 649490535 649804115 650044739 650262058 650502384
3991.5 650502384 650763631 651032865 651317120
3997.6 651317120
##END=$$ End of the data block
