##TITLE=$$ Begin of the data block
##JCAMP-DX=5.00 $$ ACD/SpecManager v 10.08
##SPECTROMETER/DATA SYSTEM=Alpha
##DATE=23 Dec 2014 09:14:34
##DATA TYPE=INFRARED SPECTRUM
##DATA CLASS=XYDATA
##ORIGIN=
##OWNER=
##NPOINTS=1765
##FIRSTX=399.76428223
##LASTX=3997.64306641
##MAXX=3997.64306641
##MINX=399.76428223
##MAXY=0.79862624
##MINY=0.18504073
##XFACTOR=1.0000000000
##YFACTOR=1.000000000000000e-9
##FIRSTY=0.49424249
##DELTAX=2.03961372
##XUNITS=1/CM
##YUNITS=ARBITRARY UNITS
##XYDATA=(X++(Y..Y))
399.8 494242489 489296138 484401613 480698854 479956597 482017934 484796852 486410230 487037659 487482995
418.1 487482995 487357020 485814601 482836723 479276627 476276875 473563999 470192403 466480613 463813543
436.5 463813543 463466555 465877771 470559686 475909889 480482459 484257996 487350851 489346683 489790738
454.8 489790738 488699555 487020582 485623717 483729184 480781406 477282107 473783046 470433027
471.2 470433027 467256278 464192152 461178899 458747834 457440972 457204640 457403451 457308710 456809551
489.5 456809551 456225812 455641687 454491228 452358902 449573904 446805000 444464624 441993415 438644111
507.9 438644111 434583277 430386305 426329315 422039688 417068720 411991119 407971412 405517370
524.2 405517370 404327571 403834522 403573900 403819084 405635715 409824759 415944010 422383875 427718997
542.5 427718997 431638241 434287816 435462773 434901983 432905525 430221587 427322656 423941344 419455677
560.9 419455677 413514078 406457871 398948342 391594827 385264874 380918443 379203945 380511075
577.2 380511075 384810328 391381830 399026543 406657815 413682163 419592500 423809528 426065147
593.5 426065147 426724225 426535934 426222742 425988436 425586015 425083697 424916923 425543904 427074343 429099202
613.9 429099202 431250006 433750242 437056482 441225678 445775002 449892581 453208387 456055760
630.2 456055760 458846360 461452574 463490725 464985102 466224164 467429549 468787879 470275700
646.6 470275700 471470028 472211063 473098338 474491805 475964278 477053583 477724373 478420824 479674399
664.9 479674399 481757522 483803600 484629810 485414684 486955583 489172518 491353363 492825955 493731499
683.3 493731499 494640261 495752990 496620774 496572614 495461881 493719488 491646916 489072949 485718042
701.6 485718042 481806695 478359014 476532012 476629049 478150308 480576456 483957022 488687485 494841754
720 494841754 501709759 508352101 514507174 520443201 526365221 531907976 536324978 539387465 541660488
738.3 541660488 543686926 545147240 545183063 543290138 539811432 535574496 531087279 526187122 520601690
756.7 520601690 514772236 509799659 506529510 505083859 505376160 507683337 512543738 520142019 529886842
775.1 529886842 540468335 550549209 559643328 567938328 575451314 581852674 586897790 590900302
791.4 590900302 594868183 599623978 604997635 610161543 614592612 618591547 622608185 626359940
807.7 626359940 629063129 630469441 631227612 632230163 633560121 634276271 633529007 631579340 629131198
826 629131198 626180232 622180164 616820216 610490382 604031742 598075271 592610240 587234378 581801534
844.4 581801534 576654375 572118342 567875862 563099265 557228684 550558448 544457316 541361153
860.7 541361153 543507278 551016510 562283993 575926423 590894938 605423510 617357612 625409305
877 625409305 629568875 630446434 628526211 624123275 617794394 610502541 603314102 596778929 590718269
895.4 590718269 584747016 578709662 572602093 566286027 559291363 551026702 541273355 530329823
911.7 530329823 518689573 506812394 495298833 485131949 477404058 472597033 470286578 469605267
928 469605267 470004261 471536338 474376053 478469253 483637959 489630222 495899737 501081586 503133774
946.4 503133774 500594854 493327469 482169211 468342453 452925265 436491430 419149697 400895804
962.7 400895804 381846637 362217218 342164397 321749449 301182300 280935854 261597514
977 261597514 243750483 227963492 214711368 204229653 196450859 191033363 187571228 185697466
993.3 185697466 185040727 185259685 186055496 187109619 188114494 188795611 188983858 188716576 188220143
1011.6 188220143 187889367 188090205 188972831 190522134 192720324 195579425 199060634 202949166 206904352
1030 206904352 210654244 213934943 216429949 217960343 218694434 218996361 219261304 219843656 221090287
1048.4 221090287 223449603 227296099 232731119 239628926 247843608 257299185 267872125 278731763
1064.7 278731763 287460536 290470392 285636753 274838984 262956530 254101694 249461025 248321354
1081 248321354 249642402 252646714 256888300 262217641 268508196 275327533 281887859 287253410 290869355
1099.4 290869355 292824358 293720305 294520229 296215922 299265444 303412169 308018923 312402725 316036165
1117.7 316036165 318704545 320584655 322181076 324208587 327309847 331635028 336503118 340555549
1134 340555549 342317909 340792865 335902691 328480065 319824457 311071128 302966654 296034634 290655494
1152.4 290655494 287011266 285082161 284755141 285987347 288958669 294011027 301456064 311326295
1168.7 311326295 323276937 336732477 351116717 365975380 381022274 395983189 410399884
1183 410399884 423794150 435802996 446110398 454430878 460648328 464936793 467785090 469855994
1199.3 469855994 471697986 473598927 475752950 478482246 482145607 486926854 492630750 498625606
1215.6 498625606 504143476 508630037 511822462 513597727 513921499 512974262 511160612 508945525 506676376
1234 506676376 504489481 502407968 500568390 499319017 499042660 499854475 501501620 503592610 505856395
1252.3 505856395 508126438 510171473 511717618 512715757 513459325 514469624 516195297 518595040 521143436
1270.7 521143436 523235261 524521291 524980664 524739146 523942590 522828460 521666586 520598054 519603550
1289 519603550 518464625 516894460 514817953 512396157 509865344 507371426 504903078 502373457 499849349
1307.4 499849349 497648716 495963067 494618893 493322045 491875470 490234673 488208085 485189438
1323.7 485189438 480650246 474744886 468257099 462040633 456629187 452261329 449063808 447276473
1340 447276473 446932882 447436631 448174715 448778331 449016213 448898762 448523879 447933376 447129309 446102470
1360.4 446102470 445039660 444461018 444330007 444301754 444502056 445086360 446147084 447531730 448837131
1378.8 448837131 450008273 451538712 454132438 458317816 463295162 467302918 469726145 470686972
1395.1 470686972 470649660 469936848 468831688 467315972 465204716 462973416 460785896 458481252 456307322
1413.5 456307322 454469889 452751696 451445460 451274633 451820731 452706784 453892469 455345064 457128555
1431.8 457128555 459035993 461010039 463326246 465695202 467864513 469621271 470654070 470756203
1448.1 470756203 470145822 469077677 467511177 464752793 461997479 461915046 463326931 465887636 470069617
1466.5 470069617 475406736 482258320 492316306 503860176 514194608 523429275 532008469 540113389
1482.8 540113389 547303796 553868949 560590863 567452013 573107660 577786505 582600236 587482452
1499.1 587482452 591764092 595132411 597853601 601077557 604897201 608248234 610966027 613120139
1515.4 613120139 615267754 617486954 619783640 622215450 624454439 626610160 628568292 630094528
1531.8 630094528 631421387 632800162 633639097 633706272 634132981 635228932 636257052 636759281 636692405
1550.1 636692405 636363804 635810435 634797812 632543623 630495548 630203307 629472315 627953589 625805795
1568.5 625805795 623334646 621601343 619702935 616832376 614649475 613084793 611176968 609081030
1584.8 609081030 606980085 604853272 602618158 600291550 597966433 595739841 593495011 590991378
1601.1 590991378 588273406 585473299 582511306 579265296 576002181 572843313 568918228 564188361
1617.4 564188361 560921788 558200240 554608703 551204026 548218966 545496345 543511629 541555822
1633.7 541555822 538935781 537526071 537503779 537721992 537909210 538105488 539169967 540961921 542743683
1652.1 542743683 545510769 549033701 552364469 555696189 559457362 563682616 567625284 571662068
1668.4 571662068 576526403 581388414 586401045 591948390 597135663 601783574 606588542 612983525
1684.7 612983525 619258046 624473274 629533887 633893311 637796402 641687632 645440817 649471402
1701.1 649471402 652884901 655600846 658354223 660991728 663238466 665031552 666559458 668642402
1717.4 668642402 671556711 674337268 676745653 679001689 681057394 682926416 684571743 686276674
1733.7 686276674 688550651 690772533 692797124 694911242 697148085 699431956 701820731 704726577
1750 704726577 708280861 711617947 714523971 717323661 719975829 722676039 725284576 727351904 728933573
1768.4 728933573 730304956 731895387 733914495 735808074 737290680 738569975 739873469 741184652
1784.7 741184652 742436945 743450701 744136035 745033503 746378124 747635365 748574436 749479413 750631154
1803 750631154 751829326 752839327 753618777 754364371 755277455 756249487 757126153 757907629 758542001 759012878
1823.4 759012878 759530485 760107934 760614872 761310101 762128472 762742400 763259411 763729453 763887167 763803124
1843.8 763803124 764121532 764793277 765343606 765704215 765938878 766148567 766375303 766634762 766878188 766993463
1864.2 766993463 766885281 766763926 767159522 767891467 768429399 768741250 769059658 769462585 769879878 770237684
1884.6 770237684 770500779 770695984 771039486 771518171 771875262 772139966 772387087 772621632 772853374 773024440
1905 773024440 773026824 772953928 773079932 773368299 773522794 773476481 773479104 773586214 773787081 774157584 774490297
1927.5 774490297 774624407 774694443 774833083 775014460 775154054 775121033 774956286 775009155 775359571 775708139
1947.9 775708139 775925756 776079476 776265919 776543200 776850939 777085006 777219415 777293801 777397871 777656317
1968.3 777656317 777970791 778147519 778225303 778340936 778538287 778730452 778825164 778819740 778781891 778783798 778818786
1990.7 778818786 778867662 778936386 778982460 779016316 779072583 779065132 778909981 778647363 778390586 778182924 777949512
2013.1 777949512 777563393 777033687 776486576 775957108 775377393 774786115 774410605 774204373 773920596 773558438
2033.5 773558438 773179233 772710145 772137344 771651566 771362782 771133065 770823419 770472109 770199001 770079434
2053.9 770079434 770087421 770109415 770051301 769938171 769923151 770086348 770292103 770351350 770273209 770243347 770360768
2076.4 770360768 770524561 770587623 770517766 770454288 770584106 770862818 771054864 771053910 771018744 771141231 771408439
2098.8 771408439 771667063 771803498 771841586 771927476 772173584 772474110 772599638 772515297 772448063 772565842
2119.2 772565842 772786200 772875965 772734165 772547722 772552133 772754729 772913873 772846699 772667646 772626102
2139.6 772626102 772790313 772973776 772963703 772792757 772713542 772878110 773177028 773378015 773420751 773494065
2160 773494065 773799717 774314702 774788141 775049567 775270462 775730073 776430547 777121127 777607381 777962446
2180.4 777962446 778403521 779023647 779684842 780166984 780443132 780718029 781189322 781795800 782296121 782589614
2200.8 782589614 782832980 783258379 783888042 784478486 784827769 785037339 785353065 785862327 786422670 786827445
2221.2 786827445 787050903 787280798 787650645 788086057 788430929 788623869 788751066 788983524 789368808 789714754
2241.6 789714754 789884210 789968669 790118158 790394127 790721953 790971458 791105926 791200459 791373312 791670859
2262 791670859 791974545 792171180 792304218 792495012 792796254 793130457 793362975 793439329 793489218 793680668
2282.3 793680668 793973446 794190288 794304192 794430137 794642866 794931114 795191109 795315444 795316756 795379162
2302.7 795379162 795659781 796052277 796352446 796505928 796596169 796784639 797177851 797614992 797846735 797919095
2323.1 797919095 798071504 798362792 798626244 798618495 798329353 798070848 798027813 798061550 797927260 797419488
2343.5 797419488 796529889 795880735 795967519 796577394 797232687 797682822 797887504 797811866 797496200 796930075
2363.9 796930075 796114683 795187473 794307411 793483257 792631984 791735947 790918648 790291250 789811313 789393723
2384.3 789393723 788992524 788631558 788385808 788237691 788063765 787785411 787428021 787065148 786749661 786447227
2404.7 786447227 786067605 785582423 785074234 784617364 784172773 783671737 783111155 782532215 781960428 781392157
2425.1 781392157 780783892 780080974 779332995 778645217 777988732 777305067 776636302 775947213 775199175 774483085
2445.5 774483085 773821056 773141205 772417367 771684647 770977974 770285726 769623458 769005358 768375278 767725646
2465.9 767725646 767089486 766466200 765851736 765236557 764595807 763932824 763306320 762757838 762244463 761708617
2486.3 761708617 761170805 760677993 760226607 759779036 759330273 758921206 758551955 758191586 757821977 757434189
2506.7 757434189 757027864 756591380 756165266 755800426 755416632 754925370 754363894 753797531 753241599 752671421
2527.1 752671421 752048433 751357198 750622094 749897003 749198556 748483658 747716963 746906638 746098697 745329559
2547.5 745329559 744589448 743848681 743098259 742345989 741600752 740853667 740088284 739313185 738536716 737803996
2567.9 737803996 737148345 736506701 735802054 735011101 734196067 733469725 732846379 732217193 731540501 730896175
2588.3 730896175 730329692 729820728 729336381 728843570 728313506 727770090 727257669 726752460 726192474 725507259
2608.7 725507259 724700928 723870516 723049343 722190857 721249759 720194817 719075978 717977762 716864347
2627 716864347 715657234 714364946 713035762 711709082 710406184 709110081 707761526 706334233 704922020
2645.4 704922020 703620672 702364981 701064348 699738264 698421538 697151184 695945024 694730103
2661.7 694730103 693469644 692220926 691024780 689895689 688827574 687751472 686624229 685527146
2678 685527146 684537113 683582127 682548761 681451440 680404425 679438174 678444505 677349269 676173151
2696.4 676173151 674969375 673779786 672580361 671311378 669962347 668619573 667362988 666171610
2712.7 666171610 665000618 663808763 662575543 661367595 660266161 659247160 658228517 657181501
2729 657181501 656163692 655251622 654461682 653708875 652864277 651914835 650988221 650169849 649404526 648620307
2749.4 648620307 647825122 647059023 646376729 645770550 645106196 644326687 643544018 642881811 642342925 641759574
2769.8 641759574 640978932 640076220 639200509 638349414 637425244 636355281 635171771 633981109 632810473
2788.2 632810473 631597161 630251110 628736436 627132058 625524819 623892367 622129619 620188057
2804.5 620188057 618137836 616072536 614018023 611931086 609754264 607459903 605075896 602649510
2820.8 602649510 600175917 597628415 594972849 592192769 589367568 586549699 583636642 580525815
2837.1 580525815 577221513 573755622 570126891 566292822 562261224 558186948 554317176 550833881
2853.4 550833881 547752321 544918478 542070150 538934410 535350561 531275809 526655257 521527827
2869.7 521527827 516072869 510396302 504564464 498799592 493453860 488793552 484922945 481896996
2886.1 481896996 479692847 478165954 477157891 476471424 475872785 475233227 474482477 473514169 472296864
2904.4 472296864 470837623 469046503 466818660 464040458 460614949 456666738 452507317 448406756
2920.7 448406756 444539756 441081166 438317597 436503172 435750067 436237723 438103795 441233248 445414066
2939.1 445414066 450422555 455999196 461906761 467970639 474109352 480280846 486425817 492550820
2955.4 492550820 498654425 504606366 510252833 515507400 520333469 524750173 528823197 532670736
2971.7 532670736 536422253 540107906 543706179 547138035 550263226 553088486 555709660 558096588
2988 558096588 560192406 561960459 563375592 564537108 565482140 566094577 566327512 566236138 565907001
3006.4 565907001 565393746 564665556 563643217 562298179 560702026 558925986 556969762 554848790 552615941
3024.7 552615941 550302684 547951639 545574963 543124318 540525913 537796617 535105646 532484710
3041.1 532484710 529764950 526885986 523936152 520998716 518087566 515168250 512195110 509153366
3057.4 509153366 506113946 503161490 500305891 497493416 494574487 491483331 488403618 485510498
3073.7 485510498 482806474 480111510 477201819 474158376 471186608 468272060 465369642 462470025
3090 462470025 459494919 456465423 453561455 450860947 448144197 445236176 442338347 439649910 437026143
3108.4 437026143 434280604 431580722 429082006 426571488 423911452 421124518 418212920 415357828
3124.7 415357828 412757277 410303295 407751888 405092478 402562857 400246590 397949010 395474136
3141 395474136 392891526 390412390 388094842 385928452 383838266 381590635 379123658 376707643 374500096
3159.4 374500096 372388154 370259643 368130296 366046786 364000797 361984998 360007167 358085155
3175.7 358085155 356178701 354263008 352386892 350551873 348760992 347016901 345277101 343531996
3192 343531996 341803253 340084165 338411301 336815774 335237026 333697975 332263499 330857277 329404145
3210.3 329404145 327946812 326560348 325245082 323919177 322554290 321203470 319914639 318689138
3226.7 318689138 317514330 316440225 315432191 314254850 312896401 311634690 310556531 309561908
3243 309561908 308608890 307679623 306696087 305677801 304740369 303867906 302960336 302028328 301158547 300366849
3263.4 300366849 299631119 298992217 298447579 297821134 297014713 296124905 295265555 294485897 293757558 293052137
3283.8 293052137 292357206 291713476 291225761 290829659 290280461 289495528 288636148 287892669 287353456 286945403
3304.2 286945403 286434680 285663128 284725785 283802927 282972336 282195598 281433135 280726552 280126899 279534489
3324.6 279534489 278752774 277826875 276969820 276250035 275672942 275152057 274488509 273671031 272823215 271978468
3345 271978468 271241486 270684540 270028234 269085586 268127412 267400891 266806245 266141415 265454799 264952332
3365.4 264952332 264553308 263933361 263000548 262054235 261336863 260778606 260265172 259682178 259045631 258553535
3385.7 258553535 258356273 258379251 258239061 257745296 257249355 257109702 257156014 256895453 256295741 255804420
3406.1 255804420 255582720 255491287 255395204 255155444 254824460 254613817 254504979 254427701 254494846 254765302
3426.5 254765302 255108178 255310267 255509526 255871266 256061882 255910546 255768627 255929261 256316334 256696135
3446.9 256696135 257019937 257404506 257843465 258319706 258893192 259557009 260144174 260737389 261626154 262614280
3467.3 262614280 263229281 263456523 263761699 264389813 265279114 266124427 266660541 267214507 268023849 268812329
3487.7 268812329 269544452 270450920 271458447 272421122 273326933 274191350 274937034 275548339 276291907
3506.1 276291907 277248889 278305769 279476345 280556172 281390548 282268167 283362299 284530371 285496682
3524.4 285496682 286236495 287045330 288132966 289476216 290891856 292154163 293323278 294710517 296224833
3542.8 296224833 297483265 298506021 299761027 301249325 302739382 304360062 306170225 308108717
3559.1 308108717 310143530 312072664 313637733 315356493 317952424 320851237 323489904 326071471
3575.4 326071471 328829199 331817389 335017204 338216305 340959072 343305409 346337378 349890769
3591.7 349890769 353189975 356481969 360144198 363886952 367611855 371371478 374820232 378044337
3608.1 378044337 381583482 385444373 389481872 393496186 397242397 401283681 405748874 409989357
3624.4 409989357 413479060 416377693 420317650 425073743 429562390 433798581 437886089 441893220
3640.7 441893220 445938468 449764103 452968687 456015944 460167378 464927047 469193041 473285317
3657 473285317 477610379 481578887 485119402 488650858 491836041 494368583 497412175 500741482 503180742
3675.4 503180742 506176710 510052323 513703585 517091691 520228207 522667408 524392843 526724279
3691.7 526724279 529813111 532740057 535179496 537123799 538797796 540871680 543235302 545077682
3708 545077682 546066999 547084153 549311340 551948369 554078043 555647135 556945562 558220923 559696496
3726.4 559696496 561602831 563299000 564071000 564347029 565437973 567602277 569738448 570570767 570389271
3744.7 570389271 571476579 572861075 573337615 574674666 576923311 578611553 579605639 580907643 582469881
3763.1 582469881 583572328 584450662 585278213 586310983 587857544 589372337 590385377 590966702 591731071
3781.4 591731071 592689514 593572497 594626844 595785022 596854925 597687840 598134220 598645926 599047124
3799.8 599047124 599141359 600140989 601256251 601968765 603270650 604740024 605369925 605287433 605707765
3818.1 605707765 605978549 606267095 607640505 608913898 609796405 610543370 611070156 611648619 611833692
3836.5 611833692 611480474 611783147 612820506 614106953 615474820 616591811 616731107 615164518 614586890
3854.8 614586890 616510689 618348718 619113743 619098246 619278431 619958997 620157123 620230258 620962203 622039557
3875.2 622039557 623151064 623518586 623541653 624034703 624386489 624938011 625583529 625677764 626064003 626956463
3895.6 626956463 627357066 627046883 626776695 626942873 627647400 628691196 629524231 630032778 630311728
3914 630311728 630267978 630177915 630474448 630914509 631123006 631338537 631718874 631866932 631890416 632287681
3934.4 632287681 632852554 633245885 633415282 633439302 633651316 633978665 634137094 634362936 634737849 635054052
3954.8 635054052 635270357 635457337 635608554 635772526 636078656 636410117 636598647 636712074 636873305 637099385
3975.2 637099385 637332141 637470305 637585342 637822568 638085127 638267279 638403118 638511240 638611376 638793170
3995.6 638793170 639086485
3997.6 639086485
##END=$$ End of the data block
