##TITLE=$$ Begin of the data block
##JCAMP-DX=5.00 $$ ACD/SpecManager v 10.08
##SPECTROMETER/DATA SYSTEM=Alpha
##DATE=23 Dec 2014 09:14:34
##DATA TYPE=INFRARED SPECTRUM
##DATA CLASS=XYDATA
##ORIGIN=
##OWNER=
##NPOINTS=1765
##FIRSTX=399.76428223
##LASTX=3997.64306641
##MAXX=3997.64306641
##MINX=399.76428223
##MAXY=0.80006999
##MINY=0.18516405
##XFACTOR=1.0000000000
##YFACTOR=1.000000000000000e-9
##FIRSTY=0.49500400
##DELTAX=2.03961372
##XUNITS=1/CM
##YUNITS=ARBITRARY UNITS
##XYDATA=(X++(Y..Y))
399.8 495003998 489451468 484427691 481278151 480840743 482176125 484032631 485604078 486859769 487842351
418.1 487842351 487603724 485750884 482697845 479214221 476226419 473558962 470515817 467068136 464338273
436.5 464338273 463641912 465750337 470552415 476077259 480698168 484596491 487833291 489941984 490520954
454.8 490520954 489653766 488128752 486742258 484948337 482016802 478135169 474206895 470681071 467418313
473.2 467418313 464394927 461595803 459432185 458250046 457883090 457942784 457863450 457362235 456610233
491.5 456610233 455760062 454504788 452487707 449778616 446891278 444481909 442093015 438725948 434616238
509.9 434616238 430494756 426515490 422311962 417441189 412273377 407974452 405361503 404292881
526.2 404292881 404032737 404078752 404683352 406608522 410551310 416350901 422689348 428157419 432208121
544.6 432208121 434835345 435963988 435467839 433539450 430838585 427957296 424614310 420052558 414083660
562.9 414083660 407169312 399694741 392207175 385833561 381523669 379835069 381171942 385453612
579.3 385453612 391996026 399690509 407419920 414475828 420320094 424468905 426693171 427322060 427103221
597.6 427103221 426779389 426618487 426319510 425830632 425649881 426239938 427697599 429723948 431923658
616 431923658 434367090 437525332 441610217 446159512 450337678 453751028 456633180 459404290 462131172
634.3 462131172 464386225 465840697 466832399 467976093 469446450 470892787 471951067 472678214 473562837
652.7 473562837 475005627 476683199 477937400 478625238 479226202 480288893 482197255 484278232 485220581
671 485220581 486058384 487618625 489822894 491979897 493427783 494274855 495177746 496425629 497470677
689.4 497470677 497484058 496269673 494334757 492091715 489495695 486272544 482471466 478999823 477075160
707.7 477075160 477115750 478693575 481223196 484643668 489404559 495583624 502403319 509014964 515214026
726.1 515214026 521192551 527097642 532594740 537013292 540134132 542414486 544391394 545842648
742.4 545842648 545862317 543884993 540325820 536119878 531746328 526886880 521244109 515374184 510389626
760.8 510389626 507076025 505603194 505952299 508334637 513199389 520760596 530492425 541125953
777.1 541125953 551288188 560402155 568651140 576133192 582540393 587569952 591571033 595573604
793.4 595573604 600326657 605657697 610795498 615257442 619279206 623232782 626878321 629513383
809.7 629513383 630955815 631848454 632962763 634251177 634870648 634157777 632261038 629760563 626779258
828.1 626779258 622812867 617430568 610987246 604458332 598540008 593098462 587682605 582212090
844.4 582212090 577021480 572454870 568235278 563496888 557666659 550994694 544830799 541715443
860.7 541715443 543947577 551541865 562764466 576314688 591252625 605770171 617668808 625675380
877 625675380 629791141 630620599 628665507 624239564 617858648 610506475 603301466 596763313 590697825
895.4 590697825 584732711 578690469 572584808 566292644 559296548 550984740 541182876 530219555
911.7 530219555 518582702 506714404 495227873 485112935 477407575 472589701 470275998 469608486
928 469608486 470028877 471549064 474336445 478379756 483517408 489515752 495821357 501020908 503059566
946.4 503059566 500487804 493195295 482006371 468126953 452689767 436261147 418881178 400565714
962.7 400565714 381512046 361935496 341938525 321568251 301027060 280795693 261497170
977 261497170 243701264 227950051 214739889 204300731 196527898 191101044 187641427 185782835
993.3 185782835 185164049 185390219 186132625 187131301 188120022 188843310 189106613 188895747 188399732 188000664
1013.7 188000664 188124284 188994527 190581232 192825660 195717677 199178159 203045428 207041457 210810959
1032 210810959 214036688 216491684 218057439 218818516 219097167 219355747 219970047 221259311 223642737
1050.4 223642737 227481589 232902095 239784434 247959062 257362992 267914057 278779745 287498176
1066.7 287498176 290479094 285630375 274857432 263034582 254221112 249581635 248437673 249775663
1083 249775663 252797931 257038832 262367308 268663019 275467932 281984240 287318766 290958434 292978615
1101.4 292978615 293933928 294757098 296447366 299493790 303665072 308274299 312608957 316198081 318846375
1119.8 318846375 320748627 322409302 324479818 327578038 331877202 336722583 340734661 342430264
1136.1 342430264 340864003 335984170 328611970 320007831 311280072 303186625 296250552 290858954
1152.4 290858954 287228554 285339594 285042763 286302000 289304435 294367939 301812112 311665893
1168.7 311665893 323582977 337028831 351426303 366309911 381388754 396356404 410761952
1183 410761952 424143344 436131865 446439117 454796106 461044073 465318024 468122065 470164090
1199.3 470164090 472017020 473937690 476082623 478806794 482504189 487307250 492988527 498952657
1215.6 498952657 504459858 508953154 512150764 513925374 514257550 513337970 511550784 509327471 507017493
1234 507017493 504797757 502723038 500905097 499665797 499401897 500229478 501897216 504016817 506277859
1252.3 506277859 508502066 510521114 512093186 513131917 513898015 514900029 516613543 519029438
1268.6 519029438 521592915 523661494 524899662 525325894 525074661 524294734 523221016 522101879 521055102
1287 521055102 520050049 518888891 517293155 515178144 512729466 510204315 507727921 505301237 502826452
1305.4 502826452 500314415 498107582 496421069 495066166 493763417 492333949 490700364 488625556
1321.7 488625556 485548884 481002837 475113243 468626618 462410450 457011789 452667058 449485570
1338 449485570 447700620 447353899 447841346 448562622 449168622 449422479 449313194 448926628 448346615 447576970
1358.4 447576970 446554482 445471257 444861591 444703460 444672018 444880813 445473701 446534067 447909862
1376.7 447909862 449221224 450407326 451940298 454546660 458741337 463675439 467625231 470026016
1393.1 470026016 470988035 470931947 470204145 469111741 467605501 465501606 463289022 461110383 458807409
1411.4 458807409 456660420 454870582 453199446 451918900 451735407 452266544 453163117 454354972 455802590
1429.8 455802590 457597286 459519863 461484760 463772982 466151059 468357146 470117867 471123993
1446.1 471123993 471224725 470629603 469557613 467979163 465226084 462492079 462415576 463826090 466381043
1464.5 466381043 470558673 475913733 482795358 492845982 504363358 514706433 523924470 532459438
1480.8 532459438 540559471 547771394 554347754 561102927 568007410 573686302 578399062 583248377
1497.1 583248377 588134229 592410862 595782816 598509014 601750433 605592847 608962595 611708522
1513.4 611708522 613902569 616086245 618306279 620552540 622916818 625132978 627321064 629327893
1529.7 629327893 630887866 632201910 633531272 634356737 634467602 634935558 636036277 637037039 637513280
1548.1 637513280 637454987 637171805 636657119 635654628 633417785 631293356 630880535 630103052 628598392
1566.4 628598392 626481831 624050558 622351944 620446682 617515683 615291893 613713920 611784935
1582.8 611784935 609693348 607626379 605504751 603268564 600984931 598678648 596389890 594072402
1599.1 594072402 591558516 588858247 586045563 583070934 579860568 576655388 573528171 569625199
1615.4 569625199 564920187 561645567 558906078 555297852 551864207 548858404 546140254 544184327
1631.7 544184327 542282760 539714575 538293064 538234591 538447142 538667023 538903356 539978325 541774154
1650.1 541774154 543586969 546387732 549904704 553232908 556580484 560359478 564612508 568593681
1666.4 568593681 572644472 577503145 582399726 587495744 593103588 598276138 602881372 607641220
1682.7 607641220 614002228 620294094 625546098 630642951 635026336 638927758 642802417 646534920
1699 646534920 650530279 653921247 656643569 659391880 661999702 664248645 666088343 667638600 669668794
1717.4 669668794 672544599 675348222 677780747 680037677 682105660 684010029 685682714 687391639
1733.7 687391639 689653397 691859484 693867087 695970297 698219836 700496674 702824056 705720901
1750 705720901 709339857 712718248 715650797 718467712 721122205 723801851 726361632 728392959 729972899
1768.4 729972899 731375754 733014822 735059440 736950874 738427818 739721596 741036713 742337346
1784.7 742337346 743589103 744610727 745297849 746208489 747582018 748846710 749763668 750664592 751846910
1803 751846910 753060520 754053831 754820108 755578518 756513596 757493556 758367062 759157777 759813368 760276198
1823.4 760276198 760733366 761251330 761777580 762545407 763385296 763982177 764482915 764931858 765094042 765034080
1843.8 765034080 765335023 765982091 766535044 766896844 767133474 767361224 767605662 767870903 768127263 768257260
1864.2 768257260 768150270 768032551 768425465 769142807 769669712 769971728 770271838 770642400 771035552 771413863
1884.6 771413863 771716058 771919727 772259474 772749245 773114383 773380876 773632944 773864150 774076521 774229765
1905 774229765 774255812 774216712 774314821 774566293 774731696 774692655 774676502 774788499 775015593 775389850 775709629
1927.5 775709629 775841594 775912285 776068687 776301622 776466966 776417136 776237249 776278257 776624739 777001739
1947.9 777001739 777267933 777433753 777575791 777813077 778119564 778354287 778481722 778571188 778697848 778949678
1968.3 778949678 779239595 779397666 779463530 779568553 779759109 779954851 780060828 780071616 780041397 780034661
1988.7 780034661 780068755 780136764 780225694 780281782 780322909 780381918 780365705 780187011 779901087 779651582 779469848
2011.1 779469848 779249609 778861582 778315246 777759850 777230561 776626706 776009977 775630593 775431573 775172353
2031.5 775172353 774848759 774481177 773992479 773398638 772885382 772586286 772388756 772117257 771785021 771521568
2051.9 771521568 771399021 771395504 771419704 771377206 771283090 771271884 771420002 771609962 771668315 771607578 771578670
2074.3 771578670 771688879 771856546 771893501 771786511 771729469 771876216 772144854 772335827 772367775 772374511
2094.7 772374511 772524357 772803426 773051918 773151815 773154855 773255229 773559988 773887277 774004281 773922622
2115.1 773922622 773861229 773979962 774186671 774265468 774151742 773998380 774006009 774196804 774351180 774291158
2135.5 774291158 774106562 774042010 774203598 774406254 774404943 774228632 774152160 774340808 774665058 774867117
2155.9 774867117 774880230 774913251 775200784 775719225 776203811 776480615 776703238 777129710 777798355 778504252
2176.3 778504252 779011488 779358804 779806197 780468285 781167626 781653941 781912684 782185972 782673061 783280134
2196.7 783280134 783789814 784101486 784328520 784724236 785339475 785936713 786330938 786588073 786910236 787423313
2217.1 787423313 787993014 788377702 788571179 788772583 789115667 789572299 789970934 790172279 790286779 790530920
2237.5 790530920 790927768 791266024 791416883 791514874 791702092 791971147 792262435 792481303 792588532 792690158
2257.9 792690158 792907119 793236554 793540835 793716073 793824613 794019818 794351459 794678330 794861734 794934392
2278.3 794934392 795033097 795251846 795550168 795796394 795928538 796025872 796224654 796519756 796759665 796886683
2298.7 796886683 796939731 797030091 797282219 797641397 797941446 798078835 798119903 798286140 798682392 799128592
2319.1 799128592 799368858 799404562 799489796 799725294 799977958 800069988 799918473 799703062 799651384 799665630
2339.5 799665630 799476206 798908174 797986865 797344744 797449291 798054695 798694432 799151182 799385548 799340487
2359.9 799340487 799016535 798356473 797435522 796543598 795773566 794988871 794141829 793268323 792483032 791898310
2380.2 791898310 791458189 791050196 790644169 790284872 790027320 789854765 789667904 789384604 789020360 788668096
2400.6 788668096 788378358 788070858 787669599 787195563 786704838 786228657 785759151 785278797 784754992 784169912
2421 784169912 783571720 782991171 782380760 781710505 781004608 780293941 779601991 778929710 778248489 777534485
2441.4 777534485 776804328 776099265 775425494 774733901 773995936 773239791 772528350 771885753 771267056 770632267
2461.8 770632267 769972622 769302547 768644094 768018544 767426610 766826808 766183019 765524507 764918506 764376462
2482.2 764376462 763847947 763283849 762710810 762215197 761798024 761370182 760907650 760462582 760062039 759693503
2502.6 759693503 759331286 758966088 758591294 758198678 757812500 757425487 756991625 756493032 755961776 755433917
2523 755433917 754890084 754294395 753636420 752927005 752182901 751444578 750740826 750031888 749280274 748507500
2543.4 748507500 747741699 746979535 746209919 745437622 744682908 743936658 743187487 742453218 741704941 740907133
2563.8 740907133 740112007 739399374 738765538 738111377 737356126 736546814 735782862 735089719 734427035 733750463
2584.2 733750463 733069301 732435942 731873512 731381476 730939507 730475843 729948282 729390204 728836954 728305697
2604.6 728305697 727748752 727063954 726278782 725505888 724707723 723794699 722784936 721710742 720615268
2623 720615268 719536960 718426228 717229545 715937316 714583516 713253260 711973011 710669935 709291399
2641.3 709291399 707864463 706474483 705175877 703902602 702588201 701245964 699927032 698682547
2657.6 698682547 697503448 696327269 695097506 693833411 692615747 691478372 690380752 689258158
2673.9 689258158 688116670 687053144 686090231 685129404 684092283 682992876 681926548 680951595 679973483
2692.3 679973483 678864598 677635431 676411390 675256491 674089372 672830105 671495795 670139313
2708.6 670139313 668835700 667640805 666486144 665273607 664022207 662813306 661708355 660704255
2724.9 660704255 659731507 658726037 657720029 656798422 655963004 655149043 654300153 653405964 652544439
2743.3 652544439 651778221 651021600 650165260 649263561 648439527 647732317 647108853 646482706 645796955 645104825
2763.7 645104825 644485712 643919647 643267691 642438233 641512811 640620589 639765143 638840616 637789547
2782 637789547 636646628 635447919 634221911 632971227 631613135 630098403 628494382 626885414 625277877
2800.4 625277877 623576462 621712267 619712532 617627978 615536213 613446116 611247718 608889461
2816.7 608889461 606465399 604091525 601710379 599163830 596413016 593540430 590694666 587928534
2833 587928534 585043132 581893206 578572154 575120330 571484685 567652822 563645005 559581280 555690289
2851.4 555690289 552163363 549020112 546111047 543210745 540065229 536500156 532432199 527774036
2867.7 527774036 522593319 517096400 511395097 505577087 499828130 494427711 489674658 485783964
2884 485783964 482825190 480646878 479062349 478011250 477351248 476819396 476197362 475400865 474411607
2902.4 474411607 473188698 471709400 469916701 467660725 464820862 461405337 457545549 453437179
2918.7 453437179 449284524 445352048 441925645 439202517 437345028 436558396 437060565 438961029 442135781
2937 442135781 446336985 451353312 456936091 462810665 468815029 474932820 481170058 487425387 493600398
2955.4 493600398 499690980 505652785 511352241 516671777 521539211 525948942 530017197 533904433
2971.7 533904433 537668288 541321576 544933558 548464835 551705956 554577589 557200491 559609890
2988 559609890 561761260 563583314 565007746 566143870 567080081 567740619 568046510 567994237 567683458
3006.4 567683458 567195356 566495836 565486729 564105809 562434018 560611129 558682323 556621730 554410040
3024.7 554410040 552072763 549678564 547271848 544848740 542287290 539528310 536800444 534197271
3041.1 534197271 531495631 528591096 525596321 522622645 519692838 516761124 513769031 510728061
3057.4 510728061 507738829 504841149 501978040 499123842 496187150 493098289 490005642 487080842
3073.7 487080842 484363616 481672138 478745461 475662351 472659588 469731420 466822118 463908285
3090 463908285 460916698 457918644 455047876 452289820 449490100 446574867 443687618 440952510 438292354
3108.4 438292354 435573459 432922274 430444777 427927643 425251365 422419161 419462383 416615486
3124.7 416615486 414039612 411591023 409046918 406387776 403854936 401547611 399233848 396729559
3141 396729559 394128263 391611040 389237523 387018532 384904861 382703304 380315721 377893299 375594318
3159.4 375594318 373439372 371342689 369218379 367087871 365006119 362992078 361034900 359105557
3175.7 359105557 357171476 355253458 353379339 351530999 349713117 347941577 346203536 344485790
3192 344485790 342744172 340943843 339192063 337583780 336071670 334606260 333163589 331659138 330084592
3210.3 330084592 328590810 327253371 325964987 324604094 323213279 321883738 320624888 319433928
3226.7 319433928 318300247 317235678 316196918 315005898 313669443 312398255 311261147 310234815
3243 310234815 309298158 308355391 307321191 306269020 305323571 304481179 303643674 302753389 301860899 301042438
3263.4 301042438 300283402 299591333 299021363 298427075 297634006 296713620 295829386 295032263 294293582 293609709
3283.8 293609709 292951465 292318285 291802555 291372210 290814131 290044397 289183527 288386405 287785769 287364930
3304.2 287364930 286867619 286102802 285167336 284246743 283433169 282681435 281924605 281186849 280529529 279917091
3324.6 279917091 279182941 278312534 277467936 276707083 276063383 275542080 274931788 274121821 273257464 272399813
3345 272399813 271648377 271092564 270438880 269496888 268539041 267789602 267158836 266490310 265821368 265308380
3365.4 265308380 264867127 264216065 263288438 262351215 261640489 261077613 260523438 259921312 259324253 258887291
3385.7 258887291 258692384 258658677 258493692 258026630 257555783 257429749 257485211 257220984 256600350 256111592
3406.1 256111592 255931497 255859196 255720228 255438179 255107760 254902542 254817486 254779071 254837781 255055904
3426.5 255055904 255389959 255685300 255961150 256267697 256383508 256238729 256133050 256304651 256649226 256967992
3446.9 256967992 257262945 257661760 258149892 258666247 259282887 260000646 260607928 261200160 262072116 263008952
3467.3 263008952 263609916 263881058 264177054 264752477 265628934 266503602 267069638 267639875 268513888 269372582
3487.7 269372582 270048052 270838469 271819919 272782505 273654073 274561524 275427788 276088566 276759267 277633995
3508.1 277633995 278691173 279900730 281005234 281833231 282663941 283741087 284978122 286044478 286821693
3526.5 286821693 287603498 288682163 290021181 291413844 292690665 293884575 295236558 296720445
3542.8 296720445 298030674 299140453 300460935 301970989 303474426 305142581 306981355 308912307
3559.1 308912307 310951501 312916309 314543247 316307545 318892628 321778119 324404836 326936543
3575.4 326936543 329652965 332651258 335890681 339119554 341883093 344290912 347385854 350953698
3591.7 350953698 354280531 357653737 361359477 365069807 368791759 372600794 376112461 379421443
3608.1 379421443 383037060 386903673 390894324 394895762 398642957 402650177 407140315 411479741
3624.4 411479741 415094256 418105543 422005385 426664680 431145191 435390055 439475298 443498641
3640.7 443498641 447584987 451509267 454842895 457944810 462050706 466780961 471040994 475066781
3657 475066781 479335576 483353972 486940771 490452528 493644834 496199280 499182969 502495587 505059421
3675.4 505059421 508138061 512008190 515679240 519094467 522221744 524659395 526413858 528709114
3691.7 528709114 531737685 534686744 537194371 539164245 540850163 542990744 545409322 547252238
3708 547252238 548251629 549275696 551476538 554083824 556182981 557756126 559071004 560332775 561813653
3726.4 561813653 563750088 565476060 566298008 566621184 567715406 569885015 572023928 572858930 572729766
3744.7 572729766 573842943 575147331 575521588 576872766 579186022 580922127 581970930 583272576
3761 583272576 584802330 585962534 586929619 587751150 588717580 590225577 591721237 592699111 593267679
3779.4 593267679 594064772 595039308 595913410 596962333 598106086 599172354 600023568 600503027 601060867
3797.7 601060867 601452410 601467550 602425873 603532374 604227245 605537534 607037425 607706070 607652068
3816.1 607652068 608079374 608392417 608684897 609987617 611249864 612161100 612902641 613457620 614147007
3834.4 614147007 614492416 614268422 614577174 615540087 616753519 618080556 619165361 619324267 617865205
3852.8 617865205 617205381 618911982 620707393 621615648 621725619 621865690 622517467 622799456 622903824
3871.2 622903824 623586357 624605298 625656068 625997007 626029551 626552641 626932621 627489626 628173113
3889.5 628173113 628338754 628771603 629646838 629976213 629634857 629405022 629574776 630231619 631244659
3907.9 631244659 632064641 632578194 632895350 632916749 632874429 633156359 633571446 633769929 633909523 634179711
3928.3 634179711 634351015 634487689 634893477 635389030 635718822 635866463 635949373 636238933 636574388 636684954
3948.7 636684954 636867166 637251556 637624085 637917697 638182938 638366282 638494968 638717234 638977349 639147639
3969.1 639147639 639280140 639470816 639703393 639934242 640093446 640270770 640552640 640773892 640931547 641127348
3989.5 641127348 641294897 641404867 641554296 641798198
3997.6 641798198
##END=$$ End of the data block
