##TITLE=$$ Begin of the data block
##JCAMP-DX=5.00 $$ ACD/SpecManager v 10.08
##SPECTROMETER/DATA SYSTEM=Alpha
##DATE=23 Dec 2014 09:14:34
##DATA TYPE=INFRARED SPECTRUM
##DATA CLASS=XYDATA
##ORIGIN=
##OWNER=
##NPOINTS=1765
##FIRSTX=399.76428223
##LASTX=3997.64306641
##MAXX=3997.64306641
##MINX=399.76428223
##MAXY=0.80231583
##MINY=0.18511832
##XFACTOR=1.0000000000
##YFACTOR=1.000000000000000e-9
##FIRSTY=0.49328199
##DELTAX=2.03961372
##XUNITS=1/CM
##YUNITS=ARBITRARY UNITS
##XYDATA=(X++(Y..Y))
399.8D93281990n003810m297882k846450n30958J242906J854390J628518J210809R55790
418.1D87495303J11461j451373k763093l530621l634066l297805l343702l723740k833426
436.5D63028938k69652K883375N068838N136461M438877M014283L207892K047807N17726
454.8D90074545j186609j645655j080423j614213k913445l805519l898203l459483
471.2D70470995l115624k973915k899646k451450j440048l46154K91407Q1539m91738
489.5D57125366o73682p12573j197428j987397k563596k657980k441943k586513l357768
507.9D38946486m117907m335463m177779m239916m748136m990518m222393k667874
524.2D05446500j093358l16829l10778K12907J961053M156500N835414O395280N625755
$$ y = [493281990, 488278180, 483980298, 481133848, 480602890, 481845796, 483700186, 485328704, 486539513, 487495303, 487606764, 486155391, 483392298, 479861677, 476227611, 472929806, 469586104, 465862364, 463028938, 462759286, 465642661, 470711499, 475847960, 480286837, 484301120, 487509012, 489556819, 490074545, 488887936, 487242281, 486161858, 484547645, 481634200, 477828681, 473930478, 470470995, 467355371, 464381456, 461481810, 459030360, 457590312, 457244158, 457535565, 457617104, 457125366, 456451684, 455739111, 454541683, 452554286, 449990690, 447332710, 444890767, 442304254, 438946486, 434828579, 430493116, 426315337, 422075421, 417327285, 412336767, 408114374, 405446500, 404353142, 404036313, 403725535, 403938442, 405899495, 410055995, 415891409, 422286689, 427912444]
542.5D27912444M131764K621412J117319n15014j909077k636671k959996l508449m559010
560.9D19694722n889148o943106p479489p438720o501585m472524j672655J378715
577.2C80676210M273444O492347P677615P895469P234276N829066M108041K294451
593.5D26480919P00951j89096l09467j60069k42054m05163k20209M97758J464636K117484
613.9D29735690K327979K557933L167838M023016M547834M196256L366441K798259
630.2D56721246K708853K731472K252787J408279R85593J220971J634628J625239J105667
648.6D72394735O72072Q76933J439035J632899J193464O19143O36310J202672K014548
667D82681811K058804Q51393P56949J503736K165675K164423J539499R86874J011878
$$ y = [427912444, 432044208, 434665620, 435782939, 435267925, 433358848, 430722177, 427762181, 424253732, 419694722, 413805574, 406862468, 399382979, 391944259, 385442674, 380970150, 379297495, 380676210, 384949654, 391442001, 399119616, 407015085, 414249361, 420078427, 424186468, 426480919, 427181870, 426992774, 426683307, 426523238, 426281184, 425876021, 425655812, 426153570, 427618206, 429735690, 432063669, 434621602, 437789440, 441812456, 446360290, 450556546, 453922987, 456721246, 459430099, 462161571, 464414358, 465822637, 466808230, 468029201, 469663829, 471289068, 472394735, 473066807, 473943740, 475382775, 477015674, 478209138, 478828281, 479464591, 480667263, 482681811, 484740615, 485592008, 486348957, 487852693, 490018368, 492182791, 493722290, 494709164, 495721042]
685.3D95721042J229555Q91983j22577j246095j887679k109825k509743l329993l925353
703.7D82711315l447115j848549O7532J530111K485961L482669M853696O260663O898970
722E02995253O588637O085933N947113N970061N544185M443109L103435K250672J985907
740.4E44914305J444698J2457j961708l573001m321396m558086m935146n557775n788624
758.7E15675724m975915l304065j479149L05832K412915M974425P580519R650826J0549247
777.1E41390359J0135174R192050Q348345P533551O420493N008638L968119L997565
793.4E95994294M789114N327940N084157M446387M059672L985942L646195K644121
809.7F29977822J468540R35196J156211J287401N45263q53598j980424k507329l016054
$$ y = [495721042, 496950597, 497842580, 497720003, 496473908, 494586229, 492476404, 489966661, 486636668, 482711315, 479264200, 477415651, 477483183, 479013294, 481499255, 484981924, 489835620, 496096283, 502995253, 509583890, 515669823, 521616936, 527586997, 533131182, 537574291, 540677726, 542928398, 544914305, 546359003, 546371460, 544409752, 540836751, 536515355, 531957269, 527022123, 521464348, 515675724, 510699809, 507395744, 505916595, 506222427, 508635342, 513609767, 521190286, 530841112, 541390359, 551525533, 560717583, 569065928, 576599479, 583019972, 588028610, 591996729, 595994294, 600783408, 606111348, 611195505, 615641892, 619701564, 623687506, 627333701, 629977822, 631446362, 632381558, 633537769, 634825170, 635370433, 634516835, 632536411, 630029082, 627013028]
828.1F27013028m031957n452930o491185o533384n934358n498826n458653n444586
844.4E82167149n107999m528284m266382m796803n847871o587386n991876l017724
860.7E42022824K166570P505655J1245251J3584613J4925719J4506757J1837602P893383
877F25688374M051447Q13603j990378m489243o421268p355392p224321o569683o082416
895.4E90420723n991221o065130o087005o271362p005990q333623r841323j1000574
911.7E29824495j1618137j1803091j1453241j0109722p689149m821330k317935o40303
928D69371587M57257J541942K775014M027396N163342O026119O286234N157977K017737
946.4E02824605k583743p346481j1249125j3863027j5401304j6465067j7426104j8319815
$$ y = [627013028, 622981071, 617528141, 611036956, 604503572, 598569214, 593070388, 587611735, 582167149, 577059150, 572530866, 568264484, 563467681, 557619810, 551032424, 545040548, 542022824, 544189394, 551695049, 562940300, 576524913, 591450632, 605957389, 617794991, 625688374, 629739821, 630553424, 628563046, 624073803, 617652535, 610297143, 603072822, 596503139, 590420723, 584429502, 578364372, 572277367, 566006005, 559000015, 550666392, 540825069, 529824495, 518206358, 506403267, 494950026, 484840304, 477151155, 472329825, 470011890, 469371587, 469828844, 471370786, 474145800, 478173196, 483336538, 489362657, 495648891, 500806868, 502824605, 500240862, 492894381, 481645256, 467782229, 452380925, 435915858, 418489754, 400169939]
962.7D00169939j9069672j9604683k0008981k0359486k0481676k0168841j9299388
977B61177212j7789468j5668243j3115988j0394275p751956n404681l441632j857624
993.3A85753345o35027K21416P70688J049340J024335P17163K16425k87220n47215
1011.6A88283250l54201K21282R09716J565859K185911K817243L454060L886208L969341
1030B06938669L769949L264189K465337J545474P65920L20330K73779O23420J339957
1048.4B21307024K407030L810510N389601O864383Q195401R447068J0519832J0766566
1064.7B78707415Q668780L011972m800916j0761201j1835873q786202m571393j113728
1081B48518854J315251L002927M236788N288362O224990O768584O532818N411923L736288
$$ y = [400169939, 381100267, 361495584, 341486603, 321127117, 300645441, 280476600, 261177212, 243387744, 227719501, 214603513, 204209238, 196457282, 191052601, 187610969, 185753345, 185118318, 185339734, 186110422, 187159762, 188184097, 188901260, 189117685, 188830465, 188283250, 187929049, 188150331, 189060047, 190625906, 192811817, 195629060, 199083120, 202969328, 206938669, 210708618, 213972807, 216438144, 217983618, 218749538, 219069868, 219343647, 219967067, 221307024, 223714054, 227524564, 232914165, 239778548, 247973949, 257421017, 267940849, 278707415, 287376195, 290388167, 285587251, 274826050, 262990177, 254203975, 249632582, 248518854, 249834105, 252837032, 257073820, 262362182, 268587172, 275355756, 281888574, 287300497, 291036785]
1099.4B91036785K018451Q87066Q17329J715779L038586M141986M592925M347623L608435
1117.7C16204965K675265J907677J640170K096743L146976M282296M802108M042118
1134C40798318J753927j564741m913718p407725q636325q731693q051962o884337n378097
1152.4B90983647l655046j908511k86937J279891L012210N062133P435739R868056
1168.7C11791182J1948525J3450534J4395564J4872134J5061766J5003175J4460474
1183D10983354J3381809J1961996J0311544Q379370O260306M277229K809972K055138
1199.3D70420718J859099J923203K155930K716631L668398M788070N682648N955994
1215.6D99170691N476802M461050L180027J778782L31998r57132j813888k186477k230943
$$ y = [291036785, 293055236, 293942302, 294759631, 296475410, 299513996, 303655982, 308248907, 312596530, 316204965, 318880230, 320787907, 322428077, 324524820, 327671796, 331954092, 336756200, 340798318, 342552245, 340987504, 336073786, 328666061, 320029736, 311298043, 303246081, 296361744, 290983647, 287328601, 285420090, 285133153, 286413044, 289425254, 294487387, 301923126, 311791182, 323739707, 337190241, 351585805, 366457939, 381519705, 396522880, 410983354, 424365163, 436327159, 446638703, 455018073, 461278379, 465555608, 468365580, 470420718, 472279817, 474203020, 476358950, 479075581, 482743979, 487532049, 493214697, 499170691, 504647493, 509108543, 512288570, 514067352, 514399350, 513442218, 511628330, 509441853, 507210910]
1234E07210910k175212k093434j828372j219273k53081Q45730J681149K083421K238035
1252.3E06489873K265692K054393J560330J012147P67052J038730J737356K415240
1268.6E19340813K550185K052665J245379M43935k11060p26223j081347j181722j065552
1287E21367073r69231j136899j577199k080202k421856k531290k500832k453029k478838
1305.4E03217697k480984k199292j714468j372695j303851j438231j638859k057850
1321.7D89011467l078938m576296n893767o451636o183595n373597m321813l181368
1338D49950457j813710l83198M90814P47174O02514K43485j14531l95179n79416p70182
1358.4D47978228j043200j118273o27935j63167l8386K02269N79059J057565J378506
$$ y = [507210910, 505035698, 502942264, 501113892, 499894619, 499641538, 500487268, 502168417, 504251838, 506489873, 508755565, 510809958, 512370288, 513382435, 514149487, 515188217, 516925573, 519340813, 521890998, 523943663, 525189042, 525632977, 525421917, 524695694, 523614347, 522432625, 521367073, 520397842, 519260943, 517683744, 515603542, 513181686, 510650396, 508149564, 505696535, 503217697, 500736713, 498537421, 496822953, 495450258, 494146407, 492708176, 491069317, 489011467, 485932529, 481356233, 475462466, 469010830, 462827235, 457453638, 453131825, 449950457, 448136747, 447753549, 448244363, 448991537, 449594051, 449837536, 449723005, 449327826, 448748410, 447978228, 446935028, 445816755, 445188820, 445025653, 444987267, 445189536, 445768595, 446826160, 448204666]
1376.7D48204666J281083J158983J544922K615512M176646M920989L959805K420276
1393.1D70282882R80646n7727p62552j113504j493246k086192k190858k161116k311796
1411.4D59086537k163678j806825j704306j287758j38313N66185Q97169J195878J476794
1429.8D56121683J821607J924307J956075K290607K364695K176195J767784J058311
1446.1D71481264J43438n98043j106083j630277k792835k700687l8117J415313K569377
1464.5D66743350M226834N389034O866992J0026902J1507094J0354876R283722Q604586
1480.8E33003390Q116901P217169O603360O752968O894826N697906M711569M849613
1497.1E83847702M945337M345775L385067K691328L240347L880740L371596K715230
$$ y = [448204666, 449485749, 450644732, 452189654, 454805166, 458981812, 463902801, 467862606, 470282882, 471263528, 471205801, 470443249, 469329745, 467836499, 465750307, 463559449, 461398333, 459086537, 456922859, 455116034, 453411728, 452123970, 451985657, 452551842, 453449011, 454644889, 456121683, 457943290, 459867597, 461823672, 464114279, 466478974, 468655169, 470422953, 471481264, 471624702, 471026659, 469920576, 468290299, 465497464, 462796777, 462758660, 464173973, 466743350, 470970184, 476359218, 483226210, 493253112, 504760206, 515115082, 524398804, 533003390, 541120291, 548337460, 554940820, 561693788, 568588614, 574286520, 578998089, 583847702, 588793039, 593138814, 596523881, 599215209, 602455556, 606336296, 609707892, 612423122]
1513.4F12423122K153933K163410K236068K296329K425611K239168K155661J970053
1529.7F30063355J573980J392543J396835Q13246P1704N12183J140952R88066M55916
1548.1F38408780o1929k84791n33939j063942k316833k068996l45111p58469j489401
1566.4F29485369k132356k476156j739085j931608k893805k170980j566827j918078
1582.8F12656474k091646k096057k124250k218604k304196k330184k290249k324701
1599.1E94876587k518952k685546k779425k945065l206670l225565l168106l956616
1615.4E70390642m702866l186942k665936l615261l471613k997815k689362j966774
1631.7E45094073j950860k576471j328647L1412K43366K18391K50340J107931J799583
$$ y = [612423122, 614577055, 616740465, 618976533, 621272862, 623698473, 625937641, 628093302, 630063355, 631637335, 633029878, 634426713, 635239959, 635311663, 635823846, 636964798, 637952864, 638408780, 638346851, 638062060, 637528121, 636464179, 634147346, 632078350, 631733239, 630974770, 629485369, 627353013, 624876857, 623137772, 621206164, 618312359, 616141379, 614574552, 612656474, 610564828, 608468771, 606344521, 604125917, 601821721, 599491537, 597201288, 594876587, 592357635, 589672089, 586892664, 583947599, 580740929, 577515364, 574347258, 570390642, 565687776, 562500834, 559834898, 556219637, 552748024, 549750209, 547060847, 545094073, 543143213, 540566742, 539238095, 539269507, 539512873, 539731264, 539981604, 541089535, 542889118]
1650.1E42889118J783967K833784L605544L371418L352046L785849M276454M001141
1666.4E69899321M061997M858672M893899N115748N642056N191147M603804M767656
1682.7F09034300O417394O309688N213797N062580M373789L915846L874719L674865
1699F47876978L956437L411055K736628K753734K614916K234578J819312J560629K065122
1717.4F71029389K886057K784908K417802K249480K048135J867532J641691J720250
1733.7F88645244K288818K216399K024948K124191K242028K252102K328754K909362
1750G07031846L619075L384709K944827K824962K658904K703726K602220K071619J602411
1768.4G31444299J379788J613557K067745J912952J461982J258493J325846J349210
$$ y = [542889118, 544673085, 547506869, 551112413, 554483831, 557835877, 561621726, 565898180, 569899321, 573961318, 578819990, 583713889, 588829637, 594471693, 599662840, 604266644, 609034300, 615451694, 621761382, 626975179, 632037759, 636411548, 640327394, 644202113, 647876978, 651833415, 655244470, 657981098, 660734832, 663349748, 665584326, 667403638, 668964267, 671029389, 673915446, 676700354, 679118156, 681367636, 683415771, 685283303, 686924994, 688645244, 690934062, 693150461, 695175409, 697299600, 699541628, 701793730, 704122484, 707031846, 710650921, 714035630, 716980457, 719805419, 722464323, 725168049, 727770269, 729841888, 731444299, 732824087, 734437644, 736505389, 738418341, 739880323, 741138816, 742464662, 743813872]
1784.7G43813872J254857R93669O86526R37820J392722J263022R04262Q84295J176178
1803G53307223J236320J026809P78377P41661R15348R71973Q67844P97868O69241M80890
1823.4G61793554N11706N71310N05507P04527Q17537O06776N10692M60208J58190q0943
1843.8G66559064L12388O78838N62846L69370K43247K08974K36153K80440K50757J12176
1864.2G69814253j05322j05500L96610P10070N14030K95639L19004M19378M46380M00543
1884.6G73105085K88308J86085L37303M87804L57807K60592K47180K13623J97411J74164
1905G75855362N8234j2696J31190K60055J37866n7101j252J22309K22921L80337L17633
1927.5G77414858J08183N5194J52647K17915J52170l1292j47700O0439L61979L74257
$$ y = [743813872, 745068729, 746062398, 746748924, 747686744, 749079466, 750342488, 751246750, 752131045, 753307223, 754543543, 755570352, 756348729, 757090390, 758005738, 758977711, 759845555, 760643423, 761312664, 761793554, 762305260, 762876570, 763382077, 764086604, 764904141, 765510917, 766021609, 766481817, 766640007, 766559064, 766871452, 767550290, 768113136, 768482506, 768725753, 768934727, 769170880, 769451320, 769702077, 769814253, 769708931, 769603431, 770000041, 770710111, 771224141, 771519780, 771838784, 772258162, 772704542, 773105085, 773393393, 773579478, 773916781, 774404585, 774762392, 775022984, 775270164, 775483787, 775681198, 775855362, 775913596, 775900900, 776032090, 776292145, 776430011, 776372910, 776371658, 776493967, 776716888, 777097225, 777414858, 777523041, 777578235, 777730882, 777948797, 778100967, 778069675, 777921975, 777982414, 778344393, 778718650]
1947.9G78718650K42114J61350J61290K56479L26395K57373J30951P2241J29044K76923
1968.3G80732810K98560J49787O7949J20103J90616J68204Q8036K7478k027J6809O3121
1990.7G81921446Q5414N5015J252K5928P2598J550j44363k53558k43842j92225k40028
2013.1G81089187m04418n54681n56767m95970n61476o18994m08411k16663k55942l14355
2033.5G76701510l63767m80533n78821m91976k78175j93954k88963l49343k43366p4744
2053.9G73357868J1921j192p6830j08898J9133J84655J96338N5611n7399j8239R7275
2076.4G73660243J44004O7354n1320m9055J21594K62499J88827J1802L338J68085K83360
2098.8G74810731K46942J05441m172R0599L04580L22818J08183p9096n0366J21713
$$ y = [778718650, 778960764, 779122114, 779283404, 779539883, 779866278, 780123651, 780254602, 780326843, 780455887, 780732810, 781031370, 781181157, 781249106, 781369209, 781559825, 781728029, 781816065, 781843543, 781841516, 781858325, 781921446, 782006860, 782061875, 782063127, 782089055, 782161653, 782163203, 782018840, 781765282, 781521440, 781329215, 781089187, 780684769, 780130088, 779573321, 779077351, 778515875, 777896881, 777488470, 777271807, 777015865, 776701510, 776337743, 775857210, 775278389, 774786413, 774508238, 774314284, 774025321, 773675978, 773432612, 773357868, 773369789, 773368597, 773291767, 773182869, 773202002, 773386657, 773582995, 773638606, 773581207, 773562968, 773660243, 773804247, 773871601, 773820281, 773771226, 773892820, 774155319, 774344146, 774355948, 774359286, 774527371, 774810731, 775057673, 775163114, 775158942, 775249541, 775554121, 775876939, 775985122, 775906026, 775855660, 775977373]
2119.2G75977373K20657R5307j28328j53423N8592K27451J32620j07288k14279m9174
2139.6G76059508J93835K25961L1471j43230o5029J73212K77280J49250J0729Q4162
2160G76997149L35813N26070M52340K48611K44856M88758P08878O85692M76181L51191
2180.4G81515539M55200O49929O87659M79937K58207K91050N08904O24180N19395L11315
2200.8G86301315K37405M09246O00397N55039L52144K59995L64960N30660N65946M02510
2221.2G90579617K23160K35975L76820M63247L80934J85549J05977K33829L88742L50952
2241.6G93524802J79887J01208J66476K63274L05950K59757J50562J07348K11179L35991
2262G95606434K91944J29759Q8334K28107L52681L20315J91987Q7976R0063J81913
$$ y = [775977373, 776198030, 776293337, 776165009, 776011586, 776070178, 776297629, 776430249, 776322961, 776108682, 776059508, 776253343, 776479304, 776510775, 776367545, 776302516, 776475728, 776753008, 776902258, 776912987, 776997149, 777332962, 777859032, 778311372, 778559983, 778804839, 779293597, 780002475, 780688167, 781164348, 781515539, 781970739, 782620668, 783308327, 783788264, 784046471, 784337521, 784846425, 785470605, 785990000, 786301315, 786538720, 786947966, 787548363, 788103402, 788455546, 788715541, 789080501, 789611161, 790177107, 790579617, 790802777, 791038752, 791415572, 791878819, 792259753, 792445302, 792551279, 792785108, 793173850, 793524802, 793704689, 793805897, 793972373, 794235647, 794541597, 794801354, 794951916, 795059264, 795270443, 795606434, 795898378, 796028137, 796116471, 796344578, 796697259, 797017574, 797209561, 797297537, 797387600, 797569513]
2282.3G97569513K67923K54214J60098J16825J89126K76267K43664J31369N9008J21951
2302.7G99389958K77877L52085K89440J59562R6738J81556L27348L79444K26736J9073
2323.1H01699817O0678K64644K81215R477k26259j60575k8312n1260j66059m45902
2343.5H01237464q42273o44565N8174N40793N58078L48330J57714k623k34961o02544
2363.9H00573587q82208r05275p56920o99699p84695q62241q11517o13272m21703l54290
2384.3G93481767l74853l75152k78711j51456j43349k78592l91483l71933l02434l08752
2404.7G90505052l97385m80115m86731m64976m77076n13554n62489n92410n89073n69701
2425.1G85371542n82635o49453o80863o67453o83070o96897p01428p22825p23004p11918
$$ y = [797569513, 797837436, 798091650, 798251748, 798368573, 798557699, 798833966, 799077630, 799208999, 799268007, 799389958, 799667835, 800019920, 800309360, 800468922, 800565660, 800747216, 801074564, 801454008, 801680744, 801699817, 801760495, 802025139, 802306354, 802315831, 802089572, 801928997, 801900685, 801849425, 801683366, 801237464, 800395191, 799750626, 799808800, 800349593, 800907671, 801256001, 801413715, 801411092, 801176131, 800573587, 799691379, 798786104, 798029184, 797329485, 796544790, 795682549, 794871032, 794257760, 793836057, 793481767, 793106914, 792731762, 792453051, 792301595, 792158246, 791879654, 791488171, 791116238, 790813804, 790505052, 790107667, 789627552, 789140821, 788675845, 788198769, 787685215, 787122726, 786530316, 785941243, 785371542, 784788907, 784139454, 783458591, 782791138, 782108068, 781411171, 780709743, 779986918, 779263914, 778551996]
2445.5G78551996p13766o99699o80625o95527p09653o83009o37710o28770o65068o74189
2465.9G71763980o32286o00576o19352o39558o44266o56784o08146n13435n10156n80728
2486.3G65758693n74410m81307m15325m11392m21047m26948m26531l92616l55064l57032
2506.7G61497021l88325m33266m41372m02510m08054m74155n18858n26905n42343n75363
2527.1G56785870o22571o76870p26581p45356p26521p44581q00014q08179p65920p35342
2547.5G49433935p32541p46251p74025p77364p52092p40170p51376p69973p63834p16805
2567.9G41909504o78897p00831p53880p76708p56264p10189o47783o22094o52671o49989
2588.3G34960198n76913n04017m80890n05984n38647n32031m99726m87506n63741p16507
$$ y = [778551996, 777838230, 777138531, 776457906, 775762379, 775052726, 774369717, 773732007, 773103237, 772438169, 771763980, 771131694, 770531118, 769911766, 769272208, 768627942, 767971158, 767363012, 766849577, 766339421, 765758693, 765184283, 764702976, 764287651, 763876259, 763455212, 763028264, 762601733, 762209117, 761854053, 761497021, 761108696, 760675430, 760234058, 759831548, 759423494, 758949339, 758430481, 757903576, 757361233, 756785870, 756163299, 755486429, 754759848, 754014492, 753287971, 752543390, 751743376, 750935197, 750169277, 749433935, 748701394, 747955143, 747181118, 746403754, 745651662, 744911492, 744160116, 743390143, 742626309, 741909504, 741230607, 740529776, 739775896, 738999188, 738242924, 737532735, 736884952, 736262858, 735610187, 734960198, 734383285, 733879268, 733398378, 732892394, 732353747, 731821716, 731321990, 730834484, 730270743, 729554236]
2608.7G29554236q02636q07226q30114q87155r59397j042723j101673j113296j141369
2627G20868647j218259j294792j316965j289486j293779j348078j386881j390815j363575
2645.4G08966017j315296j291633j312196j341581j316250j239240j199066j229823
2661.7F98720932j262605j244962j196564j128614j092970j129568j144170j060844
2678F89460635r49204r43541j048923j118660j052618r50515r92835j142859j228750
2696.4F80032730j216769j174808j167953j234054j348615j382768j268983j165926
2712.7F70072854j188040j241863j251638j179695j065195j015007j023352j039386
2729F61068678j000524q91328q14557q30173q92043r32217q74519p51257p27713q25048
$$ y = [729554236, 728751600, 727944374, 727114260, 726227105, 725267708, 724224985, 723123312, 722010016, 720868647, 719650388, 718355596, 717038631, 715749145, 714455366, 713107288, 711720407, 710329592, 708966017, 707650721, 706359088, 705046892, 703705311, 702389061, 701149821, 699950755, 698720932, 697458327, 696213365, 695016801, 693888187, 692795217, 691665649, 690521479, 689460635, 688511431, 687567890, 686518967, 685400307, 684347689, 683397174, 682404339, 681261480, 680032730, 678815961, 677641153, 676473200, 675239146, 673890531, 672507763, 671238780, 670072854, 668884814, 667642951, 666391313, 665211618, 664146423, 663131416, 662108064, 661068678, 660068154, 659176826, 658362269, 657532096, 656640053, 655707836, 654833317, 654082060, 653354347, 652529299]
2749.4F52529299q80301q00311o68884o33657p02381p36952o87539o22153n88358o48320
2769.8F45560443p92920q78096q51869q35002r21428j079619j208842j245975j229108
2788.2F36517584j243770j353264j505255j575172j585305j654625j784205j897753
2804.5F23918235j970648k023995k065897k111733k214730k375305k451956k391160
2820.8F06312811k398073k578318k774060k835036k814769k826989k914667l096342
2837.1E84074557l307939l496349l685116l882826m067003m135430l947020l542900
2853.4E54009974l128231k872467k889156l182888l623486m117369m661858n173207
2869.7E24361312n536079n765140n887449n816877n427509m719317l844857k980829
$$ y = [652529299, 651648998, 650848687, 650179803, 649546146, 648843765, 648106813, 647419274, 646797121, 646208763, 645560443, 644767523, 643889427, 643037558, 642202556, 641281128, 640201509, 638992667, 637746692, 636517584, 635273814, 633920550, 632415295, 630840123, 629254818, 627600193, 625815988, 623918235, 621947587, 619923592, 617857695, 615745962, 613531232, 611155927, 608703971, 606312811, 603914738, 601336420, 598562360, 595727324, 592912555, 590085566, 587170899, 584074557, 580766618, 577270269, 573585153, 569702327, 565635324, 561499894, 557552874, 554009974, 550881743, 548009276, 545120120, 541937232, 538313746, 534196377, 529534519, 524361312, 518825233, 513060093, 507172644, 501355767, 495928258, 491208941, 487364084, 484383255]
2886.1D84383255k221942j565456j035124p16657o19769o67631p74086r28491j179576
2904.4D74674523j516193j890153k298355k802640l376752l867984m166991m202097
2920.7D50553358l943593l451198k728999j795590p36475M95702J845539L085434M152120
2939.1D47476298N024910N637794N987466O091743O124705O233663O277084O213486
2955.4D95067149O138951O010771N739808N360246M952728M507602M091560L877521
2971.7E35746336L825486L726363L606081L512323L280401K945542K681911K449036
2988E61773479K157211J795650J442551J234472J057565P14720K68399j11043l32117
3006.4E70000887n00918p39514j017332j317442j602054j790344j923800k075612k241254
$$ y = [484383255, 482161313, 480595857, 479560733, 478844076, 478224307, 477556676, 476782590, 475854099, 474674523, 473158330, 471268177, 468969822, 466167182, 462790430, 458922446, 454755455, 450553358, 446609765, 443158567, 440429568, 438633978, 437897503, 438393205, 440238744, 443324178, 447476298, 452501208, 458139002, 464126468, 470218211, 476342916, 482576579, 488853663, 495067149, 501206100, 507216871, 512956679, 518316925, 523269653, 527777255, 531868815, 535746336, 539571822, 543298185, 546904266, 550416589, 553696990, 556642532, 559324443, 561773479, 563930690, 565726340, 567168891, 568403363, 569460928, 570175648, 570444047, 570333004, 570000887, 569499969, 568760455, 567743123, 566425681, 564823627, 563033283, 561109483, 559033871, 556792617]
3024.7E56792617k361596k391755k398372k451360k602220k753258k711176k605558
3041.1E36517322k683103k900481l035903k995789k914906k924859k999306l082097
3057.4E12980878l076017k945065k850711k852083k927452l063828l094732k949536
3073.7D89221454k780587k760827k910704l031611l030747l009320k964675k931446
3090D65801537l000230l030538k891958k745122k809017k944381k863049k678275k675325
3108.4D40163642k806902k757936k551049k506257k633422k820999k959281k844989
3124.7D18282807k600700k527177k613127k662450k534897k347827k350091k526135
3141C98120403k605408k498210k360612k216488k126187k260864k453089k438128k310276
$$ y = [556792617, 554431021, 552039266, 549640894, 547189534, 544587314, 541834056, 539122880, 536517322, 533834219, 530933738, 527897835, 524902046, 521987140, 519062281, 516062975, 512980878, 509904861, 506959796, 504109085, 501257002, 498329550, 495265722, 492170990, 489221454, 486440867, 483680040, 480769336, 477737725, 474706978, 471697658, 468732983, 465801537, 462801307, 459770769, 456878811, 454133689, 451324672, 448380291, 445517242, 442838967, 440163642, 437356740, 434598804, 432047755, 429541498, 426908076, 424087077, 421127796, 418282807, 415682107, 413154930, 410541803, 407879353, 405344456, 402996629, 400646538, 398120403, 395514995, 393016785, 390656173, 388439685, 386313498, 384052634, 381599545, 379161417, 376851141]
3159.4C76851141k208471k156585k129257k081901k038658k011954k016813k031773
3175.7C60175729k006382j928985j869917j858920j813233j769900j752734j720339
3192C45455319j740367j786619j714468j583785j556396j566202j514882j480639j487255
3210.3C31024706j481831j441151j391440j407385j421601j337200j246989j215249
3226.7C20081860j160711j038730j010895j212001j340538j213938j095295j064211
3243C10945541j014501r74715j024991j063317r82791q83222q84116r41098q93175
3261.3C02283615p65830p15882o75112n78105o25343q27103r37134q79467p55757o84738
3281.7B94839144o80387o76871o51717n58108m85927n98132p70271q13127o82860n07445
$$ y = [376851141, 374642670, 372486085, 370356828, 368274927, 366236269, 364224315, 362207502, 360175729, 358169347, 356240362, 354370445, 352511525, 350698292, 348928392, 347175658, 345455319, 343714952, 341928333, 340213865, 338630080, 337073684, 335507482, 333992600, 332511961, 331024706, 329542875, 328101724, 326710284, 325302899, 323881298, 322544098, 321297109, 320081860, 318921149, 317882419, 316871524, 315659523, 314318985, 313105047, 312009752, 310945541, 309931040, 308956325, 307931334, 306868017, 305885226, 305002004, 304117888, 303176790, 302283615, 301517785, 300801903, 300126791, 299548686, 298923343, 298096240, 297159106, 296279639, 295523882, 294839144, 294158757, 293481886, 292830169, 292272061, 291786134, 291188002, 290417731, 289604604, 288921744, 288414299]
3302.1B88414299m53948n71102q03590r58294r41455q43764p57545p25776p14808o49751
3322.5B80994266o22183p86006r24140q37625p27772o44177n42701o01023p77126q56429
3342.9B73675084q65430p78704o05613o70582r50695j022070p87705n57661n97746
3361.3B66838878o95347n55903m75526p08789r59128r10848o73026n53757n49108n78552
3381.7B60178894n85020m68552k19792P153j18733m84884n17428j38580N7071k85447
3402.1B57424682o42538m83185j69992q0615r8050j98513l06219k32756j11461m8548
3422.5B55052805O8933K00391K60800K32726K77251L61860J54644j70529j45793J84149
3442.9B56477237M05669L66062L08066L79652M48019M92543O05464O90549N70566N73247
$$ y = [288414299, 287960351, 287389249, 286585659, 285627365, 284685910, 283842146, 283084601, 282358825, 281644017, 280994266, 280372083, 279586077, 278661937, 277824312, 277096540, 276452363, 275909662, 275308639, 274531513, 273675084, 272809654, 272030950, 271425337, 270754755, 269804060, 268781990, 267994285, 267436624, 266838878, 266143531, 265587628, 265112102, 264403313, 263444185, 262533337, 261860311, 261306554, 260757446, 260178894, 259593874, 259125322, 258905530, 258912683, 258793950, 258309066, 257791638, 257653058, 257710129, 257424682, 256782144, 256298959, 256128967, 256048352, 255950302, 255751789, 255445570, 255212814, 255101353, 255052805, 255121738, 255322129, 255582929, 255815655, 256092906, 256454766, 256609410, 256438881, 256293088, 256477237, 256882906, 257248968, 257557034, 257936686, 258384705, 258877248, 259482712, 260173261, 260743827, 261317074]
3463.2B61317074Q81315R97006O75440K76089K61724N75572R14246R02772N57631N50241
3483.6B67909110Q46028Q34793P00056Q11339R66876J013399R65774R19819Q31097
3502B75798291O61463O66707Q28982J004100J197904J165509R15140Q61228J056104
3520.4B84155428J216233J065135Q07285Q17687J095265J370877J449436J313299J186162
3538.7B94476807J352489J506448J309156J089603J296967J488269J491964J679211
3555C05690914J894266J993686K049565J937836J613498J790792K643764K952278K697944
3573.4C25264543K588481K741039L022134L271937L248692K750278K377182L126859
3589.7C48391145L656358L393114L384679L739387L780097L728896L780753L517091
$$ y = [261317074, 262198389, 263195395, 263870835, 264146924, 264408648, 264984220, 265898466, 266801238, 267358869, 267909110, 268755138, 269589931, 270289987, 271101326, 272068202, 273081601, 274047375, 274967194, 275798291, 276459754, 277126461, 277955443, 278959543, 280157447, 281322956, 282238096, 283099324, 284155428, 285371661, 286436796, 287244081, 288061768, 289157033, 290527910, 291977346, 293290645, 294476807, 295829296, 297335744, 298644900, 299734503, 301031470, 302519739, 304011703, 305690914, 307585180, 309578866, 311628431, 313566267, 315179765, 316970557, 319614321, 322566599, 325264543, 327853024, 330594063, 333616197, 336888134, 340136826, 342887104, 345264286, 348391145, 352047503, 355440617, 358825296, 362564683, 366344780, 370073676, 373854429, 377371520]
3606C77371520L311902L612220L920317M068971M031807L811359M178524M606158M327625
3624.4D13240403L541827K955020L971934M761755M519254M265100M084379M016280
3640.7D45355952M100144L908336L292441L132314M231393M803896M243374M039049
3657D77106899M315704M013658L601908L587842L250242K587735L014803L277242K511025
3675.4E07267058L092348L897906L687382L423154L143489K452910J735926K308369
3691.7E31008542L082931K973377K511978J985848J715243K192736K459764J839400
3708E49769819R84013J053214K235353K626181K106607J523077J241863J248956J500308
3726.4E64289391J937330J756429Q97527L63767J057566K085030K102852Q57234j62185
$$ y = [377371520, 380683422, 384295642, 388215959, 392284930, 396316737, 400128096, 404306620, 408912778, 413240403, 416782230, 419737250, 423709184, 428470939, 432990193, 437255293, 441339672, 445355952, 449456096, 453364432, 456656873, 459789187, 464020580, 468824476, 473067850, 477106899, 481422603, 485436261, 489038169, 492626011, 495876253, 498463988, 501478791, 504756033, 507267058, 510359406, 514257312, 517944694, 521367848, 524511337, 526964247, 528700173, 531008542, 534091473, 537064850, 539576828, 541562676, 543277919, 545470655, 547930419, 549769819, 550753832, 551807046, 554042399, 556668580, 558775187, 560298264, 561540127, 562789083, 564289391, 566226721, 567983150, 568880677, 569244444, 570302010, 572387040, 574489892, 575347126, 575184941]
3744.7E75184941J082182J340270M23253J424789K371788J740992J045525J371086
3761E85984826J615048J125872Q33213P61032J015365J536787J500308J015544O24419
3779.4E96012414Q35716R97424Q88825J027822J103938J067161R00150M95195N00202
3797.7F03828847L76702J04129J015842J111388P26223J328409J461863N83292j23978
3816.1F10412717M02510K84612L36588J392185J278818Q91030P80344O37293O64711
3834.4F17080808J68740l36289L94821J092315J285374J328230J037598P2121j542508
3852.8F20581210n55337J867891J815438P87437k2352J35481O91653L00407J75893
3871.2F25777721P58589J017809J015126L42191O7412M99666L19243N67019P19130
$$ y = [575184941, 576267123, 577607393, 578030646, 579455435, 581827223, 583568215, 584613740, 585984826, 587599874, 588725746, 589558959, 590319991, 591335356, 592872143, 594372451, 595387995, 596012414, 596848130, 597845554, 598734379, 599762201, 600866139, 601933300, 602833450, 603328645, 603828847, 604205549, 604309678, 605325520, 606436908, 607163131, 608491540, 609953403, 610536695, 610412717, 610815227, 611099839, 611436427, 612828612, 614107430, 614998460, 615778804, 616416097, 617080808, 617249548, 616913259, 617308080, 618400395, 619685769, 621013999, 622051597, 622123718, 620581210, 620025873, 621893764, 623709202, 624496639, 624474287, 624609768, 625301421, 625601828, 625777721, 626536310, 627554119, 628569245, 628911436, 628978848, 629478514, 629797757, 630364776, 631083906]
3889.5F31083906J86145M45902Q68559L75211k55107k77639P5400O99103J083195Q55684
3909.9F35140359N49913L16799n0009j07348K77818L75390J59382K46704M04954J38283
3930.3F37452245L0219M14551N67138L70681J70350Q4520K51412K99156J24573K40744
3950.7F40005589M45663L84391K42889J97172J40965J52588L07500L16024J70231R1135
3971.1F42454147J20938J91152K57671K50936J96039J78099J68145J73449J86205J42634
3991.5F44319415R0957J49846K54094
3997.6F44814312
$$ y = [631083906, 631270051, 631715953, 632584512, 632959723, 632704616, 632426977, 632502377, 633201480, 634284675, 635140359, 635690272, 636007071, 635957062, 635849714, 636127532, 636502922, 636662304, 636909008, 637313962, 637452245, 637482464, 637897015, 638464153, 638834834, 639005184, 639089704, 639341116, 639640272, 639764845, 640005589, 640451252, 640835643, 641078532, 641275704, 641416669, 641569257, 641876757, 642192781, 642363012, 642454147, 642575085, 642766237, 643023908, 643274844, 643470883, 643648982, 643817127, 643990576, 644176781, 644319415, 644410372, 644560218, 644814312]
##END=$$ End of the data block
