##TITLE=$$ Begin of the data block
##JCAMP-DX=5.00 $$ ACD/SpecManager v 10.08
##SPECTROMETER/DATA SYSTEM=Alpha
##DATE=23 Dec 2014 09:14:34
##DATA TYPE=INFRARED SPECTRUM
##DATA CLASS=XYDATA
##ORIGIN=
##OWNER=
##NPOINTS=1765
##FIRSTX=399.76428223
##LASTX=3997.64306641
##MAXX=3997.64306641
##MINX=399.76428223
##MAXY=0.84380579
##MINY=0.21559638
##XFACTOR=1.0000000000
##YFACTOR=1.000000000000000e-9
##FIRSTY=0.49412259
##DELTAX=2.03961372
##XUNITS=1/CM
##YUNITS=ARBITRARY UNITS
##XYDATA=(X++(Y..Y))
399.8 494122595 490525752 487091899 484099269 482796311 484206676 487527549 490405917 491112947 489699125
418.1 489699125 487977624 487122893 486008734 483782381 480524421 476777732 473368108 471009076 469963193
436.5 469963193 470581204 472916931 476830333 481837690 486935437 491429001 494482815 495406002 494623899
454.8 494623899 493434101 492786765 492130786 490207314 486676604 482353419 478332162 475056231 472510308
473.2 472510308 470494241 468404233 466051936 464232117 463812172 464556694 465270966 465017170 463804960
491.5 463804960 462330282 460984677 459464729 457394242 454676002 451690197 448857725 446023583
507.9 446023583 442889959 439275414 435171902 430610836 425960958 422059536 419191182 417212397
524.2 417212397 416047662 415548265 415774584 417094529 419708133 423690259 428943932 434840560 440358281
542.5 440358281 444483042 446739584 447221756 446228415 444262266 441688240 438572496 434930950 430504262
560.9 430504262 425059617 418843955 412083775 405337334 399881482 396770895 396303892 398246497 402374685
579.3 402374685 408493668 415816993 423332989 430231392 435638666 439120471 440927148 441604704 441684067
597.6 441684067 441587746 441392303 440947115 440487772 440492511 441227198 442625672 444479495 446696937 449303567
618 449303567 452469528 456284255 460485756 464593232 468103528 470903128 473333389 475600958 477706432
636.4 477706432 479512960 480946243 482260287 483720750 485331208 486849755 488016695 488942981 489887208
654.7 489887208 490874290 491835356 492738843 493525147 494833499 497990519 500826418 500686049 500985384
673.1 500985384 502493143 504184544 505776644 507367432 508954108 510201812 510761261 510686100 510153115
691.4 510153115 509196579 507698357 505411625 502252340 498566300 495118827 492650002 491433293 491412997
709.8 491412997 492560893 494916797 498584390 503686547 509879529 516270339 522369027 528242588
726.1 528242588 533926547 539375722 544393480 548618495 551829517 554068804 555510700 556270599 556193948
744.5 556193948 554837346 551919818 547608495 542569101 537544310 532772601 528151572 523855507
760.8 523855507 520515025 518867254 519472897 522574246 527999103 535134554 543402791 552580118 562244892
779.1 562244892 571587443 579877436 586744130 592202485 596691549 600819588 605046272 609513819
795.4 609513819 614080131 618580580 622926831 627008200 630668163 633726120 635921478 637195706
811.8 637195706 637935758 638574362 639172614 639513969 639161587 637706757 635057867 631393850 627002656
830.1 627002656 622004688 616447687 610458076 604294479 598377347 593047619 588391364 584234238
846.4 584234238 580168486 575758219 570791364 565339863 559701622 554750919 552378476 554516435
862.8 554516435 561453462 571960509 584765553 598714828 611946642 622390926 629013896 631927788
879.1 631927788 631732285 628996313 624047101 617281199 609496415 601646900 594486952 588288009 582645893
897.4 582645893 576854348 570459008 563430905 555896699 547738850 538612723 528241873 516760290
913.7 516760290 504959881 494078547 485247135 479028642 475235194 473170519 472240090 472426176
930.1 472426176 474055529 477101713 481008708 485267848 489809483 494392902 497754246 497891665 493275464
948.4 493275464 483799368 470724940 455662608 439655274 423056811 405893892 388171792 369988263
964.7 369988263 351568580 333193213 315114617 297528088 280665010 264949739 250933915
979 250933915 239161551 230004430 223454252 219158679 216668442 215596378 215606913 216456518 217898637
997.4 217898637 219586551 221209943 222538307 223401517 223807409 223895013 223823547 223820925 224129483 224951088
1017.8 224951088 226380125 228445798 231122598 234251305 237591162 240914106 244090870 246960923
1034.1 246960923 249235824 250717819 251513004 251897603 252212912 252828240 254041106 256122261 259330601
1052.4 259330601 263799071 269472063 276290476 284345984 293635190 303398162 311482579 314660400
1068.8 314660400 310925871 301930457 291966766 284518033 280563176 279544622 280679196 283400565
1085.1 283400565 287301421 292040169 297317505 302834481 308172554 312774628 316131771 318010658
1101.4 318010658 318744689 319230795 320481569 323013932 326609433 330678105 334624588 337975532 340531766
1119.8 340531766 342451662 344141841 346188426 349165380 353237361 357863814 361900687 364049643
1136.1 364049643 363351583 359584272 353358060 345773011 337916225 330612481 324354529 319373965
1152.4 319373965 315744609 313430101 312380135 312669545 314517498 318091899 323489100 330792576
1168.7 330792576 339960992 350761652 362819940 375632793 388748407 401922375 414960951
1183 414960951 427579761 439356089 449742436 458256483 464753240 469468266 472883314 475514650
1199.3 475514650 477744460 479824424 482002676 484672517 488249391 492893219 498356640 504085720
1215.6 504085720 509488583 514077902 517522037 519679844 520547807 520228863 518972337 517146826 515142500
1234 515142500 513256252 511578560 510102868 509001434 508592010 509111881 510585129 512759864 515203774
1252.3 515203774 517507195 519401014 520818412 521940887 523062289 524437249 526254773 528530836
1268.6 528530836 531023860 533314109 535022080 535943925 536016226 535406947 534524918 533735096 533149362
1287 533149362 532582045 531696439 530262172 528306723 526073933 523818910 521650493 519468367 517073154
1305.4 517073154 514511049 512212515 510539830 509384513 508351386 507098854 505490661 503440976
1321.7 503440976 500650585 496770024 491738945 485898584 479916304 474531502 470300823 467490017
1338 467490017 466088593 465723991 465833962 466119498 466458112 466705203 466699660 466274798 465368211 464106113
1358.4 464106113 462765336 461722821 461228162 460925817 460506231 460208118 460420221 461432368 462932438
1376.7 462932438 464289367 465335429 466486007 468601167 472519487 477457166 481421649 483815044
1393.1 483815044 484757543 484579980 483835727 482933313 481713831 479873091 477620959 475207984 472817391
1411.4 472817391 470773637 469091117 467459857 466058642 465437591 465555072 466298699 467455924 468858153
1429.8 468858153 470336288 471666962 473309726 475699723 478054434 480090976 481609732 482297719
1446.1 482297719 482202113 481603354 480603814 479109913 476692826 474300951 473751485 474353075 476287693
1464.5 476287693 479920685 484364867 489978045 498674750 509111941 518748283 527552903 535822034
1480.8 535822034 543531358 550139010 556164503 562765002 569863558 575584412 580108285 584701538
1497.1 584701538 589256763 593168199 596235156 599078834 603131592 607086241 609930813 612347782
1513.4 612347782 614701927 617317200 619796216 622237265 624621034 626702547 628998220 631168485
1529.7 631168485 632841527 634262979 635295630 635576367 635827124 637143135 638658285 639607191 639771640
1548.1 639771640 639413834 638996422 638534307 637643933 636013925 634829998 634385109 633449674 632179856
1566.4 632179856 630730212 629137397 627646685 625617802 623086095 621487498 620401204 618960679
1582.8 618960679 617138088 615032375 612851262 610839725 609056294 607287526 605336070 603117585
1599.1 603117585 600653470 598163784 595782638 593369007 590655208 587643564 584394574 580561757
1615.4 580561757 576508164 573664546 571054578 567706108 564369857 561266184 558476269 556289613
1631.7 556289613 554109991 551609457 550102532 549487770 549079776 548830330 548992634 550068557 551206887
1650.1 551206887 552301526 555075347 558364511 561220706 564220190 567756414 571607172 574977577
1666.4 574977577 578701258 583723783 588633955 593533397 598864436 603559315 607651114 612370908
1682.7 612370908 619554579 626243532 631179154 635829031 639795423 643756270 648165405 652269661
1699 652269661 656591356 659951031 662503958 665373981 668172121 670487523 672214448 673541069 675558925
1717.4 675558925 678510010 681211531 683616221 685854316 687624156 689029217 690316856 692376673
1733.7 692376673 695302010 697501481 699285924 701262891 703427970 705807269 708510578 711840332
1750 711840332 715505242 718505204 721100211 723866343 726666629 729627907 732242405 734025180 735357463
1768.4 735357463 736689985 738639712 741064072 742969751 744235456 745277762 746450901 747866452
1784.7 747866452 749383867 750534773 751160324 751930892 753168702 754429698 755601823 756831527 758014023
1803 758014023 758911014 759627044 760453463 761584699 762792706 763724387 764382184 764978111 765567362 766187608
1823.4 766187608 766981006 767679334 768153667 768794894 769535720 770191073 770899773 771501362 771659732 771575987
1843.8 771575987 771865487 772507966 773214400 773818076 774163485 774279416 774348736 774590492 774997532 775337100
1864.2 775337100 775374353 775264204 775499344 776063383 776673079 777242184 777722120 778040767 778260410 778530777
1884.6 778530777 778892338 779349267 779906869 780330896 780523777 780712962 781013072 781409144 781780839 781946480
1905 781946480 781870544 781773269 781930208 782277584 782529652 782619417 782689154 782731473 782863557 783230662 783639848
1927.5 783639848 783907652 784015119 784034908 784074008 784194052 784321129 784415662 784575939 784783661 784984469
1947.9 784984469 785246730 785559654 785849512 786107719 786324918 786510408 786696434 786873043 787053049 787321448
1968.3 787321448 787605405 787770569 787882090 788034499 788219631 788408577 788585663 788668811 788626075 788547397
1988.7 788547397 788546622 788716137 788954139 789039612 788958728 788860023 788817585 788796067 788714886 788522542 788227260
2011.1 788227260 787854135 787435889 787050724 786684334 786200881 785508454 784764886 784347415 784242690 784116507
2031.5 784116507 783843637 783416688 782862186 782299161 781874716 781611741 781397462 781124771 780816317 780576527
2051.9 780576527 780449629 780421853 780466616 780517340 780503273 780433595 780393660 780463517 780613005 780727506 780743659
2074.3 780743659 780712366 780704021 780752420 780859470 780986130 781072617 781079590 781092167 781209052 781397283 781606555
2096.8 781606555 781806290 781947732 782052755 782194853 782375038 782541454 782687783 782825172 782891691 782895327
2117.1 782895327 782930136 782995224 783050179 783096135 783122778 783125162 783102393 783057034 783065856 783139229 783182859 783174992
2141.6 783174992 783157110 783156276 783215940 783349156 783496320 783619761 783711612 783812821 784010291 784326494 784710109
2164.1 784710109 785091996 785427809 785766065 786228657 786837578 787484229 788058400 788516045 788893044 789306283
2184.5 789306283 789857507 790497661 791074753 791479230 791745722 792042375 792482972 793043792 793612957 794042349
2204.8 794042349 794330239 794622421 795023143 795549870 796139777 796630621 796921492 797132552 797430217 797869146
2225.2 797869146 798388898 798816144 799012661 799068034 799219072 799588680 800087094 800512135 800731361 800803304
2245.6 800803304 800914168 801211596 801695704 802182317 802464783 802544177 802608848 802877009 803384006 803905785
2266 803905785 804203808 804273903 804289103 804427564 804743469 805090666 805258453 805244803 805310726 805704713 806428254
2288.5 806428254 807271302 808011413 808580816 809075296 809696376 810583651 811720550 813035131 814410627
2306.8 814410627 815718174 816965163 818218291 819614768 821456611 823718667 825808644 827326238
2323.1 827326238 828636944 830236077 831935227 833005369 833245337 833377302 833878934 834570944 834925056
2341.5 834925056 833775580 830066562 826175451 825635791 829127192 834721982 839712262 842846155
2357.8 842846155 843805790 842882633 840690076 837492168 833452821 828894436 824080050 819410980 815180123
2376.2 815180123 811384320 807957768 804979861 802654803 801056147 800101638 799646378 799451232 799256563
2394.5 799256563 798921466 798477709 798064888 797779262 797577262 797328353 796916008 796319664 795674086 795154154
2414.9 795154154 794776261 794402003 793884695 793188572 792430103 791761041 791225672 790750980 790199220 789461076
2435.3 789461076 788600564 787791252 787113309 786534309 785948992 785221040 784366608 783549190 782853186 782276392
2455.7 782276392 781735301 781092644 780325651 779529214 778844535 778325617 777855277 777285159 776584983 775822699
2476.1 775822699 775091410 774499536 774058402 773605287 773003638 772316217 771707952 771272719 770973921 770679593
2496.5 770679593 770275891 769784093 769299507 768902838 768608212 768348634 768032372 767576158 766998768 766442955
2516.9 766442955 766001403 765624464 765194952 764622629 763931990 763243675 762632787 762063563 761423588 760640562
2537.3 760640562 759751439 758864880 758103311 757460773 756796360 756041169 755213141 754359245 753586829 752937138
2557.7 752937138 752317369 751629829 750850618 750012696 749210477 748526990 747912884 747258782 746521115 745731950
2578.1 745731950 744984269 744349539 743786871 743197143 742523074 741808474 741166711 740655839 740253150 739868939
2598.5 739868939 739396930 738810122 738165557 737530887 736901581 736212909 735407114 734471440 733458579
2616.8 733458579 732445061 731442809 730417490 729315639 728096962 726782739 725451708 724191606
2633.2 724191606 722957909 721649766 720278502 718897223 717526317 716189981 714903712 713620365
2649.5 713620365 712307572 710980237 709656954 708385348 707165301 705937743 704698145 703462899
2665.8 703462899 702252567 701101601 699991167 698897421 697835565 696801424 695756674 694689512
2682.1 694689512 693623781 692581236 691552281 690488338 689378500 688259006 687151968 686051667
2698.4 686051667 684914231 683711827 682462692 681174338 679860890 678571403 677324355 676098645
2714.7 676098645 674891114 673687577 672513723 671453238 670493126 669560075 668622315 667676568 666732430
2733.1 666732430 665806830 664929330 664113581 663329601 662514329 661644161 660769463 659945905 659185767 658472180
2753.5 658472180 657773495 657060623 656343699 655632496 654937923 654293656 653648794 652904749 652060211 651189148
2773.9 651189148 650325358 649439394 648483276 647417605 646258473 645047605 643812060 642535806 641144574
2792.2 641144574 639613390 637993395 636341035 634667814 632928908 631083190 629137993 627166033
2808.6 627166033 625188053 623088956 620834768 618504167 616121173 613703310 611256421 608754635
2824.9 608754635 606172740 603485584 600697279 597815096 594840884 591786861 588624477 585288942
2841.2 585288942 581724107 577912271 573948145 570011795 566280067 562895417 559896410 557143271
2857.5 557143271 554388344 551401496 547993004 544062734 539616346 534772158 529723644 524539888
2873.8 524539888 519225478 513986588 509197712 505139589 501852870 499285102 497389138 496048063
2890.1 496048063 495118976 494461209 493894279 493268520 492552757 491714716 490645379 489277899 487581372
2908.5 487581372 485501826 482963324 479909152 476424128 472712845 469030619 465683490 462863028
2924.8 462863028 460688859 459348261 458967686 459617406 461412638 464426041 468466669 473171443 478294909
2943.2 478294909 483684629 489216655 494885206 500698328 506493449 512148201 517706692 523151696
2959.5 523151696 528373301 533252299 537710309 541760147 545472503 548991501 552499354 556023359
2975.8 556023359 559483171 562826037 565922499 568669856 571151137 573431790 575446963 577097416
2992.1 577097416 578368425 579379022 580182195 580724835 580982506 580892563 580410659 579679668 578823030
3010.5 578823030 577728510 576324344 574674487 572776496 570697188 568579733 566390276 564080596
3026.8 564080596 561735094 559379816 556953311 554364502 551658332 549031317 546484530 543841124
3043.1 543841124 541015685 538069487 535150230 532325089 529546440 526734352 523790002 520825922
3059.4 520825922 518058062 515408218 512722015 509959400 507082701 504177153 501395583 498730361
3075.7 498730361 496071935 493330091 490519434 487709910 484923184 482249469 479672849 476976037
3092.1 476976037 474154115 471400440 468804628 466276377 463669240 461030334 458478808 455966800
3108.4 455966800 453422457 450996131 448786587 446572870 444197655 441657811 439002275 436399490
3124.7 436399490 433999628 431792974 429574311 427224785 424947083 422894776 420857161 418605387
3141 418605387 416269749 414037794 411916882 409932971 408062011 406131774 404041201 401899755 399855554
3159.4 399855554 397915989 396052688 394274026 392514139 390722811 388930738 387130708 385346949
3175.7 385346949 383647531 382032812 380440652 378823727 377237588 375740021 374256313 372733682
3192 372733682 371222973 369749278 368273377 366794109 365385860 364102036 362902582 361662209 360354632
3210.3 360354632 359087586 357904881 356752545 355589807 354436994 353297591 352154046 351022035
3226.7 351022035 349974990 349092394 348269820 347280562 346162289 345097214 344085783 343144447 342329085
3245 342329085 341532499 340624362 339653730 338756710 337962329 337201774 336454302 335701108 334919691 334190011
3265.4 334190011 333597779 333106607 332557499 331856757 331050932 330242604 329523057 328855604 328194201 327594727
3285.8 327594727 327070951 326598227 326157510 325659126 325033367 324314237 323610544 323076248 322702467 322233796
3306.2 322233796 321512431 320614815 319685638 318870276 318205386 317580640 316909581 316258818 315670460 314980537
3326.6 314980537 314120442 313270897 312530279 311892897 311371863 310818464 310080171 309260905 308477461 307820231
3347 307820231 307295054 306605279 305641472 304707676 304006368 303443760 302821517 302149415 301641047 301219255
3367.4 301219255 300570458 299688190 298858881 298210174 297645360 297093064 296484888 295870513 295432150 295236498
3387.8 295236498 295178831 294985741 294519335 294072479 293954670 293974102 293665558 293020070 292543888 292408794
3408.2 292408794 292323530 292145312 291885167 291574299 291358411 291289300 291264147 291302472 291501760 291788757
3428.6 291788757 291977584 292142093 292417735 292578340 292452216 292318493 292444468 292777151 293191463 293603182
3449 293603182 293963790 294304371 294750541 295344770 295991272 296528220 297030061 297816336 298806131 299501777
3469.4 299501777 299765915 300048023 300633729 301444173 302236855 302797914 303330243 304048568 304773360 305438370
3489.8 305438370 306222349 307144761 308082789 308923870 309711844 310504735 311178327 311721921 312363267 313266695
3510.2 313266695 314383060 315417409 316180080 316920489 317878008 318978846 319932997 320667893 321474016
3528.5 321474016 322501123 323651552 324871212 326018661 327003747 328109950 329408497 330649823
3544.8 330649823 331731766 332846910 334122837 335503489 336961448 338496834 340125352 341752380
3561.1 341752380 343147278 344463855 346431375 349008590 351387620 353512585 355750769 358188212
3577.5 358188212 360778242 363498032 366154402 368619204 371212423 374217719 377198130 380076408
3593.8 380076408 383196026 386554390 389936358 393290281 396477550 399394810 402394414 405670881
3610.1 405670881 409099877 412702531 416263252 419943392 424225241 428414971 431871533 434752852
3626.4 434752852 438033581 442380965 446591914 450417370 454121500 457742482 461332232 464810312
3642.7 464810312 467927396 470826000 474605858 479428798 483621985 487190515 491191655 495377958
3659 495377958 499031097 502317071 505409241 508091271 510740876 513967752 516937852 519797802 523418605
3677.4 523418605 527065814 530396461 533434570 536046863 538331389 540667474 543410480 546314418
3693.7 546314418 548965156 551177680 553038120 554981232 557202160 559190631 560617924 561717033
3710 561717033 563264012 565514505 567668498 569466293 571134150 572787225 574411750 576048970 577562034
3728.4 577562034 578577459 579253852 580297768 582000852 583704114 584748507 585054040 585506439 586674869
3746.7 586674869 587506831 588402092 590316415 592212915 593494236 594689786 596135974 597358167 598269224
3765.1 598269224 599236429 600296915 601527452 602851510 603958726 604822099 605621457 606526792 607464552
3783.5 607464552 608471870 609590828 610662818 611602604 612307549 612798393 613254607 613582075 614174128
3801.8 614174128 615277827 616144061 617105186 618391156 619320512 619645536 619862080 620346785 620782912
3820.2 620782912 621767521 623157799 624144435 624859035 625401795 625836134 626311541 626649618 626963913
3838.5 626963913 627709866 628787696 629940510 630850971 631165385 630686820 629970074 630851626 632638395
3856.9 632638395 633803844 634266973 634400725 634764433 635246813 635496438 635984838 636787355 637655377
3875.2 637655377 638346612 638618767 638990462 639576316 640077233 640608191 640958071 641282678 641935468 642485917
3895.6 642485917 642587781 642440915 642449319 642921865 643885612 644836545 645418763 645742178 645863175 645818233
3916 645818233 645936549 646342337 646686852 646890759 647216022 647546053 647675216 647876918 648338974 648796380
3936.4 648796380 649048269 649143159 649290025 649621785 649969876 650205672 650425673 650722086 651090860 651419103
3956.8 651419103 651617289 651762664 652007401 652321935 652525008 652642906 652803302 652995169 653226256 653502107
3977.2 653502107 653718293 653898001 654131174 654347360 654527843 654729247 654917955 655062556 655217707 655446231
3997.6 655446231
##END=$$ End of the data block
