##TITLE=$$ Begin of the data block
##JCAMP-DX=5.00 $$ ACD/SpecManager v 10.08
##SPECTROMETER/DATA SYSTEM=Alpha
##DATE=23 Dec 2014 09:14:34
##DATA TYPE=INFRARED SPECTRUM
##DATA CLASS=XYDATA
##ORIGIN=
##OWNER=
##NPOINTS=1765
##FIRSTX=399.76428223
##LASTX=3997.64306641
##MAXX=3997.64306641
##MINX=399.76428223
##MAXY=0.84334517
##MINY=0.21538344
##XFACTOR=1.0000000000
##YFACTOR=1.000000000000000e-9
##FIRSTY=0.49034506
##DELTAX=2.03961372
##XUNITS=1/CM
##YUNITS=ARBITRARY UNITS
##XYDATA=(X++(Y..Y))
399.8D90345061l244460l106296k722502j034319J652956L389925L001988P06196j751066
418.1D87237483j518517l67493j224339k502590l312976l776043l445596k288818q71003
436.5D67930108O39648K317071M158645N318433N316437M529357K889871Q55238p22170
454.8D93232638j346708r50157p72775j749038l082216m025519l988087l337771k783328
473.2D71197039k265066k143770k156944j482576o3687R46462N18918o47932j432240
491.5D62470204j502514j229733j234502j909971k830625l149122k902418k710641
507.9D45000678k863049l458291m229874m732937m650175l892243k837002j917363
524.2D16419744j212209n65737K43604J352399K609521M055500N439789O006062N414724
$$ plain form
399.8 490345061 487100601 483994305 481271803 480237484 481890440 485280365 488282353 488988549 487237483
418.1 487237483 485718966 485351473 484127134 481624544 478311568 474535525 471089929 468801111 467930108
436.5 467930108 468569756 470886827 475045472 480363905 485680342 490209699 493099570 493954808 493232638
454.8 493232638 491885930 490935773 490162998 488413960 485331744 481306225 477318138 473980367 471197039
473.2 471197039 468931973 466788203 464631259 463148683 463084996 464031458 464550376 463902444 462470204
491.5 462470204 460967690 459737957 458503455 456593484 453762859 450613737 447711319 445000678
507.9 445000678 442137629 438679338 434449464 429716527 425066352 421174109 418337107 416419744
524.2 416419744 415207535 414641798 414885402 416237801 418847322 422902822 428342611 434348673 439763397
542.5D39763397L832400J995385M31835r10282j848727k473802l142595l821015m471004
560.9D29355592n244583o071478o744683o747425n509525l243596n33163K102613M261762
579.3D01625514N986214P219135P559658O910473N409747L536999J922220Q02130Q5443
597.6D41057533k24352l24190m63873l53813J37001P84457J405716J886755K304018
616D46209252K737611L233225L833800M260630M106849L471523K796084K339065K156258
634.3D75144297K067685J855969J616955J394868J313090J482696J551121J264334
650.6D87691015R34154Q29309R09805J015008R52661Q32319J316518K900779K707720
669E00089288J75297M67300J479209J668990J595437J585484J579880J256168N51880
$$ plain form
542.5 439763397 443595797 445591182 446023017 445112735 443264008 440790206 437647611 433826596 429355592
560.9 429355592 424111009 418039531 411294848 404547423 399037898 395794302 395261139 397363752 401625514
579.3 401625514 407611728 414830863 422390521 429300994 434710741 438247740 440169960 440972090 441057533
597.6 441057533 440833181 440508991 440045118 439691305 439828306 440612763 442018479 443905234 446209252
616 446209252 448946863 452180088 456013888 460274518 464381367 467852890 470648974 472988039 475144297
634.3 475144297 477211982 479067951 480684906 482079774 483392864 484875560 486426681 487691015
650.6 487691015 488625169 489454478 490364283 491379291 492331952 493164271 494480789 497381568 500089288
669 500089288 500264585 500731885 502211094 503880084 505475521 507061005 508640885 509897053 510448933
687.3E10448933o1810l92080p97927j449704k305806l201485l721386l486752k556742
705.7D92475241j230865J50084J308352K396494L691524N077690O085575O306291O128847
724.1E22389233N969703N662918N306781M940271M284144L337204K301931J472176
740.4E55664361Q32438o3837j437902l035188m395902n078614n091548m865408m685640
758.7E27842760m267275l260672j660884N64933L154695N489946P186055Q357346R245991
777.1E52652895R658635R292424Q232951O830275N445898M481196M128337M260063
793.4F04982674M538655M620731M492998M303158M036307L656209L114402K270758
809.7F36015892J323044O73652M63247M75109L55899k23875j361906k702475l739953
$$ plain form
687.3 510448933 510387123 509995043 509197116 507747412 505441606 502240121 498518735 495031983 492475241
705.7 492475241 491244376 491394460 492702812 495099306 498790830 503868520 509954095 516260386 522389233
724.1 522389233 528358936 534021854 539328635 544268906 548553050 551890254 554192185 555664361
740.4 555664361 556496799 556432962 554995060 551959872 547563970 542485356 537393808 532528400 527842760
758.7 527842760 523575485 520314813 518653929 519218862 522373557 527863503 535049558 543406904 552652895
777.1 552652895 562311530 571603954 579836905 586667180 592113078 596594274 600722611 604982674
793.4 604982674 609521329 614142060 618635058 622938216 626974523 630630732 633745134 636015892
809.7 636015892 637338936 638012588 638475835 638950944 639306843 639082968 637721062 635018587 631278634
828.1F31278634m417539m997551n544126o010413o186068n899072n297899m640222
844.4E88285744m158020m065037m415333m983842n479396n666554m932820k301693
860.7E52283049K182960O894410J0431647J2765944J3956070J3287008J0458946O519854
877F28779888K809346k01404k708256m945577o782770p827878p875383p153451o232619
895.4E87861896n698860n798698o356060o994367p538795q175969r120703j0360181
911.7E27818263j1500478j1818052j0859787q767992o150753l785312k103686r55314
928D71876889K04564J670539L061384L893375M246086M545242M600406L348916N4121
946.4D97501522m682541r421616j3000012j5074491j6051770j6629219j7210483j7787159
$$ plain form
828.1 631278634 626861095 621863544 616319418 610309005 604122937 598223865 592925966 588285744
844.4 588285744 584127724 580062687 575647354 570663512 565184116 559517562 554584742 552283049
860.7 552283049 554466009 561360419 571792066 584558010 598514080 611801088 622260034 628779888
877 628779888 631589234 631387830 628679574 623733997 616951227 609123349 601247966 594094515 587861896
895.4 587861896 582163036 576364338 570008278 563013911 555475116 547299147 538178444 527818263
911.7 527818263 516317785 504499733 493639946 484871954 478721201 474935889 472832203 471876889
928 471876889 472081453 473751992 476813376 480706751 484952837 489498079 494098485 497447401 497501522
946.4 497501522 492818981 483397365 470397353 455322862 439271092 422641873 405431390 387644231
962.7C87644231j8220633j8405765j8320471j8028111j7567068j6839802j5668869
977B64593512j3987988j1790649r186178o550357m243269k410233j034394p004P96005
995.3B16179445J397491J727372J698211J356661Q67963L85061L9131r7096%L10838
1015.7B23865077Q00758J400978K071947K700105L127486L319561L302425L165931
1032B43754268K896920K340123J520902P74890L39091K79247O05792J223266K102316
1050.4B55836815L242910M480242N658984O814123Q050859R305507R790629Q051723
1066.7C11231792L121316l724247q937031r912044p408350l946424j044899J134187
1083B80514300K746433L854334M623890N222887N544424N359113M594058L363639J910031
$$ plain form
962.7 387644231 369423598 351017833 332697362 314669251 297102183 280262381 264593512
977 264593512 250605524 238814875 229628697 223078340 218835071 216424838 215390444 215383440 216179445
995.3 216179445 217576936 219304308 221002519 222359180 223227143 223612204 223651335 223554239 223554239 223865077
1015.7 223865077 224665835 226066813 228138760 230838865 233966351 237285912 240588337 243754268
1032 243754268 246651188 248991311 250512213 251287103 251626194 251905441 252511233 253734499 255836815
1050.4 255836815 259079725 263559967 269218951 276033074 284083933 293389440 303180069 311231792
1066.7 311231792 314353108 310628861 301691830 291779786 284371436 280425012 279380113 280514300
1083 280514300 283260733 287115067 291738957 296961844 302506268 307865381 312459439 315823078 317733109
1101.4C17733109P60913N01782J250416K517134L617644M119962L947109L311754K544283
1119.8C40304106J950562J735449K073646K965510M034877M605591M035175K133548
1136.1C63838464p22766l791451o265790p613003p831991p259339o232828m977971
1152.4C19143325l651321k315819r95755L43352J858145L566414N400420P308483R158551
1170.7C39815795J0794580J2058884J2799532J3104587J3170988J3037741J2649476
1185D27431583J1840731J0442764Q519709O455451M691422L431499K642870K226919
1201.3D77682948K091676K196133K670050L580958M663527N464941N731255N439281
1217.7E09520769M615903L427923K111971Q25465l31402j265764j831293j967311j849532
$$ plain form
1101.4 317733109 318494022 318995804 320246220 322763354 326380998 330500960 334448069 337759823 340304106
1119.8 340304106 342254668 343990117 346063763 349029273 353064150 357669741 361704916 363838464
1136.1 363838464 363115698 359324247 353058457 345445454 337613463 330354124 324121296 319143325
1152.4 319143325 315492004 313176185 312180430 312523782 314381927 317948341 323348761 330657244 339815795
1170.7 339815795 350610375 362669259 375468791 388573378 401744366 414782107 427431583
1185 427431583 439272314 449715078 458234787 464690238 469381660 472813159 475456029 477682948
1201.3 477682948 479774624 481970757 484640807 488221765 492885292 498350233 504081488 509520769
1217.7 509520769 514136672 517564595 519676566 520502031 520170629 518904865 517073572 515106261 513256729
1236E13256729j692772j490057j076817l71993N57780J504898K187789K430201K269864
1254.4E17575622J870811J420438J135051J123965J366198J809537K269268K476752
1270.7E31047642K278507J713276R33111R1612n93007q87036p88450n67138n53430
1289E32675087q77022j437724j973033k233922k236605k157807k179027k389491k561450
1307.4E14629006k317488j709759j176417j036167j255930j592636k029061k790451
1323.7E00721097l890127n036026n841077n978763n367815m221857k811461j373917
1340D66200054l38853Q3596K21610L00526K70933K4796m45306r41456j267135j327842
1360.4D62780923j027108m71830k70367m06712l24815J98721J040012J498640J316666
$$ plain form
1236 513256729 511563957 510073900 508997083 508625090 509182870 510687768 512875557 515305758 517575622
1254.4 517575622 519446433 520866871 522001922 523125887 524492085 526301622 528570890 531047642
1270.7 531047642 533326149 535039425 535972536 536064148 535471141 534584105 533795655 533228517 532675087
1289 532675087 531798065 530360341 528387308 526153386 523916781 521758974 519579947 517190456 514629006
1307.4 514629006 512311518 510601759 509425342 508389175 507133245 505540609 503511548 500721097
1323.7 500721097 496830970 491794944 485953867 479975104 474607289 470385432 467573971 466200054
1340 466200054 465861201 465944797 466166407 466466933 466737866 466762662 466317356 465375900 464108765 462780923
1360.4 462780923 461753815 461281985 461011618 460604906 460280091 460478812 461518824 463017464 464334130
1378.8D64334130J019419J156687K132088L909886M911155L931105K345741R14692
1395.1D84654903j50591o99043q80450j200646j805663k243728k452135k409875k006978
1413.5D70805794j647443j635342j414180o18428J21444P58648J175702J396149J465738
1431.8D70408082J304507J584560K407551K442419K059371J472175O62565p3433n85407
1450.2D81682390r82702j465231k435237k398372n07653O03617J898378L614396M444241
1468.5D84453827N580247Q659571J0474741R677113Q812844Q283317P745922O638885
1484.9E50326467O025075O601751P129610N753457M538239M579067M549563L943324
1501.2E93446553L083467K798796M015267M000902K881825K448261K409458K670288
$$ plain form
1378.8 464334130 465353549 466510236 468642324 472552210 477463365 481394470 483740211 484654903
1395.1 484654903 484504312 483805269 482924819 481724173 479918510 477674782 475222647 472812772 470805794
1413.5 470805794 469158351 467523009 466108829 465490401 465611845 466370493 467546195 468942344 470408082
1431.8 470408082 471712589 473297149 475704700 478147119 480206490 481678665 482341230 482267797 481682390
1450.2 481682390 480699688 479234457 476799220 474400848 473893195 474496812 476395190 480009586 484453827
1468.5 484453827 490034074 498693645 509168386 518845499 527658343 535941660 543687582 550326467
1484.9 550326467 556351542 562953293 570082903 575836360 580374599 584953666 589503229 593446553
1501.2 593446553 596530020 599328816 603344083 607344985 610226810 612675071 615084529 617754817
1517.5F17754817K470672K361179K375721K161146K346515K184987J676321J409054
1533.8F34740412J015067K44022J90496J332462J576662R80556J76966l83138m70698
1552.2F39402807m52578q27670j656950j250803m15743q93354j264096j497149j648188
1570.5F29496276j505553k026618k543509j600563j056254j399339j804769k125382
1586.8F15434289k215862k033651j784146j764596j942813k198100k459943k512992
1603.2E98522186k395451k403796k706885l008544l242076l844380m065335k813637
1619.5E74042082k595902l371536l342092l085435k748370k138317k170503k511382
1635.8E52078545j470327n69463l80218k17795K16305J113951J090348R76503K786100
$$ plain form
1517.5 617754817 620225489 622586668 624962389 627123535 629470050 631655037 633331358 634740412
1533.8 634740412 635755479 635999501 636189997 637522459 639099121 640079677 640256643 639873505 639402807
1552.2 639402807 638950229 638122559 636465609 635214806 634799063 633905709 632641613 631144464 629496276
1570.5 629496276 627990723 625964105 623420596 621820033 620763779 619364440 617559671 615434289
1586.8 615434289 613218427 611184776 609400630 607636034 605693221 603495121 601035178 598522186
1603.2 598522186 596126735 593722939 591016054 588007510 584765434 580921054 576855719 574042082
1619.5 574042082 571446180 568074644 564732552 561647117 558898747 556760430 554589927 552078545
1635.8 552078545 550608218 550038755 549658537 549440742 549657047 550770998 551861346 552837849 555623949
1654.1E55623949L431201K935051L027082L539264L829301L339171L715038N058289
1670.5E84498346M961610M937887N345046M710675M132151M746378P154345O648660
1686.8F27135098M906774M653155L999293L964365M374206M071772M308343L358364
1703.1F60771370K533019K842903K794683K316177J711964J323998K024889K940118
1719.4F79259121K716959K443194K273023J781881J380682J257062K050042K944172
1735.7F96106136K233147J797557J976550K165794K361179K675891L311157L654778
1752G16282189L005743K619684K807259K831161K964556K632261J813113J326383J310646
1770.4G37592995J951814K435863J910031J251876J023769J180828J429021J514733
$$ plain form
1654.1 555623949 559055150 561990201 565017283 568556547 572385848 575725019 579440057 584498346
1670.5 584498346 589459956 594397843 599742889 604453564 608585715 613332093 620486438 627135098
1686.8 627135098 632041872 636695027 640694320 644658685 649032891 653104663 657413006 660771370
1703.1 660771370 663304389 666147292 668941975 671258152 672970116 674294114 676319003 679259121
1719.4 679259121 681976080 684419274 686692297 688474178 689854860 691111922 693161964 696106136
1735.7 696106136 698339283 700136840 702113390 704279184 706640363 709316254 712627411 716282189
1752 716282189 719287932 721907616 724714875 727546036 730510592 733142853 734955966 736282349 737592995
1770.4 737592995 739544809 741980672 743890703 745142579 746166348 747347176 748776197 750290930
1786.7G50290930J147986O46054Q04782J246155J255333J158655J215935J198470R12786
1805.1G59877086P00533P94590J094400J197517R69410P05779O23226O12676O53327
1823.4G67228544Q10802O83486M43697O16133P40946O60002O91354N92649J69754p6771
1843.8G72560596L21866O80208O86705N60045L31104J24276O3598K20537M09603L49581
1864.2G76308119K3246j08242K86520O00576N93722N46098M88579L39925K25067K70129
1884.6G79573739L64184M44770N40078M31597K16722K05815L12865M00364L60191J63019
1905G83013344m3690m7505J64211L03745K23577J06036J01448O4432J42932L61264
1925.4G84389794L77536K43365J17302L7611N7280J43468J28746O9082J40131K07185
$$ plain form
1786.7 750290930 751438916 752084970 752889752 754135907 755391240 756549895 757765830 758964300 759877086
1805.1 759877086 760577619 761372209 762466609 763664126 764633536 765339315 765962541 766575217 767228544
1823.4 767228544 768039346 768722832 769166529 769782662 770523608 771183610 771874964 772467613 772637367 772560596
1843.8 772560596 772882462 773562670 774249375 774809420 775140524 775264800 775328398 775548935 775958538 776308119
1864.2 776308119 776331365 776223123 776509643 777110219 777703941 778250039 778738618 779078543 779303610 779573739
1884.6 779573739 779937923 780382693 780922771 781354368 781571090 781776905 782089770 782490134 782850325 783013344
1905 783013344 782969654 782922149 783086360 783390105 783613682 783719718 783821166 783885598 784028530 784389794
1925.4 784389794 784767330 785010695 785127997 785165608 785222888 785366356 785495102 785564184 785704315 785911500
1945.8G85911500K03789K41875K94686L15249K76684K03610J79529J82271J65105J88351
1966.2G88162649L00049L07262J72735J06096J42991J85371J84894J62720Q0466k8789
1986.6G89776444n7220J0967J55211K33769J04487p2420j11222n9306j8836p1644j89841
2009G89700389k95758l69668l95537l64423l58283m72367o85632p35462l87966q5891
2029.4G85549402j61648l31044m57644n46396n46873m22835k44737j69038k23816k83003
2049.8G82162368k71439j94192p4387K7418N1678M053l5465N96R0718J46032J26838
2072.3G82034218O4493Q344j6630Q95O0916J23858J20223M7266L1650J06156J65999
2094.7G82747388J82927J98423J76847J17481J12236J61051J88530J68085J30177O9558
$$ plain form
1945.8 785911500 786115289 786357164 786651850 786967099 787243783 787447393 787626922 787809193 787974298 788162649
1966.2 788162649 788462698 788769960 788942695 789048791 789191782 789377153 789562047 789724767 789805233 789776444
1986.6 789776444 789719224 789730191 789885402 790119171 790223658 790151238 790040016 789980710 789961874 789890230 789700389
2009 789700389 789404631 789034963 788639426 788275003 787916720 787444353 786758721 786023259 785635293 785549402
2029.4 785549402 785387754 785056710 784599066 784052670 783505797 783082962 782838225 782669187 782445371 782162368
2049.8 782162368 781890929 781696737 781622350 781649768 781701446 781705499 781670034 781670630 781761348 781907380 782034218
2072.3 782034218 782098711 782107055 782090425 782091320 782152236 782276094 782396317 782443583 782475233 782581389 782747388
2094.7 782747388 782930315 783128738 783305585 783423066 783535302 783696353 783884883 784052968 784183145 784252703
2115.1G84252703J5259K5213O4909O7353L5406O914j0193k4795p451M8161O0677L1770
2139.6G84565926p391k8909J3233O8187J06097J41143J45018J01388R8705K00033L18289
2162G85721719L76940L83019L57628L62337M53651N79417O50942O06179M78208L80993
2182.4G90351033M06385N40256O43850O06834M48168K90811K85506M38333N90920N86808
2202.8G95188904M13716K53081K45154L79681N60046O21795M88937K86818J97887K85626
2223.2G98921645M81844N76496M22537J71006N4598J63316L99471N12480L90590J79052
2243.6H02273035N8949J21653L14117M91261M82678K73943P9573Q2790K99752N18680
2264H04996431M96268K71797P9930M7803J49727K90751L14951J59383j3172N7041L74794
$$ plain form
2115.1 784252703 784267962 784293175 784358084 784425437 784460843 784467757 784457564 784432769 784425318 784473479 784534156 784565926
2139.6 784565926 784558535 784529626 784542859 784611046 784717143 784858286 785003304 785104692 785203397 785403430 785721719
2162 785721719 786098659 786481678 786839306 787201643 787655294 788234711 788885653 789491832 789970040 790351033
2182.4 790351033 790757418 791297674 791941524 792548358 792996526 793287337 793572843 794011176 794602096 795188904
2202.8 795188904 795602620 795855701 796100855 796480536 797040582 797662377 798151314 798438132 798636019 798921645
2223.2 798921645 799403489 799979985 800402522 800573528 800628126 800791442 801190913 801703393 802093983 802273035
2243.6 802273035 802331984 802453637 802767754 803259015 803741693 804015636 804095209 804177999 804477751 804996431
2264 804996431 805492699 805764496 805844426 805892229 806041956 806332707 806647658 806807041 806793869 806850910 807225704
2286.4H07225704P09534Q61823P69735N59568M41075N56469Q27252J074136J247585
2304.8H14272881J307129J235307J183986J209438J332283J741111K174914K028764
2321.1H26485813J425206J174033J484275J633644J020014K11895J25706M56989O27458
2339.5H34645033L43561j066923l509462l686547m97639L315925N280793M713833K960384
2357.8H42498958Q46207r55999k088129k943933l776670m368245m611314m429280l976643
2376.2H16194952l584445l265142k838195k255022j591087r33885m10438j55270j64330
2394.5H00997138k99990m24087m51684l59714k49744k51591l74973n36799o02782n06163
2414.9G96939611l96847m12643n20110o65844p58827o98566n48184m80652n58495p20740
$$ plain form
2286.4 807225704 807935238 808797061 809566796 810126364 810567439 811123908 811951160 813025296 814272881
2304.8 814272881 815580010 816815317 817999303 819208741 820541024 822282135 824457049 826485813
2321.1 826485813 827911019 829085052 830569327 832202971 833222985 833434880 833560586 834017575 834645033
2339.5 834645033 834988594 833921671 830412209 826725662 826228023 829543948 834824741 839538574 842498958
2357.8 842498958 843345165 842389166 840301037 837357104 833580434 829212189 824600875 820171595 816194952
2376.2 816194952 812610507 809345365 806507170 804252148 802661061 801727176 801316738 801161468 800997138
2394.5 800997138 800697148 800273061 799821377 799461663 799211919 798960328 798585355 798048556 797445774 796939611
2414.9 796939611 796542764 796130121 795610011 794944167 794185340 793486774 792938590 792457938 791899443 791178703
2435.3G91178703q39114q17060p05898o07133n91815o93798q18550q24094p17580n77808
2455.7G83985853n24282o21021p51913p80761o82056n52058n10693n78463o82592p49588
2476.1G77552426p02739n47826m56035m94004n63442o07014n85139m68314l48687l40759
2496.5G72438467m28498m99845m79936l71755k70903k67565l43978m72606n75602n55396
2516.9G68172383m50432l87669m30226n62966o95407o93977o01053n82278o78122q02994
2537.3G62287259q59737q23498p34031o68884o89506p50959q06212q36671p83741o90401
2557.7G54643619o53148o85691p61450q22067p78139o71446o44743o88255p23780p43031
2578.1G47471869p38919o77287n80132n42999o09755o86288o62387n56826m38333l83436
$$ plain form
2435.3 791178703 790339589 789522529 788816631 788209498 787617683 786923885 786105335 785281241 784563661 783985853
2455.7 783985853 783461571 782840550 782088637 781307876 780625820 780073762 779563069 778984606 778302014 777552426
2476.1 777552426 776849687 776301861 775845826 775351822 774788380 774181366 773596227 773127913 772779226 772438467
2496.5 772438467 772009969 771510124 771030188 770658433 770387530 770119965 769775987 769303381 768727779 768172383
2516.9 768172383 767721951 767334282 766904056 766341090 765645683 764951706 764350653 763768375 763090253 762287259
2537.3 762287259 761427522 760604024 759869993 759201109 758511603 757760644 756954432 756117761 755334020 754643619
2557.7 754643619 753990471 753304780 752543330 751721263 750943124 750271678 749626935 748938680 748214900 747471869
2578.1 747471869 746732950 746055663 745475531 744932532 744322777 743636489 742974102 742417276 741978943 741595507
2598.5G41595507m43817n66899o45936o46174o27816o75737q03948r40680j013816
2616.8G35230684j010179r98736j028835j112998j233280j307189j313508j300871
2633.2G25925088j294315j288354j312435j369655j378417j329422j299143j306772
2649.5G15346575j323819j338065j324534j261294j224935j247466j248360j249194
2665.8G05128908j253366j184523j098693j057923j043677j051843j068831j067042
2682.1F96303010j036823r90569r96471j072287j128018j120746j109124j139700j180887
2700.5F86528385j215875j249493j274347j291692j278997j228690j197278j201690
2716.8F76590323j209259j194596j118183j020849r68337r38237r15944r19223r12487
$$ plain form
2598.5 741595507 741151690 740584791 739938855 739292681 738664865 737989128 737185180 736244500 735230684
2616.8 735230684 734220505 733221769 732192934 731079936 729846656 728539467 727225959 725925088
2633.2 725925088 724630773 723342419 722029984 720660329 719281912 717952490 716653347 715346575
2649.5 715346575 714022756 712684691 711360157 710098863 708873928 707626462 706378102 705128908
2665.8 705128908 703875542 702691019 701592326 700534403 699490726 698438883 697370052 696303010
2682.1 696303010 695266187 694275618 693279147 692206860 691078842 689958096 688848972 687709272 686528385
2700.5 686528385 685312510 684063017 682788670 681496978 680217981 678989291 677792013 676590323
2716.8 676590323 675381064 674186468 673068285 672047436 671079099 670140862 669224918 668305695 667393208
2735.1F67393208q69751q36313q19981q23975q56221q63134q23617p58231p05063o91891
2755.5F59345031o84738o81341o99997p00235o92845p30753p87019q22545q27848q40903
2775.9F51876807r09030r86338j043558j119792j205266j246214j281261j383663j511633
2794.3F41190052j604140j637220j646996j728892j890779k010285k024234k030194
2810.6F26617312k096533k176464k275765k380371k416015k465665k577186k661407
2826.9F07567906k699077k759218k874613k972722l042042l161669l376424l626645
2843.2E83055496l818035l947079l983319l794789l394962l011405k798080k795637
2859.5E55512190l027260l442705l925204m422605m854382n103170n254984n338610
$$ plain form
2735.1 667393208 666523457 665687144 664867163 664043188 663186967 662323833 661500216 660741985 660036922 659345031
2755.5 659345031 658660293 657978952 657278955 656578720 655885875 655155122 654368103 653545558 652717710 651876807
2775.9 651876807 650967777 649981439 648937881 647818089 646612823 645366609 644085348 642701685 641190052
2794.3 641190052 639585912 637948692 636301696 634572804 632682025 630671740 628647506 626617312
2810.6 626617312 624520779 622344315 620068550 617688179 615272164 612806499 610229313 607567906
2826.9 607567906 604868829 602109611 599234998 596262276 593220234 590058565 586682141 583055496
2843.2 583055496 579237461 575290382 571307063 567512274 564117312 561105907 558307827 555512190
2859.5 555512190 552484930 549042225 545117021 540694416 535840034 530736864 525481880 520143270
2875.9E20143270n203425m770101m084706l316462k589941j939684j394004r22531
2892.2D95922416n80996n15848o25402p07120q39919j120179j434058j731813k087772
2910.5D86279309k530664l050328l510296l704518l635258l366321k875239k172410
2926.8D61434275j330018l82364O97672J871705L018201L996789M693896N130142N415529
2945.2D84545827N582750N703985N818069N793214N665183N565644N471527N296409
2961.5E29442608M936934M458904M040659L746867L618717L572106L475786L416180
2977.8E60708761L374934L142596K776086K509892K306521K028108J682877J327813
2994.2E79857588J030683P70271N07534K49564o6518m18604o71267q62956j110495
$$ plain form
2875.9 520143270 514939845 510169744 506085038 502768576 500178635 498238951 496844947 495922416
2892.2 495922416 495341420 494825572 494200170 493493050 492653131 491532952 490098894 488367081 486279309
2910.5 486279309 483748645 480698317 477188021 473483503 469848245 466481924 463606685 461434275
2926.8 461434275 460104257 459721893 460419565 462291270 465309471 469306260 474000156 479130298 484545827
2945.2 484545827 490128577 495832562 501650631 507443845 513109028 518674672 524146199 529442608
2961.5 529442608 534379542 538838446 542879105 546625972 550244689 553816795 557292581 560708761
2977.8 560708761 564083695 567226291 570002377 572512269 574818790 576846898 578529775 579857588
2994.2 579857588 580888271 581658542 582166076 582415640 582349122 581930518 581259251 580396295 579285800
3012.5E79285800j389145j666189j890719k042234k156436k233922k295137k313256
3028.8E63298762k316177k415836k610147k699017k582074k557277k750755k891242
3045.1E42476237k917290k911687k855062k789438k787232k907336l005147k863646
3061.5E19439399k664149k673685k823234k944469k963662k832651k618820k562463
3077.8D97356266k718896k810597k804458k813608k733499k670914k770990k867281
3094.1D75166023k772093k564400k503187k607465k636999k520859k483249k564162
3110.4D54513609k459019k237111k264589k463460k610803k670199k574652k366573
3126.7D34867203k250314k288699k340525k260119k135366k130538k232850k285808
$$ plain form
3012.5 579285800 577896655 576230466 574339747 572297513 570141077 567907155 565612018 563298762
3028.8 563298762 560982585 558566749 555956602 553257585 550675511 548118234 545367479 542476237
3045.1 542476237 539558947 536647260 533792198 531002760 528215528 525308192 522303045 519439399
3061.5 519439399 516775250 514101565 511278331 508333862 505370200 502537549 499918729 497356266
3077.8 497356266 494637370 491826773 489022315 486208707 483475208 480804294 478033304 475166023
3094.1 475166023 472393930 469829530 467326343 464718878 462081879 459561020 457077771 454513609
3110.4 454513609 452054590 449817479 447552890 445089430 442478627 439808428 437233776 434867203
3126.7 434867203 432616889 430328190 427987665 425727546 423592180 421461642 419228792 416942984
3143D16942984k216667k115309j984299j889020j962363k090335k101958k015829j963616
3161.4C98603588j948237j865417j772255j754611j758129j764118j759947j694977
3177.7C84285897j623631j636445j689851j648099j521199j463891j481622j497954
3194C71723205j501709j483143j452714j409411j352668j325607j326472j286089j233846
3212.4C59351546j215518j185447j164347j148254j123189j115144j085520j010119
3228.7C50304008q98690q54700j013100j191885j151949r97037q96632q47101q42363
3247.1C41610551r05156r04382p85976p22766p92146q50409q08269p53254p16954o15358
3267.5C33755881n03242n66125p26819q03680p91668p17372o62089o54965o00487n11408
$$ plain form
3143 416942984 414726317 412611008 410626709 408737689 406775326 404684991 402583033 400567204 398603588
3161.4 398603588 396655351 394789934 393017679 391263068 389504939 387740821 385980874 384285897
3177.7 384285897 382662266 381025821 379335970 377687871 376166672 374702781 373221159 371723205
3194 371723205 370221496 368738353 367285639 365876228 364523560 363197953 361871481 360585392 359351546
3212.4 359351546 358136028 356950581 355786234 354637980 353514791 352399647 351314127 350304008
3228.7 350304008 349405318 348550618 347537518 346345633 345193684 344196647 343300015 342452914 341610551
3247.1 341610551 340705395 339801013 339015037 338292271 337500125 336649716 335841447 335088193 334371239 333755881
3267.5 333755881 333252639 332686514 331959695 331156015 330364347 329646975 328984886 328329921 327729434 327218026
3287.8C27218026m52399m47154n22107o47277p37786o84321n12362l86774m66854p31796
3308.2C21629196r28431r08614p88271p16448o81132o29127n74052n93066p58648q82686
3328.6C14168721q26269p30723o23137n35995n98728p32601q00967q07375p00742n54323
3349C07257861o46472q89331r47148p77393o10233o34908o83219n45740m35889n87791
3369.4C00499737q70853r22412o88315n41657n70774n99950n48661m11332k08318o4999
3389.8B95072466k01911m91768m75734j00374P0303l09676o88642m96656j36524m5776
3410.2B92195708j24783k87205l64542k36869j02460l6418O2584J87636K36630J74314
3430.6B91704595K46346L84897K01345j22369j49220R1702L30567M34697M10259L70711
$$ plain form
3287.8 327218026 326765627 326318473 325796366 325149089 324411303 323726982 323214620 322827846 322360992 321629196
3308.2 321629196 320700765 319792151 319003880 318287432 317606300 316977173 316403121 315810055 315051407 314168721
3328.6 314168721 313342452 312611729 311988592 311452597 310853869 310121268 309320301 308512926 307812184 307257861
3349 307257861 306611389 305722058 304774910 303997517 303387284 302752376 302069157 301523417 301087528 300499737
3369.4 300499737 299628884 298706472 298018157 297476500 296905726 296305776 295757115 295345783 295137465 295072466
3389.8 295072466 294870555 294378787 293903053 293802679 293872982 293563306 292874664 292378008 292241484 292195708
3410.2 292195708 292070925 291783720 291419178 291182309 291079849 291043431 291106015 291293651 291530281 291704595
3430.6 291704595 291950941 292335838 292537183 292414814 292265594 292357296 292687863 293122560 293532819 293903530
3451B93903530L68088M25547N66036O66499N52297N00589P85947R55194O46443K33918
3471.4B99604088K20537N30690Q44717Q58397N91874N61773P80881P53343O14315P13796
3491.8C06074411Q91387R76265R00298Q13752Q01862O80089N76615O85632R21369J108914
3512.2C14430594J005859P62403P49141R43929J155138J053929P60972P71940R96351
3530.6C22630256J140327J212060J146853J021534J131505J306415J283765J122474
3546.9C31995189J121968J249522J344025J453460J565486J685798J709133J465232
3563.2C43589813J321792J936585K564549K374143K155870K287090K435535K578765
3579.5C61244142K754539K705396K485543K598494L024102L009676K933085L181100
$$ plain form
3451 293903530 294271618 294697165 295263201 295929700 296481997 296982586 297768533 298723727 299370170 299604088
3471.4 299604088 299824625 300355315 301200032 302058429 302650303 303212076 303992957 304746300 305360615 306074411
3491.8 306074411 306965798 307942063 308842361 309656113 310457975 311138064 311714679 312400311 313321680 314430594
3512.2 314430594 315436453 316198856 316947997 317891926 319047064 320100993 320861965 321633905 322630256
3530.6 322630256 323770583 324982643 326129496 327151030 328282535 329588950 330872715 331995189
3546.9 331995189 333117157 334366679 335710704 337164164 338729650 340415448 342124581 343589813
3563.2 343589813 344911605 346848190 349412739 351786882 353942752 356229842 358665377 361244142
3579.5 361244142 363998681 366704077 369189620 371788114 374812216 377821892 380754977 383936077
3595.8C83936077L374577L355145L329307L189504K953858L094881L393144L484338
3612.1D10110831L597170L569335L727257M297257M156172L465146K965271L367097
3628.5D39255536M379421M246384L890723L749430L621787L599644L521561L149987
3644.8D69414473K863288L688752M848689M311830L619343L970057M181861L700793
3661.1E00599086L293872L059268K670765K659679L276348L052532K863944L545999
3677.4E25021493L629506L325880K990603K589941K362967K478897K786517K826631
3693.7E48012435K585352K213120J875639J964569K271057K021730J372337R78708
3710E63294947J486898K294838K254069J880288J670361J604616J588166J642048J584769
$$ plain form
3595.8 383936077 387310654 390665799 393995106 397184610 400138468 403233349 406626493 410110831
3612.1 410110831 413708001 417277336 421004593 425301850 429458022 432923168 435888439 439255536
3628.5 439255536 443634957 447881341 451772064 455521494 459143281 462742925 466264486 469414473
3644.8 469414473 472277761 475966513 480815202 485127032 488746375 492716432 496898293 500599086
3661.1 500599086 503892958 506952226 509622991 512282670 515559018 518611550 521475494 525021493
3677.4 525021493 528650999 531976879 534967482 537557423 539920390 542399287 545185804 548012435
3693.7 548012435 550597787 552810907 554686546 556651115 558922172 560943902 562316239 563294947
3710 563294947 564781845 567076683 569330752 571211040 572881401 574486017 576074183 577716231 579301000
3728.4E79301000J147270P61092R63091J587928J735389J142502L22699L28899J075685
3746.7E88365555Q71301R39607J934886J966953J344264J181185J425743J308143J018823
3765.1F00356460R69350J017153J215637J320302J102090Q56102Q27968R62615R47893
3783.5F09575570R69946J058579J011729R03070O71684M76063N08129L68953N27263
3801.8F16070986J147091J096785J085699J218438Q54492L00884K41578N72980M53829
3820.2F23042762Q52645J318991R88901O58989M91857M79519N18382L14772L26693
3838.5F28993511P79927J082063J174807R72152M05848m48167q29161P65682J748025
3856.9F34644687J177311N00798J46032M02093N24878K42531M96030Q28386Q79347
$$ plain form
3728.4 579301000 580448270 581209362 582172453 583760381 585495770 586638272 586960971 587289870 588365555
3746.7 588365555 589236856 590176463 592111349 594078302 595422566 596603751 598029494 599337637 600356460
3765.1 600356460 601325810 602342963 603558600 604878902 605980992 606837094 607665062 608627677 609575570
3783.5 609575570 610545516 611604095 612615824 613518894 614190578 614666641 615174770 615543723 616070986
3801.8 616070986 617218077 618314862 619400561 620618999 621473491 621774375 622015953 622588933 623042762
3820.2 623042762 623895407 625214398 626203299 626862288 627354145 627833664 628352046 628666818 628993511
3838.5 628993511 629773438 630855501 632030308 633002460 633408308 632960141 632130980 632896662 634644687
3856.9 634644687 635821998 636322796 636468828 636870921 637395799 637638330 638134360 638962746 639842093
3875.2F39842093O86467K64108L81172N99026N27919N82337L24011K00391O13391N95748
3895.6F44616663J10090r4890J22964M93884R06348R18806N79357L07262J24574L9220
3916F48124278K17080L86297K64466K10881L32058K47896J04665K89739N00261M03405
3936.4F51081026K29418J23620J72436L28064K97666K23279K95460L21686L05355L19004
3956.8F53697014K72930J93059K15948K67148K23517J67966J62959K01523K70307K79129
3977.2F55951500J68741J26600K03550K09212J61111J47224J62065J88470K15471K47061
3997.6F57781005
$$ plain form
3875.2 639842093 640528560 640792668 641173840 641772866 642300785 642883122 643207133 643407524 644020915 644616663
3895.6 644616663 644726753 644631863 644754827 645248711 646155059 647073865 647653222 647960484 648085058 648124278
3916 648124278 648341358 648727655 648992121 649203002 649535060 649782956 649887621 650177360 650677621 651081026
3936.4 651081026 651310444 651434064 651606500 651934564 652232230 652455509 652750969 653072655 653378010 653697014
3956.8 653697014 653969944 654163003 654378951 654646099 654869616 655037582 655200541 655402064 655672371 655951500
3977.2 655951500 656120241 656246841 656450391 656659603 656820714 656967938 657130003 657318473 657533944 657781005
3997.6 657781005
##END=$$ End of the data block
