##TITLE=$$ Begin of the data block
##JCAMP-DX=5.00 $$ ACD/SpecManager v 10.08
##SPECTROMETER/DATA SYSTEM=Alpha
##DATE=23 Dec 2014 09:14:34
##DATA TYPE=INFRARED SPECTRUM
##DATA CLASS=XYDATA
##ORIGIN=
##OWNER=
##NPOINTS=1765
##FIRSTX=399.76428223
##LASTX=3997.64306641
##MAXX=3997.64306641
##MINX=399.76428223
##MAXY=0.84483755
##MINY=0.21556647
##XFACTOR=1.0000000000
##YFACTOR=1.000000000000000e-9
##FIRSTY=0.49322686
##DELTAX=2.03961372
##XUNITS=1/CM
##YUNITS=ARBITRARY UNITS
##XYDATA=(X++(Y..Y))
399.8D93226856l330499l647298l218799j398564J285374L218353K885103Q72851j071483
418.1D88821894j174510m90516j275182k465904l086119l398240l374040k635658j062989
436.5D69858736P17550K083868L617853N136371N548089M727692K955228Q91417o36458
454.8D94900346j160681p64490p63803j989156l470093m303187m091859l283501k637118
473.2D72436458k307594k301902k110630j234233L8355P19190K53409p02143j319319
491.5D63471591j293569j104325j353711j954317k629131l060759l008097k861977
507.9D46205705l008633l449113m037588m664511m783660l937394k785623j949429
524.2D17589754j334250o18637J99318J203746K576291M117370N431056O068379N568444
$$ y = [493226856, 489896357, 486249059, 483030260, 481631696, 482917070, 486135423, 489020526, 489893377, 488821894, 487647384, 487156868, 485881686, 483415782, 480329663, 476931423, 473557383, 470921725, 469858736, 470576286, 472660154, 476278007, 481414378, 486962467, 491690159, 494645387, 495536804, 494900346, 493739665, 492975175, 492211372, 490222216, 486752123, 482448936, 478357077, 475073576, 472436458, 470128864, 467826962, 465716332, 464482099, 464520454, 465239644, 465493053, 464790910, 463471591, 462178022, 461073697, 459719986, 457765669, 455136538, 452075779, 449067682, 446205705, 443197072, 439747959, 435710371, 431045860, 426262200, 422324806, 419539183, 417589754, 416255504, 415636867, 415836185, 417039931, 419616222, 423733592, 429164648, 435233027, 440801471]
542.5D40801471L896535J894772L56197p89046j726359k438009k988905l695249m628837
560.9D30682570n553395o325543o802320o610126n347430l211767o17921K064675M258364
579.3D02537107N974442P342398P731229O865532N299389L520399J821876P48366K13236
597.6D42053974j21296k80708l99649l51161N5790P32213J366675J831711K302557
616D47190106K761424L234535L785074M145145M042685L508419K880096K493054K327472
634.3D76368010K142370J763224J416862J299024J293540J397252J496703J270502
650.6D88447487R73255R67443J066208J097917R55671P37727J219958K907425K718389
669E01091480J04547M94063J633882J756430J536131J547515J595378J269341O06536
$$ y = [440801471, 444698006, 446592778, 446948975, 446159929, 444433570, 441995561, 439006656, 435311407, 430682570, 425129175, 418803632, 412001312, 405391186, 400043756, 396831989, 396214068, 398278743, 402537107, 408511549, 415853947, 423585176, 430450708, 435750097, 439270496, 441092372, 441840738, 442053974, 441932678, 441651970, 441252321, 440901160, 440956950, 441689163, 443055838, 444887549, 447190106, 449951530, 453186065, 456971139, 461116284, 465158969, 468667388, 471547484, 474040538, 476368010, 478510380, 480273604, 481690466, 482989490, 484283030, 485680282, 487176985, 488447487, 489420742, 490388185, 491454393, 492552310, 493507981, 494245708, 495465666, 498373091, 501091480, 501196027, 501690090, 503323972, 505080402, 506616533, 508164048, 509759426, 511028767, 511635303]
687.3E11635303l0338m47095q70585j455069k264619l195524l758848l564745k610475
705.7D93438005j239746J04695J277983K436579L766149N156726O104171O225049O010950
724.1E23280561N921364N768299N508423N060374M289389L328145K300679J432002
740.4E56889236P32541j84715j499355l001928m348814n068660n084872m841745m646421
758.7E28945267m296481l357530j648068O93082L232658N455792P090807Q297682R248853
777.1E53662062R674489R353697Q349717O868303N384445M457355M167258M288495
793.4F06205821M538894M621207M496277M291653M011691L617466L072083K234458
809.7F37089550J313627P89345O57558N46873K94983l48568j471460k701819l740072
$$ y = [511635303, 511604965, 511157870, 510287285, 508832216, 506567597, 503372073, 499613225, 496048480, 493438005, 492198259, 492302954, 493580937, 496017516, 499783665, 504940391, 511044562, 517269611, 523280561, 529201925, 534970224, 540478647, 545539021, 549828410, 553156555, 555457234, 556889236, 557621777, 557437062, 555937707, 552935779, 548586965, 543518305, 538433433, 533591688, 528945267, 524648786, 521291256, 519643188, 520336270, 523568928, 529024720, 536115527, 544413209, 553662062, 563336551, 572690248, 581039965, 587908268, 593292713, 597750068, 601917326, 606205821, 610744715, 615365922, 619862199, 624153852, 628165543, 631783009, 634855092, 637089550, 638403177, 639192522, 639850080, 640396953, 640691936, 640343368, 638871908, 636170089, 632430017]
828.1F32430017m495561n049467n583108o111622o289243n973101n368829m679858
844.4E88879228m164875m045367m343987m903853n458295n676806m951179k335966
860.7E52998900K199829O993711J0515094J2771785J3916195J3184547J0320783O443739
877F29344583K802074j97411k751708n016685o807923p830024p910371p205307o262124
895.4E88165104n711972n808235o353020p003188p561446q171498r080708j0314703
911.7E28160334j1469543j1781633j0830730q792311o203831l807634k078652q88050
928D72307950K75731J675934L000230L826469M226476M565686M607737L346145O5267
946.4D97897625m691780r496092j3084919j5096932j6054362j6632736j7204702j7811179
$$ y = [632430017, 627934456, 622884989, 617301881, 611190259, 604901016, 598927915, 593559086, 588879228, 584714353, 580668986, 576324999, 571421146, 565962851, 560286045, 555334866, 552998900, 555198729, 562192440, 572707534, 585479319, 599395514, 612580061, 622900844, 629344583, 632146657, 631949246, 629197538, 624180853, 617372930, 609542906, 601632535, 594427228, 588165104, 582453132, 576644897, 570291877, 563288689, 555727243, 547555745, 538475037, 528160334, 516690791, 504909158, 494078428, 485286117, 479082286, 475274652, 473196000, 472307950, 472583681, 474259615, 477259845, 481086314, 485312790, 489878476, 494486213, 497832358, 497897625, 493205845, 483709753, 470624834, 455527902, 439473540, 422840804, 405636102, 387824923]
962.7C87824923j8247873j8391996j8323392j8082589j7610639j6843200j5673786
977B64651448j3983369j1719853r089395o502226m266814k476632j046688N8413Q59990
995.3B16484874J404882J666501J629949J358852R04500M06683O3866q7917j1623L07724
1015.7B24128291Q17761J437172K081439K682313L136158L344894L310308L151118
1032B44089454K865434K297700J482993P57098L61323L46274O65456J240283K090752
1050.4B56196767L223807M476636N666644O810844Q024603R243667R718984Q042813
1066.7C11404765L192603l652960q911341r894908p397800l963858j062662J132310
1083B80846149K721011L828556M665851N275607N541474N347073M610658L402442J950502
$$ y = [387824923, 369577050, 351185054, 332861662, 314779073, 297168434, 280325234, 264651448, 250668079, 238948226, 229858831, 223356605, 219089791, 216613159, 215566471, 215624884, 216484874, 217889756, 219556257, 221186206, 222545058, 223449558, 223856241, 223920107, 223832190, 223820567, 224128291, 224946052, 226383224, 228464663, 231146976, 234283134, 237628028, 240938336, 244089454, 246954888, 249252588, 250735581, 251492679, 251854002, 252200276, 252865732, 254106015, 256196767, 259420574, 263897210, 269563854, 276374698, 284399301, 293642968, 303361952, 311404765, 314597368, 310944408, 302033067, 292138159, 284740359, 280776501, 279713839, 280846149, 283567160, 287395716, 292061567, 297337174, 302878648, 308225721, 312836379, 316238821, 318189323]
1101.4C18189323P83622N10365J248151K500176L587097M088134L928155L315776K576828
1119.8C40727627J977563J728803K037376K931774M042804M614145M015952K133012
1136.1C64209056o82950l741771o223858p565855p812262p276058o243885m982471
1152.4C19679946l663063k338112j001090L72977J874536L558129N387097P263542
1168.7C31133962R092897J0748952J2050003J2829364J3125956J3173788J3072670
1183D15227592J2701631J1854738J0406076Q474231O445974M703522L456593K696693
1199.3D75967050K271890K094358K188564K676934L575891M638284N446613N709291
1215.6E04568875N394995M577458L431559K162158Q73566l26336j276552j835585j968622
$$ y = [318189323, 318972945, 319483310, 320731461, 323231637, 326818734, 330906868, 334835023, 338150799, 340727627, 342705190, 344433993, 346471369, 349403143, 353445947, 358060092, 362076044, 364209056, 363526106, 359784335, 353560477, 345994622, 338182360, 330906302, 324662417, 319679946, 316016883, 313678771, 312677681, 313050658, 314925194, 318483323, 323870420, 331133962, 340226859, 350975811, 363025814, 375855178, 388981134, 402154922, 415227592, 427929223, 439783961, 450190037, 458664268, 465110242, 469813764, 473270357, 475967050, 478238940, 480333298, 482521862, 485198796, 488774687, 493412971, 498859584, 504568875, 509963870, 514541328, 517972887, 520135045, 521008611, 520682275, 519405723, 517570138, 515601516]
1234E15601516j840532j658320j443387j063764l86297N45025J488089K180755K446532
1252.3E15869617K288640J875460J421690J155794J162767J386464J807570K272666
1268.6E29240668K481639K276123J720547R45509O6876o28709q56758p39932n86688
1287E33919275n98550q75235j396596j949906k249003k245724k144933k163589k357006
1305.4E17938733k531230k335728j729548j152694j010656j273036j636624k056838
1321.7E04212379k802372l896564n029887n825251n963534n365282m240633k832382
1338D68256474j363487l21000P2807K10970L17336K83658K0981m44263r34959j268208
1358.4D64830309j350671j047373m69058k89739m42952l27616J96546R99421J489341
$$ y = [515601516, 513760984, 512102664, 510659277, 509595513, 509209216, 509754241, 511242330, 513423085, 515869617, 518158257, 520033717, 521455407, 522611201, 523773968, 525160432, 526968002, 529240668, 531722307, 533998430, 535718977, 536664486, 536731362, 536102653, 535245895, 534505963, 533919275, 533320725, 532445490, 531048894, 529098988, 526849985, 524604261, 522459328, 520295739, 517938733, 515407503, 513071775, 511342227, 510189533, 509178877, 507905841, 506269217, 504212379, 501410007, 497513443, 492483556, 486658305, 480694771, 475329489, 471088856, 468256474, 466892987, 466571987, 466644794, 466855764, 467173100, 467456758, 467477739, 467033476, 466098517, 464830309, 463479638, 462432265, 461963207, 461673468, 461230516, 460902900, 461099446, 462098867, 463588208]
1376.7D63588208J359165J049012J161188K142876L896117M839242L895253K395838
1393.1D84326899R59128j72168p26133q87603j207858j815737k233713k412856k397239
1411.4D73432720k040059j642108j561582j365930o54816N3793P06702J175195J438767
1429.8D69542682J504153J334250J607210K360761K385288K086967J529694O59674
1446.1D83010679j13248o01650r99868j470595k384842k405226n74022N87314J929879
1464.5D76978421L651440M467637N619555Q692295J0433584R609163Q781731Q292079
1480.8E36525905P763028O661713O072164O647527P126749N735993M567742M636527
1497.1E85737348M556775L929555L112078K894044M125535L999412K838552K418995
$$ y = [463588208, 464947373, 465996385, 467157573, 469300449, 473196566, 478035808, 481931061, 484326899, 485286027, 485113859, 484387726, 483500123, 482292265, 480476528, 478242815, 475829959, 473432720, 471392661, 469750553, 468188971, 466823041, 466168225, 466222018, 466928720, 468103915, 469542682, 471046835, 472381085, 473988295, 476349056, 478734344, 480821311, 482351005, 483010679, 482897431, 482295781, 481295913, 479825318, 477440476, 475035250, 474461228, 475048542, 476978421, 480629861, 485097498, 490717053, 499409348, 509842932, 519452095, 528233826, 536525905, 544288933, 550950646, 557022810, 563670337, 570797086, 576533079, 581100821, 585737348, 590294123, 594223678, 597335756, 600229800, 604355335, 608354747, 611193299, 613612294]
1513.4F13612294K405286K715528K579331K458573K339482K076328K308786K172708
1529.7F32668316J698137J465201J039743K72513K78830J381338J561880R52244J53005
1548.1F41471207l76940m49657m51028q05259j581133j300633n28931r65953j304746
1566.4F33706927j477658j590610j469731k026201k586841j648188j069665j374781
1582.8F20463252j755595k097368k235353k082825j817346j745164j910329k202570
1599.1F04616702k478779k505839k367913k379716k701819l024280l233433l783941
1615.4E82140982l999293k785921k574861l350913l336192l094315k768040k128541
1631.7E58102906k110005k457797j496911o05941l67701j68502K51591J116574J138508
$$ y = [613612294, 616017580, 618733108, 621312439, 623771012, 626110494, 628186822, 630495608, 632668316, 634366453, 635831654, 636871397, 637143910, 637422740, 638804078, 640365958, 641318202, 641471207, 641094267, 640644610, 640193582, 639388323, 637807190, 636506557, 635977626, 635011673, 633706927, 632229269, 630638659, 629168928, 627142727, 624555886, 622907698, 621838033, 620463252, 618707657, 616610289, 614374936, 612292111, 610474765, 608729601, 606819272, 604616702, 602137923, 599632084, 597264171, 594884455, 592182636, 589158356, 585924923, 582140982, 578141689, 575355768, 572780907, 569429994, 566093802, 562999487, 560231447, 558102906, 555992901, 553535104, 552038193, 551432252, 551064551, 550896049, 551147640, 552264214, 553402722]
1650.1E53402722J096308K810300L338336K900243L044904L573060L868877L383220
1666.4E77417970L747999N055190M959762M955947N338728M673660M094720M731715
1682.7F14975691P174611O681740M925311M653275L997743L955543M337728M050672
1699F54752314M306972L331006K519667K865553K813101K335965J739085J309216J965761
1717.4F77938640K920568K746284K469480K263606J771390J399219J286924K062082
1733.7F94858193K921284K225995J829207J986205K132893K357960K708494L335953
1750G14356184L658891K992987K603352K777517K814293K993047K653897J821757J347005
1768.4G38018930J321018J965701K466023J936794J268506J016974J173377J443446
$$ y = [553402722, 554499030, 557309330, 560647666, 563547909, 566592813, 570165873, 574034750, 577417970, 581165969, 586221159, 591180921, 596136868, 601475596, 606149256, 610243976, 614975691, 622150302, 628832042, 633757353, 638410628, 642408371, 646363914, 650701642, 654752314, 659059286, 662390292, 664909959, 667775512, 670588613, 672924578, 674663663, 675972879, 677938640, 680859208, 683605492, 686074972, 688338578, 690109968, 691509187, 692796111, 694858193, 697779477, 700005472, 701834679, 703820884, 705953777, 708311737, 711020231, 714356184, 718015075, 721008062, 723611414, 726388931, 729203224, 732196271, 734850168, 736671925, 738018930, 739339948, 741305649, 743771672, 745708466, 746976972, 747993946, 749167323, 750610769]
1784.7G50610769J536369J166940O46472P77304J227319J267374J190781J230240J183689
1803G60837257R06765P07150Q09610J128196J223565R71675P05480O23226N91159O17683
1823.4G69121766P97331O99044M69088O26087P31469O61194P07030O00934J85967m7624
1843.8G74552286L09586O39439O62088N48423L50356J76251J05917K31266M01080L60965
1864.2G78337657N5314j08183K46167N61774N82337N66900N01454L22700K12669K72334
1884.6G81551123L74078M69625N74649M51386K19822K34008L54945L88444L08096J35362
1905G85061538n0306n9128J67370L33965K48790R5069P4327N9664J50860L74734M03881
1927.5G86860764K62141J22965M9591O7770J40786J35541P9632J32799K04742K16246
$$ y = [750610769, 752147138, 753314078, 753960550, 754737854, 755965173, 757232547, 758423328, 759653568, 760837257, 761744022, 762451172, 763260782, 764388978, 765612543, 766584218, 767289698, 767912924, 768504083, 769121766, 769919097, 770618141, 771087229, 771713316, 772444785, 773105979, 773813009, 774413943, 774599910, 774552286, 774861872, 775501311, 776163399, 776711822, 777062178, 777238429, 777344346, 777575612, 777976692, 778337657, 778392971, 778284788, 778530955, 779092729, 779675066, 780241966, 780743420, 781066120, 781278789, 781551123, 781925201, 782394826, 782969475, 783420861, 783640683, 783874691, 784229636, 784618080, 784926176, 785061538, 785011232, 784952104, 785119474, 785453439, 785702229, 785797298, 785871625, 785931289, 786082149, 786456883, 786860764, 787122905, 787245870, 787295461, 787363231, 787504017, 787639558, 787719190, 787851989, 788056731, 788272977]
1947.9G88272977K63512L15487L06666K56896K07305J96278K12670K09689K07066K60652
1968.3G90709198K43544J36197J18375J88946K14458J71602J45196R1315j6809o0200
1988.7G91941822J6808J66476K31385J13726l4154o3240j8418J0729m4108j84357l28123
2011.1G91808546m17054m27783l65793l45409m53890o83069p62701m14312p7069j09851
2031.5G87751615k73347m20272n30601n56230m60387l00943k14577k34664k79307k71678
2051.9G84209609j79529l0399R9063J10090Q941o0678j5199Q2255J33276J21533N0605
2074.3G84529567j5915q464L8863R2864J35779J07110J5139K2471J35601J97708K01345
2096.8G85452068J87218J40786J28448J54197J50741J80721K16365J62661O3479J0490
$$ y = [788272977, 788536489, 788851976, 789158642, 789415538, 789622843, 789819121, 790031791, 790241480, 790448546, 790709198, 790952742, 791088939, 791207314, 791396260, 791610718, 791782320, 791927516, 792018831, 792002022, 791941822, 791958630, 792125106, 792356491, 792470217, 792436063, 792372823, 792354405, 792365134, 792321026, 792136669, 791808546, 791391492, 790963709, 790597916, 790252507, 789798617, 789115548, 788352847, 787938535, 787861466, 787751615, 787478268, 787057996, 786527395, 785971165, 785510778, 785209835, 784995258, 784760594, 784481287, 784209609, 784030080, 783999681, 784098744, 784208834, 784217775, 784157097, 784141898, 784224153, 784357429, 784478962, 784529567, 784513652, 784505188, 784544051, 784636915, 784772694, 784879804, 784894943, 784917414, 785053015, 785250723, 785452068, 785639286, 785780072, 785908520, 786062717, 786213458, 786394179, 786610544, 786773205, 786836684, 786847174]
2117.1G86847174K3902N5790O3777N2571K4855j3173l4630j5855N4181J04248P5102
2139.6G87237942l159m9949j7166M5896J12772J68860J47760P7724Q9944K29835L80874
2162G88421333M08947L49462L04461L35991M58896N97001O58214N97536M74274L95954
2182.4G93002069M32968N70178O59526N90562M19856K78890K82347M30345N86152O13213
2202.8G97866106M64320K74658K45095M01377N82517O20603M86493K79963J94013L10243
2223.2H01725388M87506N41151M02748J84894P9393J86145L92020M97520M21107K04146
2243.6H05122018K7716R4533L39150N27561M99368K72930O3598N1617K60592N24521
2264H07783604N41448K92480Q0228N3704J67668L21626L32594J38700l0636Q9466M06325
$$ y = [786847174, 786871076, 786926866, 786990643, 787043214, 787068069, 787054896, 787020266, 787004411, 787058592, 787162840, 787237942, 787234783, 787184834, 787167668, 787213564, 787326336, 787495196, 787642956, 787720680, 787810624, 788040459, 788421333, 788830280, 789179742, 789484203, 789820194, 790279090, 790876091, 791534305, 792131841, 792606115, 793002069, 793435037, 794005215, 794664741, 795255303, 795675159, 795954049, 796236396, 796666741, 797252893, 797866106, 798330426, 798605084, 798850179, 799251556, 799834073, 800454676, 800941169, 801221132, 801415145, 801725388, 802212894, 802754045, 803156793, 803341687, 803421080, 803607225, 803999245, 804496765, 804917872, 805122018, 805149734, 805244267, 805583417, 806110978, 806610346, 806883276, 806946874, 806998491, 807259083, 807783604, 808325052, 808617532, 808697760, 808751464, 808919132, 809240758, 809573352, 809712052, 809681416, 809770882, 810177207]
2286.4H10177207O79493Q02696P18951N35548M56750N77211Q38161J074970J229286
2304.8H17090273J276016J186133J098990J100183J271665J730382K131879J953423
2321.1H28838944J350642J111626J438916J573205R51231J42812L2246M19856O83724
2339.5H36543202L76285j053334l368139l526628n19097L129423N088925M609168K856016
2357.8H44135821P01725j016438j981496k783180l601253m156291m420042m286409
2374.1H22592437l856957l423273l089965k733767k200901j544059r04440l91424j46449
2392.5H04301202j86383l30508m27187m23252l25203k27690k56419m00543n35965n89967
2412.9H00598085n22137l97146l74436m99844o65129p41303p01844n97358n24938n73337
$$ y = [810177207, 810856700, 811659396, 812378347, 812913895, 813370645, 813947856, 814786017, 815860987, 817090273, 818366289, 819552422, 820651412, 821751595, 823023260, 824753642, 826885521, 828838944, 830189586, 831301212, 832740128, 834313333, 835264564, 835407376, 835439622, 835859478, 836543202, 836919487, 835866153, 832498014, 828971386, 828452289, 831581712, 836670637, 841279805, 844135821, 844837546, 843821108, 841839612, 839056432, 835455179, 831298888, 826878846, 822592437, 818735480, 815312207, 812222242, 809488475, 807287574, 805743515, 804839075, 804447651, 804301202, 804114819, 803784311, 803357124, 802933872, 802608669, 802380979, 802124560, 801724017, 801188052, 800598085, 800075948, 799678802, 799304366, 798804522, 798139393, 797398090, 796696246, 796098888, 795573950, 795000613]
2433.3G95000613p09057q03948p95066p17521o24776n87403o86527q22007q17538p11143
2453.7G87725627n95808n46336o30736p64728p96973o89447n42760m80652n40674o71744
2474.1G81465769p58171p08282n65648m58479m79579n82993o32048n74589m42981l16620
2494.5G75946379l13759m22716m89176m78625m28080l30449k58088l08990m56631n62668
2514.9G71897197n32508m31538l99172m61996n74112o69419o68764n87106n50151o54578
2535.3G66367853q27372r14216q70526p60675o46949o24418p31170q46386q51989p59959
2555.6G58534193o83129o71804p03335p65979q19325p72894o44803n92172o73354p82787
2576G51424611q04484p41244o53922n83351n69761o32226o92308o47247n24700m12821
$$ y = [795000613, 794291556, 793487608, 792692542, 791975021, 791350245, 790762842, 790076315, 789254308, 788436770, 787725627, 787129819, 786583483, 785952747, 785188019, 784391046, 783701599, 783158839, 782678187, 782137513, 781465769, 780707598, 779999316, 779433668, 778975189, 778495610, 777912617, 777280569, 776705980, 776262999, 775946379, 775632620, 775209904, 774720728, 774242103, 773814023, 773483574, 773225486, 772916496, 772459865, 771897197, 771364689, 770933151, 770533979, 770071983, 769497871, 768828452, 768159688, 767572582, 767022431, 766367853, 765540481, 764626265, 763755739, 762995064, 762348115, 761723697, 760992527, 760146141, 759294152, 758534193, 757851064, 757179260, 756475925, 755709946, 754890621, 754117727, 753472924, 752880752, 752207398, 751424611, 750620127, 749878883, 749224961, 748641610, 748071849, 747439623, 746747315, 746100068, 745575368, 745162547]
2596.4G45162547l97206m73559n47886o08205o51181o65963p11798q07226r13382r93192
2616.8G38392949j016796j005172j027584j103521j189887j286686j343250j306176
2633.2G29113877j290500j332999j364529j370191j343727j306057j289726j305401
2649.5G18510747j344502j362324j336157j275003j221716j226306j231313j227498
2665.8G08285928j250744j209736j118958j074314j063705j058399j056195j053810
2682.1F99400067j051843j043200j035452j054406j085222j108170j127660j140356
2698.4F90753758j173854j220882j242637j271964j311540j319409j268863j184166
2714.7F80760443j152634j178265j174450j114786j046717r83238r26971r21488r45091
$$ y = [745162547, 744765341, 744291782, 743743896, 743135691, 742484510, 741818547, 741106749, 740299523, 739386141, 738392949, 737376153, 736370981, 735343397, 734239876, 733049989, 731763303, 730420053, 729113877, 727823377, 726490378, 725125849, 723755658, 722411931, 721105874, 719816148, 718510747, 717166245, 715803921, 714467764, 713192761, 711971045, 710744739, 709513426, 708285928, 707035184, 705825448, 704706490, 703632176, 702568471, 701510072, 700453877, 699400067, 698348224, 697305024, 696269572, 695215166, 694129944, 693021774, 691894114, 690753758, 689579904, 688359022, 687116385, 685844421, 684532881, 683213472, 681944609, 680760443, 679607809, 678429544, 677255094, 676140308, 675093591, 674110353, 673183382, 672261894, 671316803]
2733.1F71316803r18687q66115q48293q37624q27074q47519q72493q57651p82251o92487
2753.5F62966609o76632p02202p00295o83785o55472o55830p21931p74563q00848q51750
2773.9F55743301r04858r41694r75847j030267j112699j206815j265526j313150j404345
2792.2F45588100j517475j629889j681447j665771j694381j818180j947761j993358
2808.6F31639838k037108k148807k248823k322555k413809k462447k479374k534628
2824.9F12992287k613485k705872k818406k921283k991736l078818l221035l419698
2841.2E89221954l653884l851473l977418l990531l792703l413916l035485k808094
2857.5E60698450k812386l065348l498017m009366m509211m882276n093455n252421
$$ y = [671316803, 670398116, 669532001, 668683708, 667846084, 667019010, 666171491, 665298998, 664441347, 663659096, 662966609, 662289977, 661587775, 660887480, 660203695, 659548223, 658892393, 658170462, 657395899, 656595051, 655743301, 654838443, 653896749, 652920902, 651890635, 650777936, 649571121, 648305595, 646992445, 645588100, 644070625, 642440736, 640759289, 639093518, 637399137, 635580957, 633633196, 631639838, 629602730, 627453923, 625205100, 622882545, 620468736, 618006289, 615526915, 612992287, 610378802, 607672930, 604854524, 601933241, 598941505, 595862687, 592641652, 589221954, 585568070, 581716597, 577739179, 573748648, 569955945, 566542029, 563506544, 560698450, 557886064, 554820716, 551322699, 547313333, 542804122, 537921846, 532828391, 527575970]
2873.8E27575970n365312n255759m818976m144430l376782k612055j931667j366883
2890.1D98704106r25303o46651n65707o27965p19875q56221j079261j346469j675189
2908.5D90261465k106905k603829l095924l500134l705085l682404l442735k937942
2924.8D65186507k179355j303583l58045P26044J888603L014296M004747M731595N148173
2943.2D80858982N391389N612015N811185N912423N822361N649864N602181N591989
2959.5E26252389N394459M957080M463672M096747L813862L629566L621578L624797
2975.8E59854150L520965L361822L141224K907515K614438K238035K013386J792311
2992.1E81443846J351953R59754P36415N64039L06666o2764l98755o26504q16763j114964
$$ y = [527575970, 522210658, 516954899, 512135923, 507991493, 504614711, 502002656, 500070989, 498704106, 497778803, 497132152, 496566445, 495938480, 495218605, 494362384, 493283123, 491936654, 490261465, 488154560, 485550731, 482454807, 478954673, 475249588, 471567184, 468124449, 465186507, 463007152, 461703569, 461345524, 462071568, 463960171, 466974467, 470979214, 475710809, 480858982, 486250371, 491862386, 497673571, 503585994, 509408355, 515058219, 520660400, 526252389, 531646848, 536603928, 541067600, 545164347, 548978209, 552607775, 556229353, 559854150, 563375115, 566736937, 569878161, 572785676, 575400114, 577638149, 579651535, 581443846, 582795799, 583755553, 584491968, 585056007, 585362673, 585299909, 584901154, 584274650, 583457887, 582342923]
3012.5E82342923j439751j642823j841604k061546k158582k188623k304078k400338
3028.8E66305578k405942k465665k623200k680481k555072k555609k748549k893388
3045.1E45377672k978087k968848k870202k830028k810598k821087k896846k899408
3061.5E22302568k826870k778112k831936k981127l037333k871871k608419k528697
3077.8D99838203k698630k849698k849519k820432k784044k744555k811283k875656
3094.1D77404386k766967k594531k565831k660572k646446k495110k458692k580732
3110.4D56635505k533764k308041k276063k449542k628147k706558k574146k346396
3126.7D36812848k268404k328187k380163k305179k115608k051621k235115k365321
$$ y = [582342923, 580903172, 579260349, 577418745, 575357199, 573198617, 571009994, 568705916, 566305578, 563899636, 561433971, 558810771, 556130290, 553575218, 551019609, 548271060, 545377672, 542399585, 539430737, 536560535, 533730507, 530919909, 528098822, 525201976, 522302568, 519475698, 516697586, 513865650, 510884523, 507847190, 504975319, 502366900, 499838203, 497139573, 494289875, 491440356, 488619924, 485835880, 483091325, 480280042, 477404386, 474637419, 472042888, 469477057, 466816485, 464170039, 461674929, 459216237, 456635505, 454101741, 451793700, 449517637, 447068095, 444439948, 441733390, 439159244, 436812848, 434544444, 432216257, 429836094, 427530915, 425415307, 423363686, 421128571, 418763250]
3143D18763250k267748k148718k032876j921266j990020k132625k128720k041489j961261
3161.4D00138527j894921j849532j823753j831323j824379j785696j746982j699269
3177.7C85682672j641303j641870j681000j608908j469016j456141j538426j544595
3194C73101413j503467j496256j463145j394629j348227j331449j331359j294255j227647
3212.4C60710979j207412j196176j177668j205892j234769j186967j102776j025050
3228.7C51374269q96812q34167j023292j208067j143069r82612q53300q03858q59201
3247.1C42769891r48161r56863q63761p81864p95304q17627p90596p76500p17133n52028
3267.5C34770054m59731n98669p70539q10385q15749p78705o67334n98639o06596n59658
$$ y = [418763250, 416495502, 414346784, 412313908, 410392642, 408402622, 406269997, 404141277, 402099788, 400138527, 398243606, 396394074, 394570321, 392738998, 390914619, 389128923, 387381941, 385682672, 384041369, 382399499, 380718499, 379109591, 377640575, 376184434, 374646008, 373101413, 371597946, 370101690, 368638545, 367243916, 365895689, 364564240, 363232881, 361938626, 360710979, 359503567, 358307391, 357129723, 355923831, 354689062, 353502095, 352399319, 351374269, 350477457, 349643290, 348619998, 347411931, 346268862, 345286250, 344432950, 343629092, 342769891, 341821730, 340864867, 340001106, 339219242, 338423938, 337606311, 336815715, 336039215, 335322082, 334770054, 334310323, 333711654, 332941115, 332130730, 331314981, 330536276, 329868942, 329270303, 328663707, 328104049]
3287.8C28104049m59284m59909n55098o43313p10189o90312n43892m08858m66734o93262
3308.2C22473198q63313q85368q18312p28965o80625o48916o05881o38038p77543q62747
3328.6C14963490p98822o97851n85288m90278n89966p93457q80868q58575p17044n62489
3349C07988852o51568q94576r47178p64101o27280o64204o59257m92633m44531o51270
3369.4C01192254q84682q94845o98745n67049n85526o45459n91993m21375k14696l0965
3389.8B95656919j29014m58389n07415j80095k98k91467o07848m74811k10106j46478
3410.2B92650998j86205k72244l00527j97321j02938l7193Q9497K44915L00944J81794
3430.6B92371720J81973L50297K22206j41442j79559J11699L41028L98725L64363L86596
$$ y = [328104049, 327644765, 327184856, 326629758, 325986445, 325276256, 324585944, 324042052, 323633194, 323166460, 322473198, 321609885, 320724517, 319906205, 319177240, 318496615, 317847699, 317241818, 316603780, 315826237, 314963490, 314164668, 313466817, 312881529, 312391251, 311801285, 311007828, 310126960, 309268385, 308551341, 307988852, 307337284, 306442708, 305495530, 304731429, 304104149, 303439945, 302780688, 302288055, 301843524, 301192254, 300307572, 299412727, 298713982, 298146933, 297561407, 296915948, 296323955, 295902580, 295687884, 295656919, 295527905, 295069516, 294562101, 294382006, 294381708, 294090241, 293482393, 293007582, 292797476, 292650998, 292464793, 292192549, 291892022, 291694701, 291591763, 291554570, 291644067, 291888982, 292189926, 292371720, 292553693, 292903990, 293126196, 292984754, 292805195, 292916894, 293257922, 293656647, 294021010, 294407606]
3451B94407606M45217M66347N46396O42061N49912N14239P98434R67056O62118K71052
3471.4C00270438K83539N47410P99983Q05438N39511N44101Q17985P94768O49899P66933
3491.8C06820005R05305R16541Q48353Q28355Q72016P37101N74678O65069R14097J146704
3512.2C15228224J069844P72714P42555R74327J153410J021534P75039P90745R98139
3530.6C23526531J172483J238436J142621J017064J154899J350075J296372J118004
3546.9C33016485J145303J288146J373082J464218J569927J680821J688153J476943
3563.2C44703078J401842K001047K567351K416491K201468K280593K484620K692043
3579.5C62748533K824635K737939K518118K585798L007114L058612K942890L145039
$$ y = [294407606, 294852823, 295319170, 295865566, 296507627, 297057539, 297571778, 298370212, 299337268, 299999386, 300270438, 300553977, 301101387, 301901370, 302706808, 303246319, 303790420, 304608405, 305403173, 306053072, 306820005, 307725310, 308641851, 309490204, 310318559, 311190575, 311927676, 312502354, 313167423, 314081520, 315228224, 316298068, 317070782, 317813337, 318787664, 319941074, 320962608, 321737647, 322528392, 323526531, 324699014, 325937450, 327080071, 328097135, 329252034, 330602109, 331898481, 333016485, 334161788, 335449934, 336823016, 338287234, 339857161, 341537982, 343226135, 344703078, 346104920, 348105967, 350673318, 353089809, 355291277, 357571870, 360056490, 362748533, 365573168, 368311107, 370829225, 373415023, 376422137, 379480749, 382423639, 385568678]
3595.8C85568678L452152L517360L448546L250301K967924L072500L383279L520965
3612.1D12181705L641963L566265L699333M347384M287183L545702K972453L385604
3628.5D41627592M389733M199088L871291L805548L717155L702432L554433L104955
3644.8D71972227K887398L798127M836619M263759L673792M039168M187137L690124
3661.1E03348351L292322L071606K723873K724885L273905L010034K881527L631711
3677.4E27958214L633023L271222K994656K628982K386570K501011K792299K806485
3693.7E50972462K578616K247572J920044J964152K209008J947105J386225J112640
3710E66337824J616061K310037K187014J809776J658380J649081J618803J625717J578271
$$ y = [385568678, 389020830, 392538190, 395986736, 399237037, 402204961, 405277461, 408660740, 412181705, 415823668, 419389933, 423089266, 427436650, 431723833, 435269535, 438241988, 441627592, 446017325, 450216413, 454087704, 457893252, 461610407, 465312839, 468867272, 471972227, 474859625, 478657752, 483494371, 487758130, 491431922, 495471090, 499658227, 503348351, 506640673, 509712279, 512436152, 515161037, 518434942, 521444976, 524326503, 527958214, 531591237, 534862459, 537857115, 540486097, 542872667, 545373678, 548165977, 550972462, 553551078, 555798650, 557718694, 559682846, 561891854, 563838959, 565225184, 566337824, 567953885, 570263922, 572450936, 574260712, 575919092, 577568173, 579186976, 580812693, 582390964]
3728.4E82390964J158595P54893R59635J639366J808166J173675L40105M23729J185000
3746.7E91834128Q84175Q77083J883924J964867J337647J150251J399636J283705J007140
3765.1F03622556R95695J031518J193762J293302J089394Q97944R04619R92775R06647
3783.5F12928212R11653J074612J061439Q78632O09160M60923N29885M08113N66184
3801.8F19428813J111091J029849J078486J269400R39012M26948L52323N30124L45766
3820.2F26511812Q63135J372278J012623O92129N01395M53829N42343L75211L21388
3838.5F32646143P49290J042843J073480R00686M25875l79086p23898Q41677J769304
3856.9F38346314J164735M74512J55211L93212M71770K00868M99249Q78512R54569
$$ y = [582390964, 583549559, 584304452, 585264087, 586903453, 588711619, 589885294, 590225399, 590649128, 591834128, 592718303, 593595386, 595479310, 597444177, 598781824, 599932075, 601331711, 602615416, 603622556, 604618251, 605649769, 606843531, 608136833, 609226227, 610124171, 611028790, 612021565, 612928212, 613839865, 614914477, 615975916, 616854548, 617463708, 617924631, 618454516, 618862629, 619428813, 620539904, 621569753, 622648239, 623917639, 624856651, 625283599, 625635922, 626166046, 626511812, 627374947, 628747225, 629759848, 630451977, 630953372, 631407201, 631949544, 632324755, 632646143, 633395433, 634438276, 635511756, 636412442, 636838317, 636459231, 635735333, 636577010, 638346314, 639511049, 639985561, 640140772, 640533984, 641005754, 641206622, 641705871, 642584383, 643538952]
3875.2F43538952P59840K60949L08156N55456M99546N84424L96907K80738N95033N11825
3895.6F48291826O9142j01090J29104N12063Q89123Q73804N34713L32415K30491P7248
3916F51838839J53422M08173L55065J86562K82109K93017R9718K25723N17905M31418
3936.4F54791951K17021J30534J91569L43263L12269K21789K82764L04103K86222L20136
3956.8F57401621K90573K17915K23636K59578K50102J96397J61469J71125J97470K31385
3977.2F59601271K09987K10345K29716J73212K03132K86758K39670J30535O9797J16765
3997.6F61471188
$$ y = [643538952, 644298792, 644559741, 644867897, 645423353, 645922899, 646507323, 646904230, 647184968, 647780001, 648291826, 648360968, 648259878, 648388982, 648901045, 649790168, 650663972, 651198685, 651531100, 651761591, 651838839, 651992261, 652400434, 652755499, 652942061, 653224170, 653517187, 653616905, 653842628, 654360533, 654791951, 655008972, 655139506, 655331075, 655674338, 655986607, 656208396, 656491160, 656795263, 657081485, 657401621, 657692194, 657910109, 658133745, 658393323, 658643425, 658839822, 659001291, 659172416, 659369886, 659601271, 659811258, 660021603, 660251319, 660424531, 660627663, 660914421, 661154091, 661284626, 661354423, 661471188]
##END=$$ End of the data block
