##TITLE=6 e-Kay $$ Begin of the data block
##JCAMP-DX=5.00 $$ ACD/SpecManager v 10.08
##SPECTROMETER/DATA SYSTEM=Alpha
##DATE=16 Oct 2013 13:51:24
##DATA TYPE=INFRARED SPECTRUM
##DATA CLASS=XYDATA
##ORIGIN=
##OWNER=
##NPOINTS=1765
##FIRSTX=399.75695801
##LASTX=3997.56933594
##MAXX=3997.56933594
##MINX=399.75695801
##MAXY=0.85985500
##MINY=0.32023200
##XFACTOR=1.0000000000
##YFACTOR=1.000000000000000e-9
##FIRSTY=0.64565337
##DELTAX=2.03957629
##XUNITS=1/CM
##YUNITS=ARBITRARY UNITS
##XYDATA=(X++(Y..Y))
399.8F45653367o646097k857148L52859k72274k500057j507282K061605L435612M83453
418.1F38204038l849327k851427P15613O77526k836644m789114k779007J19447P2957
436.5F22684062k170146k261817J230359M706323M204511R10402m82440J433909K843916
454.8F33099079P62105l020048l648281q24034Q26239j420796m524350m334152j553416
473.2F15362346k96295k232790m266321k974212L44813J564145l67165k366126j762271
491.5F03006124L15488L76880k179742l905177k599716m78447r26673l540397m902005
509.9E85166335l660083k119899k783060n049228n851567m014015j679063j168907
526.2E58840513k139508k026976K31922K793074L505528K741277K624512L843069M335403
$$ y = [645653367, 639007270, 636150122, 636502981, 636230707, 633730650, 632223368, 634284973, 637720585, 638204038, 634354711, 631503284, 632218897, 632896423, 630059779, 625270665, 622491658, 622611105, 622684062, 620513916, 618252099, 619482458, 624188781, 628393292, 629303694, 628821254, 630255163, 633099079, 633861184, 630841136, 627192855, 626368821, 627195060, 625774264, 621249914, 616915762, 615362346, 615066051, 612833261, 608566940, 605592728, 605937541, 607501686, 607134521, 604768395, 603006124, 603321612, 603698492, 601518750, 597613573, 595013857, 594535410, 593608737, 590068340, 585166335, 581506252, 579386353, 576603293, 571554065, 565702498, 561688483, 560009420, 558840513, 556701005, 554674029, 554905951, 557699025, 561204553, 563945830, 566570342, 570413411, 574748814]
544.6E74748814K222538j096547k318322p72834M84049j012206l789663m626751l317535
562.9E60521543k793789m715145p115721o853521l690541m36842Q86619J422703L225327
581.3E40450633O064295P384301N678057K875746J834034K427459K256394M02748j472771
599.6E67900896j237392P73131J738370M41849q03470K04682K510667L469050K335906
618E77333689J319527K461195M643619N017996K997518J137256J598537L194511L186465
636.3F02890313J258075j55747P42555K666413K815247Q45075o18041K58803K117455
654.7F12820148K263546L60430r70364J72377K237260K985239P07805j081228P25269
673.1F20220482K937913K892554P20024l78608R52124K562463K022028k71082j554787
$$ y = [574748814, 576971352, 575874805, 573556483, 572783649, 573267698, 572255492, 568465829, 563839078, 560521543, 557727754, 553012609, 545896888, 539043367, 535352826, 534915984, 535802603, 537225306, 540450633, 546514928, 553899229, 559577286, 562453032, 564287066, 566714525, 568970919, 569373667, 567900896, 566663504, 567436635, 569175005, 569616854, 568813384, 569018066, 571528733, 574997783, 577333689, 578653216, 581114411, 585758030, 590776026, 593773544, 594910800, 596509337, 599703848, 602890313, 604148388, 603992641, 604735196, 607401609, 610216856, 611061931, 610443890, 610702693, 612820148, 615083694, 615444124, 614473760, 614646137, 616883397, 619868636, 620576441, 619495213, 620220482, 623158395, 626050949, 626770973, 626392365, 627344489, 629906952, 631928980, 631657898, 630103111]
691.4F30103111n15520Q29518k3783k437412l426195j820385K65777M99368n54741
709.8F22919738l26454K116561M644095M976571L641427L130197M668176O375671N711436
728.1F57857418L180921J823425K889455M189908L121257L89278r05394K02775J124441
746.5F73873484m49121l295481m342496k941490j580655k215088l706991l291190k04623
764.8F51846349L041387L954470L458560M242777O606460P982612O560027L772021
781.2F91464663K610743L875374N017043L729939J322389R44435L099203M941166M097044
799.5G21101999J845718J351654L027976M070937K522469K1577m42624J352012K454221
817.9G37305939O65665k163649k710581j079022l90649k236486m534483m475534k471983
$$ y = [630103111, 629587591, 630417109, 630393326, 627955914, 624529719, 622709334, 622975111, 623474479, 622919738, 622593284, 624709845, 629353940, 634330511, 637971938, 641102135, 645770311, 652145982, 657857418, 661038339, 662861764, 665751219, 669941127, 673062384, 673451662, 672546268, 672749043, 673873484, 673424363, 670128882, 665786386, 662844896, 661264241, 659049153, 655342162, 652050972, 651846349, 654887736, 658842206, 662300766, 666543543, 673150003, 681132615, 687692642, 691464663, 694075406, 697950780, 702967823, 706697762, 708020151, 708964586, 712063789, 717004955, 721101999, 722947717, 724299371, 727327347, 731398284, 733920753, 733942330, 733499706, 734851718, 737305939, 737971604, 735807955, 733097374, 732018352, 731627703, 729391217, 724856734, 720381200, 717909217]
836.2G17909217j481474k917707m814147m447043k074063p63893k137959m120827l929556
854.6F91222548j867413m98414n43773K35915L679216Q268237J0469854Q898079O064415
872.9G25928664N000770N378247M362881Q58843k664268l381967j988173j728475l672779
891.3G28093743n333960m490435k292514j720965l581345n499720n342901m164934
907.6F95666969m620612p132411r228945q889138p083178o027758o038487n418658
923.9F41227782l050864j81437J040042M05788l0040J342892L616691M763901M168928
942.3F53303683K964973K144516J010477j720547n665779q667470r414851r334505
958.6F24620497j0596931j3143301j5133440j5691042j5997708j7495811j9889891
$$ y = [717909217, 716427743, 713510036, 708695889, 704248846, 702174783, 701410890, 699272931, 695152104, 691222548, 689355135, 688856721, 688312948, 688548863, 692228079, 700496316, 710966170, 719864249, 725928664, 730929434, 736307681, 740670562, 741529405, 738865137, 735483170, 733494997, 731766522, 728093743, 722759783, 718269348, 715976834, 714255869, 710674524, 705174804, 699831903, 695666969, 691046357, 683913946, 674685001, 665795863, 658712685, 652684927, 646646440, 641227782, 638176918, 637995481, 639035523, 639441311, 639411271, 640754163, 644370854, 649134755, 653303683, 656268656, 658413172, 659423649, 657703102, 652037323, 643369853, 633955002, 624620497, 614023566, 600880265, 585746825, 570055783, 554058075, 536562264, 516672373]
972.9E16672373k1662533k2035033k1690041k1466702k1003217j9314557j6275644
987.1C73224646j2881816j0068297p919222n943656l805071j845360p71612p52717
1003.5C29236895j182765j444369j490981j611650j728684j345843k00599J347661
1019.8C21579665K684146L540009M172653M896462N506188N395561M248679K594680
1036.1C54618043J344680Q71957P88271O41346O31064J397968L091812N030572O542236
1054.5C74957949P714957R089321J0691553J1652321J0702431P086754J175403n523741
1070.8D27546948j0771096j2528002j0332912n717248p58052L142536N490840O726354
1087.1D02799368P607072Q264870Q080959O547511M185408K205253J261085J127869
$$ y = [516672373, 495009840, 472974807, 451284766, 429818064, 408814847, 389500290, 373224646, 360342830, 350274533, 342355311, 336411655, 332606584, 330761224, 329989612, 329236895, 328054130, 326609761, 325118780, 323507130, 321778446, 320432603, 320232004, 321579665, 324263811, 327803820, 331976473, 336872935, 342379123, 347774684, 352023363, 354618043, 355962723, 356834680, 357622951, 358264297, 358895361, 360293329, 363385141, 368415713, 374957949, 382672906, 391762227, 402453780, 414106101, 424808532, 431895286, 433070689, 427546948, 416775852, 404247850, 393914938, 388197690, 387439638, 390582174, 396073014, 402799368, 410406440, 418671310, 426752269, 433299780, 437485188, 439690441, 440951526, 442079395]
1103.4D42079395J330048J831949K821266L963679M500389M002423K938747K277374
1119.7D65745270K385378K782166K999276L169775L624529L916293K982527M65185
1136D88070399k807171n443602o711483p110656p315516p127077n956292l792822j351953
1154.4D40453827P25687K587259M854917P765949J0747373J2963325J4247209J5192568
1170.7E09538114J6184330J6665995J5867472J4047325J2331604J1375905J0501563
1185F06512308Q675397O108045M029632L068924K498090J380086K1875l75748N87285
1203.3F32505894J884639K315223J996041K023696K763272L209710K341211N94377
1219.7F49634063o71684r01521r13322j615226k691805l019035k183378j118779q97527
$$ y = [442079395, 443409443, 445241392, 448062658, 452026337, 456526726, 460529149, 463467896, 465745270, 468130648, 470912814, 473912090, 477081865, 480706394, 484622687, 487605214, 488070399, 485263228, 479819626, 473108143, 465997487, 458681971, 451554894, 445598602, 441805780, 440453827, 441179514, 443766773, 448621690, 456387639, 467135012, 480098337, 494345546, 509538114, 525722444, 542388439, 558255911, 572303236, 584634840, 596010745, 606512308, 615187705, 621295750, 625325382, 628394306, 630892396, 632272482, 632294357, 631918609, 632505894, 634390533, 636705756, 638701797, 640725493, 643488765, 646698475, 649039686, 649634063, 648962379, 648060858, 647147536, 645532310, 642840505, 639821470, 637638092, 636519313, 635621786]
1238F35621786j238644r37819L45826J614451J871824J366616J178205J749038K303899
1256.4F43875182J938760R89914O71863J396597K230108K137303J247525O26922Q01980
1274.7F55916154J041115M78863n43892q99255k84851K88010j76728j292944j879275
1293.1F52647197j569211j125753j316607j889885j918137j177787o00994r56953j785338
1311.4F40306532k071857j539290j014054j343131k238870k766072k634704k476037
1327.8F24222517k844334l317654l026902j864970p49290m66526o11424l78788K36452
1346.1F11199081N99980J85371o65188j125097q85070n02467p26402j493096j750946
1364.5F04836166j078844l40760j05023l25978n18680j53005M03345L74615N484K56061
$$ y = [635621786, 634383142, 633445323, 633791149, 635405600, 637277424, 638644040, 639822245, 641571283, 643875182, 645813942, 646803856, 647475719, 648872316, 651102424, 653239727, 654487252, 655114174, 655916154, 656957269, 657436132, 656892240, 655992985, 655708134, 655996144, 655819416, 654526472, 652647197, 651077986, 649952233, 648635626, 646745741, 644827604, 643649817, 643048823, 642091870, 640306532, 638234675, 636695385, 635681331, 634338200, 632099330, 629333258, 626698554, 624222517, 621378183, 618060529, 615033627, 613168657, 612419367, 611952841, 611341417, 610962629, 611199081, 611799061, 611984432, 611319244, 610194147, 609309077, 608806610, 608080208, 606587112, 604836166, 603757322, 603416562, 603311539, 602985561, 602466881, 602313876, 602717221, 603091836, 603097320, 603353381]
1384.9F03353381J125276J474142P55549m93288j571834j697719j402140j319230j397967
1403.2E98826170j388371q39651j65522k1755j26839K22206J021922J740276J828254
1421.6F01096690J611471J536786J728774J846611J449227Q75116M97162M66704P41661
1439.9F11850202P47502L24368q4936l21508n09500p90596r50337q98003j83404J224935
1460.3F10408723K288103L234327M552245O401420Q733094J0747492R913683P846236
1476.6F64125323O901622O375253N517125M213334L163874K440512J647770Q23617
1493F95208430N7698p56741j072466p75755n69641j354993l422558l693700k913475
1511.3F80706799k815366k736807k228200j256585q40187j238585j754761k097070
$$ y = [603353381, 604478657, 605952799, 606708348, 606215060, 604643226, 602945507, 601543367, 600224137, 598826170, 597437799, 596598148, 596432626, 596410871, 596284032, 596506238, 597528160, 599268436, 601096690, 602708161, 604244947, 605973721, 607820332, 609269559, 610144675, 610641837, 611108541, 611850202, 612597704, 612922072, 612837136, 612515628, 612006128, 611215532, 610265195, 609367192, 609183788, 610408723, 612696826, 615931153, 620483398, 626884818, 635617912, 646365404, 656279087, 664125323, 671026945, 677402198, 682919323, 687132657, 690296531, 692737043, 694384813, 695208430, 695266128, 694509387, 693436921, 692661166, 692091525, 690736532, 687313974, 683620274, 680706799, 677891433, 675154626, 672926426, 671669841, 670829654, 669591069, 667836308, 665739238]
1527.6F65739238j739323j339853j651644j597822j106322j403928j781523j446009
1543.9F53672814j195430q21472k78830K48849N75781P40290M00901l83377l0339M38154
1564.3F53367341N17010N44667O27339Q84593J076162P06196K69353L43382L68774
1582.7F58704817R0480m58121r84848j331687j587510j991629k481759k848804l085792
1601.1F44025147l315032l687024m261613m939377n217671n050779n649924p002830
1617.4F04900897o245375n495250o456733o885707o871164o849587n782545m998684
1633.7E55315852n529284m575968k364755q05914L59893J091659J432001J696050K282203
1652E48901737K960622K967417L249705M007936M874587N425632N438506N881727O347954
$$ y = [665739238, 663999915, 662660062, 661008418, 659410596, 658304274, 656900346, 655118823, 653672814, 652477384, 651655912, 651377082, 651625931, 652201712, 652942002, 653342903, 652959526, 652929187, 653367341, 653884351, 654429018, 655056357, 655940950, 657017112, 657723308, 657992661, 658336043, 658704817, 658795297, 658337176, 657352328, 656020641, 654433131, 652441502, 649959743, 647110939, 644025147, 640710115, 637023091, 632761478, 627822101, 622604430, 617553651, 611903727, 604900897, 598655522, 593160272, 586703539, 579817832, 572946668, 566097081, 560314536, 555315852, 549786568, 545210600, 542845845, 542039931, 542399824, 543491483, 544923484, 546619534, 548901737, 551862359, 554829776, 558079481, 562087417, 566962004, 572387636, 577826142, 583707869, 590055823]
1670.4E90055823O015659O462037P078886O637395O395519P114589Q457362P726014
1686.7F45943284O819665P286668P524312Q657098R444415Q570910Q024037O271779
1703G08542168N131185M769743L812611L239214L263772L571927L656149K852500J995921
1721.4G40835190J650810J425684R63926L53336k95162j225889j723468j297951j262128
1739.7G39424348r55045M67062K450883M413307O032049P004679P058978P170021O906212
1758.1G79972494N734026M760563L989518L566802L313481K732218K031505J624525
1774.4H07725132J651465J708925J416326J030862J015246J249850J364410J137078
1790.7H18299294P55310P01546J013041J097202P51197M57645O29187R67264R51826
$$ y = [590055823, 596071482, 602533519, 609612405, 616249800, 622645319, 629759908, 638217270, 645943284, 652762949, 660049617, 667573929, 676231027, 685675442, 694246352, 702270389, 708542168, 713673353, 718443096, 722255707, 725494921, 728758693, 732330620, 735986769, 738839269, 740835190, 742486000, 743911684, 744875610, 745228946, 744933784, 743707895, 741984427, 740686476, 739424348, 738469303, 738936365, 741387248, 745800555, 751832604, 758837283, 765896261, 773066282, 779972494, 785706520, 790467083, 794456601, 798023403, 801336884, 804069102, 806100607, 807725132, 809376597, 811085522, 812501848, 813532710, 814547956, 815797806, 817162216, 818299294, 819054604, 819756150, 820769191, 821866393, 822617590, 823075235, 823704422, 824671686, 825623512]
1809.1H25623512N87523L38733N37277Q43823Q32021N56946M11689N46932P58052O73533
1829.5H31710041K63989J18315L50117O12975O36518M39167J78933J26004L07262L45588
1849.9H35088909J74820O1393K10822M24206L75569J14441M8220K88069M46796K24293
1870.3H37457538m9174k7240K23458M60983M07755J35958J9849K36332M38511L02554
1890.7H39606524N1021j1623J43051L25442K82824M3571n1320J01686K41518J52528
1911.1H40885222l0577k6644J50145K81274K02537m4942j67489L1709K51532J67846
1931.5H41700613p1525j26362O9916K93494K58743l8027j79470m530K13206K11716
1951.9H42327774K1219o3181P6115K34723J91510J3351q7678K265J72794J52826o1035
$$ y = [825623512, 826211035, 826549768, 827087045, 827930868, 828762889, 829319835, 829731524, 830278456, 831036508, 831710041, 831974030, 832092345, 832442462, 833055437, 833691955, 834131122, 834310055, 834436059, 834743321, 835088909, 835263729, 835325122, 835535944, 835960150, 836335719, 836450160, 836498380, 836786449, 837233245, 837457538, 837408364, 837381124, 837604582, 838065565, 838473320, 838609278, 838629127, 838865459, 839303970, 839606524, 839657545, 839645922, 839788973, 840114415, 840397239, 840440810, 840389490, 840491176, 840732694, 840885222, 840854645, 840828001, 840978146, 841259420, 841461957, 841417015, 841249526, 841281235, 841532767, 841700613, 841629088, 841502726, 841572642, 841866136, 842124879, 842086852, 841907382, 841902852, 842116058, 842327774, 842348993, 842285812, 842361927, 842596650, 842788160, 842801511, 842713833, 842716098, 842888892, 843041718, 842980683]
1974.3H42980683j56343Q821J91987J48356o0916j72615l2783J60575R3162j56939
1994.7H43003988k52008r2387J10387O9559j60515k69413j53423j8775p0691k75254
2015.1H41891468l94404k88844j20938j04428k75790m20690l07441j01745j23501l12864
2035.5H39440823l74437k01285q285m2975k37107l20971j48356P9453R0182q8811j73926
2057.9H38014305l577J97828J57714l9160j12295P748J59800J58072j0193j20103L2127
2080.3H38442266K53618K19822J6868r8765j9908J75655K30253O5684l3617R3520K46167
2102.8H39591563K14278L7253o6876M1783K15471J95145j848j37627l5286J79708J87755
2125.2H40421319k2471j40727j4364J71184J83642J6451j26481l8385J88350K29299
$$ y = [842980683, 842824340, 842833161, 843025148, 843173504, 843112588, 842939973, 842907190, 843067765, 843160927, 843003988, 842751980, 842659593, 842769980, 842839539, 842679024, 842409611, 842256188, 842237413, 842166722, 841891468, 841497064, 841208220, 841087282, 840982854, 840707064, 840286374, 839978933, 839877188, 839753687, 839440823, 839066386, 838865101, 838856816, 838813841, 838576734, 838255763, 838107407, 838186860, 838277042, 838188231, 838014305, 838010728, 838208556, 838366270, 838327110, 838214815, 838222563, 838382363, 838540435, 838530242, 838410139, 838442266, 838695884, 838915706, 838932574, 838833809, 838813901, 838989556, 839219809, 839285493, 839251876, 839345396, 839591563, 839805841, 839843094, 839776218, 839818001, 840033472, 840228617, 840226769, 840089142, 840053856, 840233564, 840421319, 840398848, 840258121, 840243757, 840414941, 840598583, 840615034, 840488553, 840450168, 840638518, 840867817]
2145.6H40867817L6776r3817K265J83463K30312R4474j7524R1254K80858K93791J40786
2168H42110455P7128K26856M00543L87192J95682N2452J56462L88444M43637K43425
2188.4H44682276M7207J04845L13341L53873J84417O6161J54138L32415L46362J45495
2208.8H46730530J7524J52528L38197L03507Q8811n0664P0751L11851L37303J01149
2229.2H48401487r1434k145K14934K40087N7221p4446K7299K20835K12073L636j11639
2251.7H49097908J9788K26021K19166K623j12832K2054K27511K32756J5438j43051
2272.1H49807382k8015J84000J63376l9637j27375K3425K44617K78533J14560K622
2292.5H50623488J29760L37243L32475J01149j4782K33829N83529O28770L66926J76608
$$ y = [840867817, 840904593, 840810776, 840813041, 840996504, 841226816, 841321290, 841303766, 841395020, 841675878, 841969669, 842110455, 842187583, 842414439, 842814982, 843202174, 843397856, 843450308, 843606770, 843995214, 844438851, 844682276, 844729483, 844834328, 845147669, 845501542, 845685959, 845752120, 845906258, 846238673, 846585035, 846730530, 846748054, 846900582, 847238779, 847542286, 847631097, 847580433, 847651184, 847963035, 848300338, 848401487, 848310053, 848307908, 848522842, 848762929, 848820150, 848745704, 848773003, 848993838, 849205911, 849209547, 849097908, 849117696, 849343717, 849562883, 849565506, 849452674, 849474728, 849702239, 849934995, 849950433, 849807382, 849779367, 849963367, 850126743, 850087106, 849959731, 849983156, 850227773, 850506306, 850620866, 850623488, 850753248, 851090491, 851422966, 851524115, 851509333, 851743162, 852326691, 852955461, 853322387, 853498995]
2312.9H53498995L43621O79493Q12709O51777L88086L47257N42938N65648J81199j81616
2333.3H57830107o9618J74463J64628j43528q16643j525402j232863m3035J098693
2351.6H55436802J615107J486480J043260K73347n39541j101196j409530j534284j642823
2370H53627622j796841j774848j494884j211465j165926j206279j009584n98371k61962
2388.3H43107462j90854l09944l85464l00526j76251j98126l50833m34100l43442k24233
2408.7H40193689k48551l93153m72069l82483k72154l28780n10215n93543m89414l55423
2429.1H36147904l73005n14210n92410n16534m14252m37558n42283n91755n33342m26651
2449.5H31205904m07874n13256n84840n24760m39346m62293n72980o18338n25177l79562
$$ y = [853498995, 853842616, 854522109, 855334818, 855986595, 856374681, 856721938, 857264876, 857830524, 858011723, 857830107, 857760489, 857934952, 858099580, 857956052, 857139409, 855614007, 854381144, 854338109, 855436802, 857051909, 858538389, 859581649, 859854996, 859315455, 858214259, 856804729, 855270445, 853627622, 851830781, 850055933, 848561049, 847349584, 846183658, 844977379, 843967795, 843369424, 843107462, 842916608, 842606664, 842221200, 841920674, 841744423, 841546297, 841195464, 840761364, 840417922, 840193689, 839945138, 839551985, 839079916, 838697433, 838425279, 838096499, 837586284, 836992741, 836503327, 836147904, 835774899, 835260689, 834668279, 834151745, 833737493, 833299935, 832757652, 832165897, 831632555, 831205904, 830798030, 830284774, 829699934, 829175174, 828735828, 828273535, 827700555, 827082217, 826557040, 826177478]
2469.9H26177478l37005m55022n73694n43118m40955m07815m83155n70536n12183l33070
2490.3H21520925k71500m05192n02348m36604l37779l19601l94582m85838m58658l24726
2510.7H17584097k79784l90172n00679m91857m05372l72648m52757n42462n21361m13120
2531.1H13213885l58820m53055o04868o29485n38468n01096n61178o10769n51104m35353
2551.5H07969689m14312n30064o42895o11604n17308m93825n63919o42121n93126m70459
2571.9H02490056m29929n06639o40035o84380n74708m65870n05150o09040n85675m30107
2592.3G97058523l48449m27485n40733n88536n46158n03420n85378o95109o92964n94735
2612.7G91535556n48958o60599q02994q45193q08716q07584q88168r60291r48190q49605
$$ y = [826177478, 825840473, 825385451, 824811757, 824268639, 823827684, 823419869, 822936714, 822366178, 821853995, 821520925, 821249425, 820844233, 820341885, 819905281, 819567502, 819247901, 818853319, 818367481, 817908823, 817584097, 817304313, 816914141, 816413462, 815921605, 815516233, 815143585, 814690828, 814148366, 813627005, 813213885, 812855065, 812402010, 811797142, 811167657, 810629189, 810128093, 809566915, 808956146, 808405042, 807969689, 807555377, 807025313, 806382418, 805770814, 805253506, 804759681, 804195762, 803553641, 802960515, 802490056, 802060127, 801553488, 800913453, 800229073, 799654365, 799188495, 798683345, 798074305, 797488630, 797058523, 796710074, 796282589, 795741856, 795153320, 794607162, 794103742, 793518364, 792823255, 792130291, 791535556, 790986598, 790325999, 789523005, 788677812, 787869096, 787061512, 786173344, 785213053, 784264863, 783415258]
2633.1G83415258p74086q53896j009226j052200r58085q65996r16004j021266r87709
2651.4G74976790q50081p95126q88586r96829r81092q58188p83324q76307r95994r32574
2671.8G66018689p54595o63996p16567q36253q74519p69854o90699p56740q52287q57353
2692.2G58245826p68483o92487p59422r03309r29475q42034q31485r22799r74477r12130
2712.6G49709725q18967q13425q91030r87112r98438q94308p99000q18312q91686q63850
2733G40933597p26104o37650o97673p88450p69079o80506o45756p14362p69615p05839
2753.4G33798563n95331n43892n93782o88731o96838o19769o01769o88612p71880p53045
2773.8G27244914o84679o80268q00371r68277j008153r24647r21726j072169j202583
$$ y = [783415258, 782641172, 781787276, 780778050, 779725850, 778767765, 777901769, 776985765, 775964499, 774976790, 774126709, 773331583, 772442997, 771446168, 770465076, 769606888, 768823564, 767947257, 766951263, 766018689, 765264094, 764600098, 763883531, 763047278, 762172759, 761402905, 760712206, 759955466, 759103179, 758245826, 757477343, 756784856, 756025434, 755122125, 754192650, 753350616, 752519131, 751596332, 750621855, 749709725, 748890758, 748077333, 747186303, 746199191, 745200753, 744306445, 743507445, 742689133, 741797447, 740933597, 740207493, 739569843, 738872170, 738083720, 737314641, 736634135, 735988379, 735274017, 734504402, 733798563, 733203232, 732659340, 732065558, 731376827, 730679989, 730060220, 729458451, 728769839, 727997959, 727244914, 726560235, 725879967, 725079596, 724111319, 723103166, 722178519, 721256793, 720184624, 718982041]
2792.2G18982041j194358j139700j179934j345932j503885j525522j478374j512944
2808.5G08101392j666486j803637j815081j809656j902342k068460k217829k317071
2824.8F92500830k414942k545714k731264k935767l124595l361702l829300m651189
2841.1F66906357n655468o651759p509947p852971p216037n441904k933502o08027
2857.4F23036742P13527Q60691K06113p72297j820087k686382l024459k894759k657294
2875.8F10961795k503872k485454k526403k519369k453029k355456k272010k224982
2892.1E91621220k173066k139807k257108k488792k728522l077865l618598m281163
2908.4E68856299n044460n930007o825507p452547p519722o905615n616129l792167
$$ y = [718982041, 717787683, 716647983, 715468049, 714122117, 712618232, 711092710, 709614336, 708101392, 706434906, 704631269, 702816188, 701006532, 699104190, 697035730, 694817901, 692500830, 690085888, 687540174, 684808910, 681873143, 678748548, 675386846, 671557546, 666906357, 661250889, 654599130, 647089183, 639236212, 632020175, 626578271, 623644769, 623036742, 623750269, 624610960, 624817073, 624044776, 622224689, 619538307, 616513848, 613619089, 610961795, 608457923, 605972469, 603446066, 600926697, 598473668, 596118212, 593846202, 591621220, 589448154, 587308347, 585051239, 582562447, 579833925, 576756060, 573137462, 568856299, 563811839, 557881832, 551056325, 543603778, 536084056, 529178441, 523562312, 519770145]
2924.7E19770145j687049M01556K243161L882289N340338O430387P017255P149637
2941E50547719O898582O282091N407453M464149L656864L087581K838075K989888L430128
2959.4E89602530L956616M413247M761159N012155N110025N043388M848718M572034
2975.7F27319872M292190L982068L533005L028035K646268K341211J994133J551211
2992F50687993R76562M08113q7082o16670j115024j456261j598000j429677r62913
3010.4F44807041m90010k30730j27315j11461k51174n54383r22262j245261j415610
3028.7F39458835j477599j571894j754939j928687j926005j841009j904964k077520
3045.1F24976218k166748k136469k116740k169371k197861k192438k187550k126455
$$ y = [519770145, 518083096, 518484652, 520727813, 524610102, 529950440, 536380827, 543398082, 550547719, 557446301, 563728392, 569135845, 573599994, 577256858, 580344439, 583182514, 586172402, 589602530, 593559146, 597972393, 602733552, 607745707, 612855732, 617899120, 622747838, 627319872, 631612062, 635594130, 639127135, 642155170, 644801438, 647142649, 649136782, 650687993, 651664555, 652072668, 651985586, 651368916, 650253892, 648797631, 647199631, 645769954, 644807041, 644317031, 644086301, 643958986, 643847525, 643596351, 643041968, 642119706, 640874445, 639458835, 637981236, 636409342, 634654403, 632725716, 630799711, 628958702, 627053738, 624976218, 622809470, 620673001, 618556261, 616386890, 614189029, 611996591, 609809041, 607682586]
3061.4F07682586k050460k026856k044499k079963k059221j965166j865804j843333
3077.7E91747284j934111k015889k029598k042293k022505j986861k028942k086521
3094E75600564k065897k008378j999617k062142k100944k081275k095699k157152k134800
3112.4E56894660k037346k054334k169251k292157k393543k373159k285838k248228
3128.7E39040804k274931k336800k335786k270222k256334k345085k423346k390266
3145E20408034k312660k232373k187252k281189k453386k496005k403736k307593k250374
3163.4D99483466k236575k262622k288073k271712k237558k208621k198308k190531
3179.7D81589466k178788k156257k094567k039105k023011k041132k051681k044082
$$ y = [607682586, 605632126, 603605270, 601560771, 599480808, 597421587, 595456421, 593590617, 591747284, 589813173, 587797284, 585767686, 583725393, 581702888, 579716027, 577687085, 575600564, 573534667, 571526289, 569526672, 567464530, 565363586, 563282311, 561186612, 559029460, 556894660, 554857314, 552802980, 550633729, 548341572, 545948029, 543574870, 541289032, 539040804, 536765873, 534429073, 532093287, 529823065, 527566731, 525221646, 522798300, 520408034, 518095374, 515863001, 513675749, 511394560, 508941174, 506445169, 504041433, 501733840, 499483466, 497246891, 494984269, 492696196, 490424484, 488186926, 485978305, 483779997, 481589466, 479410678, 477254421, 475159854, 473120749, 471097738, 469056606, 467004925, 464960843]
3196D64960843k063483k036422j921803j844793j841128j861275j847863j784473j756132
3214.3D48003471j747519j724392j734138j760304j745849j688421j633495j576513
3230.7D34392840j550645j665354j795649j743704j619965j569241j559139j566618
3247D21322525j602173j576960j481384j471937j541168j544237j481175j414567j381904
3265.3D07827020j336783j225979j221269j331091j345664j296729j250386j205236
3281.6C97613883j178414j116156j035363r66817r73016j095861j164526j132726j069069
3300C87881935r38803q08955q89897j151621j287014j235723j162022j143009j159847
3318.4C78105044j162231j138568j140445j231939j327067j318693j287163j266360
$$ y = [464960843, 462897360, 460860938, 458939135, 457094342, 455253214, 453391939, 451544076, 449759603, 448003471, 446255952, 444531560, 442797422, 441037118, 439291269, 437602848, 435969353, 434392840, 432842195, 431176841, 429381192, 427637488, 426017523, 424448282, 422889143, 421322525, 419720352, 418143392, 416662008, 415190071, 413648903, 412104666, 410623491, 409208924, 407827020, 406490237, 405264258, 404042989, 402711898, 401366234, 400069505, 398819119, 397613883, 396435469, 395319313, 394283950, 393317133, 392344117, 391248256, 390083730, 388951004, 387881935, 386943132, 386134177, 385244280, 384092659, 382805645, 381569922, 380407900, 379264891, 378105044, 376942813, 375804245, 374663800, 373431861, 372104794, 370786101, 369498938, 368232578]
3334.7C68232578j234919j295954j420706j436770j406700j383185j291424j322031
3351C57440889j507163j566917j487255j402885j387119j407325j317561j214981j311749
3369.3C44837934j538962j574695j359702j205325j172185j168877j133948j015514
3385.7C34668726p98285n44995n94080r22710r50902n80937l58969o10173r15527p51793
3406.1C27640355m36157l41386l15934l37422l79682l00139k01911j54227k4199J96218
3426.5C25345516L84182M13001M26471N16861M35144K32726K88278N93961Q08060Q31395
3446.8C30275595P85053Q51244J031190J153916J215100J281530J236886J236528J513839
3465.2C40580881J707643J485497J143336J170754J445562J648694J673818J490354
$$ y = [368232578, 366997659, 365701705, 364280999, 362844229, 361437529, 360054344, 358762920, 357440889, 355933726, 354366809, 352879554, 351476669, 350089550, 348682225, 347364664, 346149683, 344837934, 343298972, 341724277, 340364575, 339159250, 337987065, 336818188, 335684240, 334668726, 333870441, 333325446, 332731366, 331808656, 330857754, 330276817, 329917848, 329307675, 328392148, 327640355, 327204198, 326862812, 326546878, 326209456, 325829774, 325529635, 325327724, 325173497, 325149298, 325345516, 325729698, 326142699, 326569170, 327086031, 327521175, 327753901, 328042179, 328636140, 329444200, 330275595, 331060648, 331911892, 332943082, 334096998, 335312098, 336593628, 337830514, 339067042, 340580881, 342288524, 343774021, 344917357, 346088111, 347533673, 349182367, 350856185, 352346539]
3481.5C52346539J472891J715749J747251J633584J713634J879513J971722J935661
3497.8C66416544J910090J946032J870066J780868J841396J985490K174556K224654
3514.2C82149696K070427K061606K279818K477675K412796K236933K265364K434462
3530.5D00388777K587527K731681K757788K655208K772063L058165L115893K857744
3546.8D22924846K781719L057391L249287L271640L383308L596217L695398L662914
3563.1D49622720L685117L927946M112691M046172M072547M278153M439801M575163
3579.4D82760310M746676M846304M794568M689694M741013M801929M862785N008996
3595.7E21252275N149662N142570N031228M954099M890621M923403M956365M976511
$$ y = [352346539, 353819430, 355535179, 357282430, 358916014, 360629648, 362509161, 364480883, 366416544, 368326634, 370272666, 372142732, 373923600, 375764996, 377750486, 379925042, 382149696, 384220123, 386281729, 388561547, 391039222, 393452018, 395688951, 397954315, 400388777, 402976304, 405707985, 408465773, 411120981, 413893044, 416951209, 420067102, 422924846, 425706565, 428763956, 432013243, 435284883, 438668191, 442264408, 445959806, 449622720, 453307837, 457235783, 461348474, 465394646, 469467193, 473745346, 478185147, 482760310, 487506986, 492353290, 497147858, 501837552, 506578565, 511380494, 516243279, 521252275, 526401937, 531544507, 536575735, 541529834, 546420455, 551343858, 556300223, 561276734]
3612.1E61276734N107343N072594M981696N043745M844070M560053M428149M491508
3628.4E99805892M625082M392087M234433M232288M164576M119635M116058M057407
3644.7F33747458L942073L864765L727496L440320L302634L474653L516376L221869
3661F62237644K989412L037035L000379K756178K643585K519310K341389K354801K356589
3679.4F86236322K294719K365053K492964K455413K048910J679301J769424J908660
3695.7G03250766J833200J655877J528621J496136J523375J545906J380980J040876
3712G15255737J012922J219511J344680J387001J298785J073479R70006J089216J182973
3730.3G25834310J175761R84133P76648Q66413R33528O86705N11110Q47578R50635
$$ y = [561276734, 566384077, 571456671, 576438367, 581482112, 586326182, 590886235, 595314384, 599805892, 604430974, 608823061, 613057494, 617289782, 621454358, 625573993, 629690051, 633747458, 637689531, 641554296, 645281792, 648722112, 652024746, 655499399, 659015775, 662237644, 665227056, 668264091, 671264470, 674020648, 676664233, 679183543, 681524932, 683879733, 686236322, 688531041, 690896094, 693389058, 695844471, 697893381, 699572682, 701342106, 703250766, 705083966, 706739843, 708268464, 709764600, 711287975, 712833881, 714214861, 715255737, 716268659, 717488170, 718832850, 720219851, 721518636, 722592115, 723562121, 724651337, 725834310, 727010071, 727994204, 728770852, 729637265, 730570793, 731257498, 731768608, 732616186, 733566821]
3748.7G33566821N58257M14371P20620Q61943P68185O96957P07388P50959P51197N94735
3769.1G40391433M53115N20706O71089P93695P18057M69983L81410N02169O22034O28770
3789.5G46152461O06060O21676O73354O97314N23866L01242L79502M84884M38154M29749
3809.9G51308262M99010N14031N30124O29842M74930K37822K73645L24786L69906M47214
3830.3G55609572M85420N42581M54903K06470J73688K52486K62558L91126O09100N21183
3850.7G59509087m7028k14041L13044N23925N10454M15981K67028K33114K04981J63555
3871.1G61880100J54972K11537L85225M22179K95699K36332K07842J99496J83762Q8572
3891.5G64265716J12355K62081L34323L03209J34647l7432L4690J78277J92941J88827
$$ y = [733566821, 734125078, 734539449, 735260069, 736122012, 736890197, 737587154, 738294542, 739045501, 739796698, 740391433, 740844548, 741365254, 742036343, 742830038, 743548095, 744018078, 744399488, 744901657, 745523691, 746152461, 746758521, 747380197, 748053551, 748750865, 749274731, 749575973, 749955475, 750440359, 750878513, 751308262, 751807272, 752321303, 752851427, 753481269, 753956199, 754194021, 754467666, 754792452, 755162358, 755609572, 756094992, 756637573, 757092476, 757298946, 757472634, 757725120, 757987678, 758378804, 758987904, 759509087, 759462059, 759248018, 759561062, 760084987, 760595441, 761011422, 761278450, 761511564, 761716545, 761880100, 762035072, 762246609, 762631834, 763054013, 763349712, 763586044, 763793886, 763993382, 764177144, 764265716, 764378071, 764640152, 764974475, 765277684, 765412331, 765374899, 765409589, 765587866, 765780807, 765969634]
3911.9G65969634K15888J58072P5161J26660J98424K05695J87755J31905P5996Q7082
3932.3G67432272J05679Q4579J05799J51038J52886J71661J88053J30534P4565Q4520
3952.7G68681586J18732J04904O2764O9022R7871J10507J37508J39117J07885J10626
3973.1G69740522R5308P1764J02162J50621J63913J25527R3520R0122P9215P1585R7632
3995.5G70881891J08838
3997.5G70990729
$$ y = [765969634, 766185522, 766343594, 766418755, 766545415, 766743839, 766949534, 767137289, 767269194, 767345190, 767432272, 767537951, 767622530, 767728329, 767879367, 768032253, 768203914, 768391967, 768522501, 768597066, 768681586, 768800318, 768905222, 768967986, 769037008, 769134879, 769245386, 769382894, 769522011, 769629896, 769740522, 769835830, 769907594, 770009756, 770160377, 770324290, 770449817, 770543337, 770633459, 770712674, 770784259, 770881891, 770990729]
##END=$$ End of the data block
