##TITLE=6 e-Kay $$ Begin of the data block
##JCAMP-DX=5.00 $$ ACD/SpecManager v 10.08
##SPECTROMETER/DATA SYSTEM=Alpha
##DATE=16 Oct 2013 13:51:24
##DATA TYPE=INFRARED SPECTRUM
##DATA CLASS=XYDATA
##ORIGIN=
##OWNER=
##NPOINTS=1765
##FIRSTX=399.75695801
##LASTX=3997.56933594
##MAXX=3997.56933594
##MINX=399.75695801
##MAXY=0.85973895
##MINY=0.32020587
##XFACTOR=1.0000000000
##YFACTOR=1.000000000000000e-9
##FIRSTY=0.64403617
##DELTAX=2.03957629
##XUNITS=1/CM
##YUNITS=ARBITRARY UNITS
##XYDATA=(X++(Y..Y))
399.8F44036174o532848k148092O80268m22955k607464j482845K163530L401875K93851
418.1F37381494l571033k588451K82883J40310k864719m717350k968907K33352M78983
436.5F21806562k105594k348363J437247M998386M175245N51045j074373J021266L019034
454.8F31480455J090169k844870l309607m78983P89165j535773m439115m357219j685322
473.2F14708900l71217k214968m009426k700806K44379J246035n53965k419710j687289
491.5F02241933M90368M27305k224862l854334k493322l74914q15093l549755n070448
509.9E84776878l783166k076030k683639m983366n829155m006327j670539j256823
526.2E58487833k204299j891911L85165K764880L374994K700567K767444L989220M260659
$$ y = [644036174, 637503326, 635355234, 636035502, 635612547, 633005083, 631522238, 633685768, 637087643, 637381494, 633810461, 631222010, 631504893, 631645203, 628780484, 624063134, 621094227, 621327579, 621806562, 619700968, 617352605, 618789852, 623788238, 627963483, 628514528, 627440155, 628461421, 631480455, 632570624, 629725754, 626416147, 625937164, 626726329, 625190556, 620751441, 616394222, 614708900, 614337683, 612122715, 608113289, 605412483, 605656862, 606902897, 606348932, 603929222, 602241933, 602732301, 603159606, 600934744, 597080410, 594587088, 594212174, 593397081, 589847326, 584776878, 580993712, 578917682, 576234043, 571250677, 565421522, 561415195, 559744656, 558487833, 556283534, 554391623, 554776788, 557541668, 560916662, 563617229, 566384673, 570373893, 574634552]
544.6E74634552K121508r84549k181113q47042K64526j154304l749967m543721l291249
562.9E60268641k730012m638434p119655o903530l706932m53293Q45790J486361L395677
581.3E40444613O234407P524192N700946K683342J598298K397895K366245M40299j536011
599.6E67854226j319051P04229J759052M98354q31186K13086K620995L633380K487898
618E77620983J367033K410710M528641M932761L044367J224280J634001L275812L340960
636.3F03379548J350283j78098O23226K506733K751350Q74519n47349M20093K310515
654.7F13490820K343297L00407j022935J69158K160728K828777O91235r28044P89940
673.1F20823383K897084K913117Q35836l43382Q69095K495468K080441j63019j562595
$$ y = [574634552, 576756060, 575771511, 573590398, 572743356, 573007882, 571853578, 568103611, 563559890, 560268641, 557538629, 552900195, 545780540, 538877010, 535170078, 534716785, 535562575, 537048936, 540444613, 546679020, 554203212, 559904158, 562587500, 564185798, 566583693, 568949938, 569390237, 567854226, 566535175, 567239404, 568998456, 569496810, 568665624, 568878710, 571499705, 575133085, 577620983, 578988016, 581398726, 585927367, 590860128, 593904495, 595128775, 596762776, 600038588, 603379548, 604729831, 604551733, 605174959, 607681692, 610433042, 611307561, 610760212, 611180305, 613490820, 615834117, 616134524, 615111589, 615280747, 617441475, 620270252, 620961487, 620033443, 620823383, 623720467, 626633584, 627469420, 627126038, 627995133, 630490601, 632571042, 632408023, 630845428]
691.4F30845428o26147P04348o5148k358675l329396j749456L17573M68016o56962
709.8F23549581l94822K139867M752874N027771L555358L051281M712998O455541N676746
728.1F58527195L079057J799584L001213M311621L120541L66927q89242J97351J100302
746.5F74614549m79400l343881m384339k924919j562774k287566l742695l213525j98960
764.8F52476490K921402L877938L487110M256308O591558Q019746O561518L708481
781.2F91900551K642811M003524N080045L660798J180649Q56161L124714N005180M158557
799.5G21612990J864552J268149K969324M092873K511024n6386m64022J486182K520323
817.9G37805009N50032k243042k684772j068354m33743k258718m539728m505992k498925
$$ y = [630845428, 630219281, 630923629, 630858481, 628499806, 625170410, 623420954, 623738527, 624206543, 623549581, 623154759, 625294626, 630047500, 635075271, 638630629, 641681910, 646394908, 652850449, 658527195, 661606252, 663405836, 666407049, 670718670, 673839211, 674206138, 673316896, 673514247, 674614549, 674135149, 670791268, 666406929, 663482010, 661919236, 659631670, 655888975, 652675450, 652476490, 655397892, 659275830, 662762940, 667019248, 673610806, 681630552, 688192070, 691900551, 694543362, 698546886, 703626931, 707287729, 708468378, 709324539, 712449253, 717454433, 721612990, 723477542, 724745691, 727715015, 731807888, 734318912, 734262526, 733798504, 735284686, 737805009, 738355041, 736111999, 733427227, 732358873, 731925130, 729666412, 725126684, 720620692, 718121767]
836.2G18121767j504600k982318m881740m431903k031923p74979k155125m100740l897369
854.6F91361070j849830m81546m90368L11434L694892Q201540J0423839Q926690O086945
872.9G26184666M970849N326390M277408P41482k720177l360093k005935j800835l711700
891.3G27902055n338013m500926k341568j764357l557504n464613n359590m263282
907.6F95312202m731655p127464r123743q792936p051111o051540o086707n431533
923.9F40915513l007829j49369J012623L63469k7060J398801L685356M757225M093945
942.3F53042674K922475K153457J045405j708090n710125q724153r465396r399772
958.6F24156475j0655820j3155103j5106082j5674353j6005337j7523289j9925057
$$ y = [718121767, 716617167, 713634849, 708753109, 704321206, 702289283, 701514304, 699359179, 695258439, 691361070, 689511240, 689029694, 688539326, 688850760, 692545652, 700747192, 711171031, 720097721, 726184666, 731155515, 736481905, 740759313, 741500795, 738780618, 735420525, 733414590, 731613755, 727902055, 722564042, 718063116, 715721548, 713957191, 710399687, 704935074, 699575484, 695312202, 690580547, 683453083, 674329340, 665536404, 658485293, 652433753, 646347046, 640915513, 637907684, 637758315, 638770938, 639134407, 639107347, 640506148, 644191504, 648948729, 653042674, 655965149, 658118606, 659164011, 657455921, 651745796, 643021643, 633556247, 624156475, 613500655, 600345552, 585239470, 569565117, 553559780, 536036491, 516111434]
972.9E16111434k1632672k1952510k1664411k1470874k0933062j9214183j6230196
987.1C73013526j2861699j0051131p875502n832583l696412j824528q26060p96557
1003.5C29249054j177698j414746j477719j628398j745224j374752k24650J396179
1019.8C21602046K753050L518700M076183M814744N484015N418390M258513K549887
1036.1C54475528J316309R29207Q35001O38098O82801J480311L094464M974693O509811
1054.5C74936223P732272R112626J0674149J1598707J0624676P028312J181126n481452
1070.8D27406639j0698110j2415230j0275483n744785p86365L115416N439192O680518
1087.1D02721792P632912Q335352Q083701O496161M138440K184182J290113J172781
$$ y = [516111434, 494478762, 472526252, 450861841, 429390967, 408457905, 389243722, 373013526, 360151827, 350100696, 342225194, 336392611, 332696199, 330871671, 330045611, 329249054, 328071356, 326656610, 325178891, 323550493, 321805269, 320430517, 320205867, 321602046, 324355096, 327873796, 331949979, 336764723, 342248738, 347667128, 351925641, 354475528, 355791837, 356721044, 357556045, 358194143, 358876944, 360357255, 363451719, 368426412, 374936223, 382668495, 391781121, 402455270, 414053977, 424678653, 431706965, 432888091, 427406639, 416708529, 404293299, 394017816, 388273031, 387486666, 390602082, 396041274, 402721792, 410354704, 418690056, 426773757, 433269918, 437408358, 439592540, 440882653, 442055434]
1103.4D42055434J359612J852751K837210L995002M544258M033953K919018K199113
1119.7D65796351K340377K812177L018528L125817L574550L902107K966404M25577
1136D87961888k810865n353093o581128p055998p359296p167518n926460l739625j321823
1154.4D40646082P31349K600134M901349P818282J0773986J2955129J4212490J5153825
1170.7E09792626J6142607J6623556J5849829J4053822J2341082J1368692J0463059
1185F06635273Q611977O039083M001379L096282K533615J405954N1379l54469N82397
1203.3F32602870J857102K286256J986265K025664K751946L194511K326608N62310
1219.7F49593532o90699q79704q85904j620174k717554l008306k139509j092315q82268
$$ y = [442055434, 443415046, 445267797, 448105007, 452100009, 456644267, 460678220, 463597238, 465796351, 468136728, 470948905, 473967433, 477093250, 480667800, 484569907, 487536311, 487961888, 485151023, 479797930, 473216802, 466160804, 458801508, 451633990, 445707530, 441967905, 440646082, 441377431, 443977565, 448878914, 456697196, 467471182, 480426311, 494638801, 509792626, 525935233, 542558789, 558408618, 572462440, 584803522, 596172214, 606635273, 615247250, 621286333, 625287712, 628383994, 630917609, 632323563, 632374942, 632020473, 632602870, 634459972, 636746228, 638732493, 640758157, 643510103, 646704614, 649031222, 649593532, 648902833, 648023129, 647137225, 645517051, 642799497, 639791191, 637651682, 636559367, 635677099]
1238F35677099j228809r43661L31819J600027J873136J394093J212358J767457K297223
1256.4F43980742J923322R91047O73115J382530K206444K114296J248300O50943Q35955
1274.7F56006694J064837M59373n85497r03368k54929L16739j34527j255989j894057
1293.1F52819276j596093j136482j322866j859664j856208j157880o38843r85145j792431
1311.4F40473664k097309j558602j007557j328349k213418k729595k599537k453625
1327.8F24485672k842486l331125l039062j879811p53582m25756n74708l87967K36154
1346.1F11487329O20842J71423o90401j100540q62419n46694p88510j507282j729489
1364.5F05054259j072287l35634q6844l46959n62191j63018M01079L47734l1293K29776
$$ y = [635677099, 634448290, 633504629, 633836448, 635436475, 637309611, 638703704, 639916062, 641683519, 643980742, 645904064, 646895111, 647568226, 648950756, 651157200, 653271496, 654519796, 655170739, 656006694, 657071531, 657530904, 656945407, 656042039, 655787110, 656103849, 655969322, 654713333, 652819276, 651223183, 650086701, 648763835, 646904171, 645047963, 643890083, 643251240, 642266095, 640473664, 638376355, 636817753, 635810196, 634481847, 632268429, 629538834, 626939297, 624485672, 621643186, 618312061, 615272999, 613393188, 612639606, 612213850, 611639142, 611251175, 611487329, 612108171, 612279594, 611589193, 610488653, 609626234, 609079540, 608291030, 606783748, 605054259, 603981972, 603646338, 603559494, 603212535, 602650344, 602487326, 602888405, 603236139, 603204846, 603434622]
1384.9F03434622J108408J476109P47085n58555j640380j687348j339972j264929j367271
1403.2E98907769j350344p88152j39117j8954j28031K02715R81987J744330J867652
1421.6F01279855J624644J551210J751006J872480J478255Q58426M41611M79042Q08597
1439.9F12145126P81894L17812j12832l30627m89831p85172j009881r90272j34885
1458.3F09391332J361191K347290L230036M548311O375968Q654654J0671914R899974
1474.6F56480670P872164O928742O371975N489588M160881L071070K372145J668692
1490.9F94415927Q59141K4379q10028j045584p52986o68704j530767l447234l535986
1509.3F83508158k796233k785027k758741k253354j293004q52584j161516j665533
$$ y = [603434622, 604543030, 606019139, 606766224, 606207669, 604567289, 602879941, 601539969, 600275040, 598907769, 597557425, 596769273, 596630156, 596611202, 596483171, 596685886, 597667873, 599412203, 601279855, 602904499, 604455709, 606206715, 608079195, 609557450, 610415876, 610857487, 611336529, 612145126, 612927020, 613244832, 613132000, 612801373, 612311542, 611526370, 610516489, 609526217, 609391332, 610752523, 613099813, 616329849, 620878160, 627254128, 635908782, 646580696, 656480670, 664352834, 671281576, 677653551, 683143139, 687304020, 690375090, 692747235, 694415927, 695275068, 695299447, 694489419, 693443835, 692690849, 692022145, 690491378, 687044144, 683508158, 680711925, 677926898, 675168157, 672914803, 671621799, 670769215, 669607699, 667942166]
1525.6F67942166k016484j668871j332819j668096j597345j160681j483500j737714
1541.9F55276656j308679j061321p47800k57372K30431N08189O29425L07501k89619
1560.3F53287411R8347M70341N04255N07295O10411Q65102R91941O66678L32176L76404
1580.7F58710361L36170N2452m54128r75728j357913j624525k023398k489865k830804
1599F47342622l100991l361642l697336m226506m911303n217612n049765n647958o994724
1617.4F05134785o247461n542040o483316o858528o856203o835639n774021n034983
1633.7E55502594n533815m497707k306163p94828L40939J094043J510083J727283K214671
1652E49257100L003001L108442L315150M026354M882812N425155N406142N833626O345510
$$ y = [667942166, 665925682, 664256811, 662923992, 661255896, 659658551, 658497870, 657014370, 655276656, 653967977, 652906656, 652158856, 651901484, 652131915, 652640104, 653269529, 653577030, 653287411, 653385758, 653856099, 654360354, 654867649, 655478060, 656343162, 657335103, 658001781, 658333957, 658710361, 659046531, 659098983, 658644855, 657669127, 656311214, 654686689, 652663291, 650173426, 647342622, 644241631, 640879989, 637182653, 632956147, 628044844, 622827232, 617777467, 612129509, 605134785, 598887324, 593345284, 586861968, 580003440, 573147237, 566311598, 560537577, 555502594, 549968779, 545471072, 543164909, 542370081, 542711020, 543805063, 545315146, 547042429, 549257100, 552260101, 555368543, 558683693, 562710047, 567592859, 573018014, 578424156, 584257782, 590603292]
1670.4E90603292O020546O449819P108032O658972O341517P001459Q414388P817983
1686.7F46416008O889642P279992P439494Q501589R306014Q493304Q024931O334663
1703G08685637N167901M787147L829181L248632L250420L516317L653109K984047K124607
1721.4G41246998J710415J439572R43064L15607l35634j208484j609147j201033j168251
1739.7G40133107q25167N59390K456724M351378N964458O984353P062077P144153O858349
1758.1G80688822N691886M739344L982902L538191L261388K672195K013862J697421
1774.4H08286011J716554J692832J384973J040459J038969J257479J323819J061499
1790.7H18802595P42495P72536J051128J069844P38144M95910O50823R43959R47178
$$ y = [590603292, 596623838, 603073657, 610181689, 616840661, 623182178, 630183637, 638598025, 646416008, 653305650, 660585642, 668025136, 676526725, 685832739, 694326043, 702350974, 708685637, 713853538, 718640685, 722469866, 725718498, 728968918, 732485235, 736138344, 739122391, 741246998, 742957413, 744396985, 745340049, 745655656, 745320022, 744111538, 742502391, 741301358, 740133107, 739307940, 739867330, 742324054, 746675432, 752639890, 759624243, 766686320, 773830473, 780688822, 786380708, 791120052, 795102954, 798641145, 801902533, 804574728, 806588590, 808286011, 810002565, 811695397, 813080370, 814120829, 815159798, 816417277, 817741096, 818802595, 819545090, 820317626, 821368754, 822438598, 823176742, 823672652, 824323475, 825267434, 826214612]
1809.1H26214612O27040L71159N29050Q17180Q29220N77271M07219N21242P31767O47604
1829.5H32273364K87831J69337L71754O22570O30916L88741J11222J25826L79264M04120
1849.9H35764945J81794O1750K22564M17232L46780Q9765L7968K56121M11928K61068
1870.3H38051915Q345o855K27988M47869L93272J36733K0027K27153M30465L11613
1890.7H40248525N5134k7120J46568L63708L04460J5617q8275R8765K59578J70589
1911.1H41547549k9743o4433J34528L21567K01643q2314j61171L5226K20537J67549
1931.5H42290938l5226j01805Q4042K84195K15352m9651j55091K1160K36988K01463
1951.9H42992365o020p5996P0513K37703J91391j20q2850L9160K05398J60515o4373
$$ y = [826214612, 826841652, 827212811, 827741861, 828559041, 829388261, 829965532, 830372751, 830893993, 831625760, 832273364, 832561195, 832730532, 833102286, 833724856, 834355772, 834744513, 834855735, 834981561, 835360825, 835764945, 835946739, 836008489, 836231053, 836648285, 836995065, 837084830, 837122798, 837378919, 837790847, 838051915, 838060260, 838053405, 838281393, 838729262, 839122534, 839259267, 839279294, 839506447, 839936912, 840248525, 840303659, 840276539, 840423107, 840786815, 841091275, 841106892, 841018617, 841117382, 841376960, 841547549, 841517806, 841453373, 841587901, 841909468, 842111111, 842028797, 841867626, 841902852, 842123389, 842290938, 842255712, 842153907, 842237949, 842522144, 842737496, 842687845, 842532754, 842553914, 842790902, 842992365, 842986345, 842910349, 842980862, 843218565, 843409956, 843409836, 843326986, 843366146, 843571544, 843732059, 843667686]
1974.3H43667686j53422J013J66476J25527q4996j75536j1504J60218P3194j52528
1994.7H43616128k16663o1750J13248N6088j72913k82943j67012k8312q2314k75016
2015.1H42498541l70860k55347r2208j09672l12806m36186k93494q6128j21177l09884
2035.5H40110779l56376j93656k1517n3525k32995l05116j39415O6578P6771p9811
2055.9H38871717j58071j2517J90020J80184l4451j42396l516J90198J85132k682j12474
2078.3H39151144K3365K32637K09510j0252j22964K4438K40505K46763O2763l3617
2098.7H40024292O5029K12073K31565P1585o5148K7001K07722J98066N961j18375J013
2121.1H40860784K07186J87337m3988j62900k5033J46865J46091K563j11758j9253
$$ y = [843667686, 843514264, 843515277, 843681753, 843807280, 843722284, 843546748, 843535244, 843695462, 843768656, 843616128, 843399465, 843337715, 843450963, 843507051, 843334138, 843051195, 842884183, 842855871, 842773557, 842498541, 842127681, 841872334, 841780126, 841670454, 841357648, 840921462, 840627968, 840541840, 840420663, 840110779, 839754403, 839560747, 839539230, 839485705, 839252710, 838947594, 838808179, 838874757, 838951528, 838871717, 838713646, 838701129, 838891149, 839071333, 839036882, 838894486, 838890970, 839081168, 839266300, 839263618, 839151144, 839174509, 839407146, 839616656, 839606404, 839483440, 839507878, 839748383, 839995146, 840057909, 840024292, 840089321, 840301394, 840532959, 840604544, 840539396, 840566397, 840774119, 840972185, 840978146, 840859771, 840860784, 841067970, 841255307, 841211319, 841048419, 841023386, 841170251, 841316342, 841318905, 841207147, 841187894]
2141.5H41187894J93835K30431M4406q8930K9087K27570K32518P2241j3650J10150
2161.9H42225552K92956L14296J59859M9115J78992L99709M04060J83165N3287J83999
2182.3H44444990L94821M36128K58862Q2195J37806L17216L20673J32740J9490J46449
2202.7H46691370L54111L57211J44124J3828J50442L55721L28481Q4579n0187R4056
2223.1H48523736L03268L08633J03772p2420Q643K36273K56121J9908j15991L7372
2243.5H49609315K31922K02537J132j05679K6405K21372K12431K980j23322J7822K39491
2265.9H50536406K36332J7763j41085m4405J56403J52468j8954r8109L4153K26200
2286.3H51057172K35498P3075m232J46091L33607L12329J11043J9550K42413N71906
$$ y = [841187894, 841381729, 841612160, 841656566, 841567636, 841596723, 841824293, 842056811, 842129052, 842115402, 842225552, 842518508, 842832804, 842992663, 843041778, 843220770, 843620479, 844024539, 844207704, 844260991, 844444990, 844839811, 845275939, 845534801, 845616996, 845754802, 846072018, 846392691, 846525431, 846544921, 846691370, 847045481, 847402692, 847546816, 847560644, 847711086, 848066807, 848395288, 848479867, 848429680, 848523736, 848827004, 849135637, 849239409, 849166989, 849175632, 849411905, 849668026, 849687934, 849571943, 849609315, 849841237, 850043774, 850044906, 849939227, 849965632, 850187004, 850399435, 850402415, 850279093, 850296915, 850536406, 850772738, 850790501, 850649416, 850605011, 850761414, 850913882, 850894928, 850796819, 850830972, 851057172, 851292670, 851365745, 851361513, 851507604, 851841211, 852153540, 852264583, 852284133, 852526546, 853098452]
2306.7H53098452O16014L45349J51098L03209O07729P58171O31273L37243L19064N66065
2327.1H57733667N18322J14918j40787j4603J18971L0935k03848p15136j384676j159370
2347.5H54898393k1994J046717J434326J220286Q93414K67804n39839r83954j145065
2365.9H57070088j368224j653373j804352j682163j406788j191140j146972j145124
2382.2H45671952r28581n39422k59757k18451k98858l37064k85327k06590k28942l60608
2402.6H42008352m20987l26038k21371k47717m01557n11169m25458k70188k76744m54426
2423H38452697n80251n18144l81708l60310m82619n77509n27561m26948m34041n36680
2443.4H33626926n74529n21243m54128m36723n22673o03974n39362m09901m06385n39601
$$ y = [853098452, 853714466, 854059815, 854210913, 854514122, 855121851, 855880022, 856511295, 856848538, 857167602, 857733667, 858251989, 858366907, 858226120, 858211517, 858330488, 858361423, 858157575, 857442439, 856057763, 854898393, 854876399, 855923116, 857357442, 858577728, 859471142, 859738946, 859199107, 858215153, 857070088, 855701864, 854048491, 852244139, 850561976, 849155188, 847964048, 846817076, 845671952, 844743371, 844203949, 843944192, 843725741, 843426883, 843089819, 842804492, 842597902, 842368960, 842008352, 841587365, 841261327, 841039956, 840792239, 840390682, 839879513, 839454055, 839183867, 838907123, 838452697, 837872446, 837354302, 836972594, 836612284, 836129665, 835552156, 835024595, 834597647, 834163606, 833626926, 833052397, 832531154, 832077026, 831640303, 831117630, 830513656, 829974294, 829564393, 829158008, 828618407]
2463.8H28618407o08265n08964l75927l75449m93527n98013n74947m40955l81768m79340
2484.2H23781252n62608m78387l11315k72274m08352n09321m44174l25501k98619l92795
2504.6H19777906m94957m56274l16262k84195m09007n18262m97997m09305l84629m56214
2525H15550804n21183m92632l97325l54469m61399o12200o14643n11705m91560n99504
2545.4H10494184o77287n80907m05610l58879n04613o62506o37531n17070m84526n63860
2565.8H05101395o26505n63025m40419m19199n45800o83904o74367n32388m43161n06163
2586.2G99666464o03377n60463m12047l83496m91798n81205n91278n29110m91441n79357
2606.6G94442892p03514o99937n75483n32329o65605q14438q44240p91371p77602q65519
$$ y = [828618407, 828010142, 827501178, 827125251, 826749802, 826256275, 825658262, 825083315, 824642360, 824260592, 823781252, 823218644, 822740257, 822428942, 822156668, 821748316, 821238995, 820794821, 820469320, 820170701, 819777906, 819282949, 818826675, 818510413, 818226218, 817817211, 817298949, 816800952, 816391647, 816007018, 815550804, 815029621, 814536989, 814139664, 813785195, 813323796, 812711596, 812096953, 811585248, 811093688, 810494184, 809816897, 809235990, 808830380, 808471501, 807966888, 807304382, 806666851, 806149781, 805665255, 805101395, 804474890, 803911865, 803471446, 803052247, 802506447, 801822543, 801148176, 800615788, 800172627, 799666464, 799063087, 798502624, 798090577, 797707081, 797215283, 796634078, 796042800, 795513690, 795022249, 794442892, 793739378, 793039441, 792463958, 791931629, 791266024, 790451586, 789607346, 788815975, 788038373, 787172854]
2626.9G87172854r82940r83894q38816p52807q50201j002490j055300r61602q49724
2645.3G78895080r18269j049042r97841q25465p53879q67725j007080j010120q91209
2663.7G70574450p89463q41498r55463r21190p47382o51300p22111q40663q71778p91430
2684.1G62442172p10428p54357q52346q41677p26342o66857p70092r04799r16004q44002
2704.5G54455268q28623r26733j011491r60052q33690p84874q54493r60528r92299
2722.8G46302485r06229q18550q42929q93652q32856o83308o10769p02262q21411q07226
2743.2G38383293o81341o06179o73055p57218p25090o24240n61297n91039o55294o47604
2763.6G31860936n90682n86927o68705p71224p91669p23601p07626q23676r71675j004219
$$ y = [787172854, 786189914, 785206020, 784367204, 783614397, 782764196, 781761706, 780706406, 779744804, 778895080, 777976811, 776927769, 775929928, 775104463, 774350584, 773482859, 772475779, 771465659, 770574450, 769784987, 768943489, 767988026, 767066836, 766319454, 765668154, 764946043, 764105380, 763233602, 762442172, 761731744, 760977387, 760125041, 759283364, 758557022, 757890165, 757120073, 756215274, 755299270, 754455268, 753626645, 752699912, 751688421, 750728369, 749894679, 749109805, 748255312, 747294784, 746302485, 745396256, 744577706, 743734777, 742841125, 742008269, 741324961, 740714192, 740011930, 739190519, 738383293, 737701952, 737095773, 736422718, 735665500, 734940410, 734316170, 733754873, 733163834, 732508540, 731860936, 731270254, 730683327, 730014622, 729243398, 728451729, 727728128, 727020502, 726196826, 725225151, 724220932]
2784G24220932r31263r21965j048088j185835j188278j120209j171113j346707j474500
2802.3G13832974j479268j470208j553058j707793j816749j819551j800597j879990
2818.7G00305760k067387k245903k343655k386451k495885k737104k963126l123522
2835F79942727l350735l829419m663646n661607o646872p511318p862091p222175n435169
2853.3F27759695k924025o17564O72341Q17716J90973p99298j857162k682924l010273
2871.7F17549479k898812k656043k497136k475024k531826k572000k519071k368629
2888E97030938k262950k246917k198934k157629k236187k422035k694249l090858l621877
2906.4E74099302m290282n089581n949557o797850p418037p510900o933928n648494
$$ y = [724220932, 723289669, 722367704, 721319616, 720133781, 718945503, 717825294, 716654181, 715307474, 713832974, 712353706, 710883498, 709330440, 707622647, 705805898, 703986347, 702185750, 700305760, 698238373, 695992470, 693648815, 691262364, 688766479, 686029375, 683066249, 679942727, 676591992, 672762573, 668098927, 662437320, 655790448, 648279130, 640417039, 633194864, 627759695, 624835670, 624218106, 624890447, 625708163, 625899136, 625099838, 623242676, 620559752, 617549479, 614650667, 611994624, 609497488, 607022464, 604490638, 601918638, 599399567, 597030938, 594767988, 592521071, 590322137, 588164508, 585928321, 583506286, 580812037, 577721179, 574099302, 569809020, 564719439, 558769882, 551972032, 544553995, 537043095, 530109167, 524460673]
2922.7E24460673l798663j681984L97384K251983L913999N340814O370485O968737
2939E44223428P151782O910920O296874N418598M479766L712714L146052K843619K990126
2957.4E87173879L458381L958165M396618M773080N054593N176545N107820M892945
2973.7F23992026M578709M267037L980875L573239L100753K720356K368629J992703
2990F50574327J553833R94503M45903p4089o31034j094639j423061j592040j419127
3008.3F47334576r36270m66466k10404j11998j23500k87116n72145r08196j222372
3026.7F42496109j386642j442135j558482j759053j922428j902998j809418j899064
3043F28815889k091169k156854k107203k095401k168655k225101k236545k194882k087355
$$ y = [524460673, 520662010, 518980026, 519377410, 521629393, 525543392, 530884206, 537254691, 544223428, 551375210, 558286130, 564583004, 570001602, 574481368, 578194082, 581340134, 584183753, 587173879, 590632260, 594590425, 598987043, 603760123, 608814716, 613991261, 619099081, 623992026, 628570735, 632837772, 636818647, 640391886, 643492639, 646212995, 648581624, 650574327, 652128160, 653122663, 653568566, 653494477, 652863443, 651768804, 650345743, 648753703, 647334576, 646398306, 645931840, 645721436, 645609438, 645485938, 645198822, 644626677, 643718481, 642496109, 641109467, 639667332, 638108850, 636349797, 634427369, 632524371, 630714953, 628815889, 626724720, 624567866, 622460663, 620365262, 618196607, 615971506, 613734961, 611540079, 609452724]
3061.4F09452724k018690j997530j997650k059757k086938k020061j906454j826823
3077.7E93538821j897753k025544k057731k038539k020538k006888k030134k061844
3094E77399850k042055k004743k002299k055883k114475k098679k082110k151787k153576
3112.4E58694243k035498k017737k143859k338171k489269k414406k248466k214849
3128.7E40791988k286315k366423k364636k285123k246260k335131k410591k357304
3145E22140205k328456k301156k207577k264738k453149k490103k400041k338647k302409
3163.4E01053929k276271k278388k280891k263874k241551k209157k207339k219558
3179.7D83076900k200603k161622k122015k103925k088129k074182k082765k068133
$$ y = [609452724, 607434034, 605436504, 603438854, 601379097, 599292159, 597272098, 595365644, 593538821, 591641068, 589615524, 587557793, 585519254, 583498716, 581491828, 579461694, 577399850, 575357795, 573353052, 571350753, 569294870, 567180395, 565081716, 562999606, 560847819, 558694243, 556658745, 554641008, 552497149, 550158978, 547669709, 545255303, 543006837, 540791988, 538505673, 536139250, 533774614, 531489491, 529243231, 526908100, 524497509, 522140205, 519811749, 517510593, 515303016, 513038278, 510585129, 508095026, 505694985, 503356338, 501053929, 498777658, 496499270, 494218379, 491954505, 489712954, 487503797, 485296458, 483076900, 480876297, 478714675, 476592660, 474488735, 472400606, 470326424, 468243659, 466175526]
3196D66175526k013415j982808j953721j884341j826167j832783j849294j832277j828968
3214.3D49171752j800239j756728j752168j722872j687974j708567j706749j628638
3230.7D35407817j570731j652777j775652j780332j729935j665354j582116j553595
3247D22097325j588612j601667j545936j481562j465887j482606j504749j487285j418799
3265.3D08520222j324863j226961j242966j348942j372784j307697j230388j190663
3281.6C98274958j169592j121521j068980j010060r79334j046449j136541j170069
3298C89572412j119465r74297q61317r30757j110613j246780j287580j210481j150846
3316.3C79680276j199573j201541j129180j137763j281321j376271j317293j263648
$$ y = [466175526, 464162111, 462179303, 460225582, 458341241, 456515074, 454682291, 452832997, 451000720, 449171752, 447371513, 445614785, 443862617, 442139745, 440451771, 438743204, 437036455, 435407817, 433837086, 432184309, 430408657, 428628325, 426898390, 425233036, 423650920, 422097325, 420508713, 418907046, 417361110, 415879548, 414413661, 412931055, 411426306, 409939021, 408520222, 407195359, 405968398, 404725432, 403376490, 402003706, 400696009, 399465621, 398274958, 397105366, 395983845, 394914865, 393904805, 392925471, 391879022, 390742481, 389572412, 388452947, 387478650, 386617333, 385686576, 384575963, 383329183, 382041603, 380831122, 379680276, 378480703, 377279162, 376149982, 375012219, 373730898, 372354627, 371037334, 369773686]
3332.6C69773686j256853j248539j321793j434385j439423j433909j420021j284778
3348.9C58933985j293123j514226j623124j537680j410932j365214j388997j365155
3365.3C47435534j310408j364201j507640j534939j407743j303017j241803j172751
3381.6C36593032j073122r35137p66725n89370o26117r00984r55314o10292l48359
3399.9C29787612n74321r18924q14766m84914l46481l47883l78996l62635k53558j88768
3420.3C25116366j55061Q344K07335L33846L61561M08292N35071M72844K55167K86132
3440.7C27829897N82040Q06242Q16464P90209R20624J064807J119286J211315J311511
3459.1C36452395J250952J241714J512736J696229J453519J116127J172989J476318
$$ y = [369773686, 368516833, 367268294, 365946501, 364512116, 363072693, 361638784, 360218763, 358933985, 357640862, 356126636, 354503512, 352965832, 351554900, 350189686, 348800689, 347435534, 346125126, 344760925, 343253285, 341718346, 340310603, 339007586, 337765783, 336593032, 335519910, 334584773, 333818048, 333228678, 332602561, 331701577, 330746263, 330135971, 329787612, 329213291, 328294367, 327479601, 326994687, 326648206, 326300323, 325921327, 325558692, 325305134, 325116366, 324961305, 324969649, 325176984, 325510830, 325872391, 326280683, 326815754, 327288598, 327543765, 327829897, 328411937, 329218179, 330034643, 330824852, 331745476, 332810283, 333929569, 335140884, 336452395, 337703347, 338945061, 340457797, 342154026, 343607545, 344723672, 345896661, 347372979]
3475.4C47372979J721442J712143J480013J481295J710027J720846J618713J716167
3491.7C60533625J885682J983822J958102J908630J928597J866758J794994J885623
3508C75745833K044439K201915K238870K127856K146184K344340K518356K410352K187014
3526.4C95965159K248436K486229K654225K770304K774150K702444K855063L105461
3542.7D17561471L124893K912194K867847L051222L168225L278345L475517L652573
3559D43092287L737151L734917L705173L876657M116058M127651M139066M317403M495233
3577.4D79341596M627198M763514M841209M789710M725724M829466M880131M926860
3593.7E17725408N087853N217731N190849N078196N011619M920661M918039N022764
$$ y = [347372979, 349094421, 350806564, 352286577, 353767872, 355477899, 357198745, 358817458, 360533625, 362419307, 364403129, 366361231, 368269861, 370198458, 372065216, 373860210, 375745833, 377790272, 379992187, 382231057, 384358913, 386505097, 388849437, 391367793, 393778145, 395965159, 398213595, 400699824, 403354049, 406124353, 408898503, 411600947, 414456010, 417561471, 420686364, 423598558, 426466405, 429517627, 432685852, 435964197, 439439714, 443092287, 446829438, 450564355, 454269528, 458146185, 462262243, 466389894, 470528960, 474846363, 479341596, 483968794, 488732308, 493573517, 498363227, 503088951, 507918417, 512798548, 517725408, 522813261, 528030992, 533221841, 538300037, 543311656, 548232317, 553150356, 558173120]
3610E58173120N073667N091488N005777M991889N117118M902303M595399M442513M474640
3628.4F01867914M621923M452110M309177M275024M219115M152655M029453L904045
3644.7F35831416L860175L920973L847599L509402L336430L482341L472269L203690
3661F64464295L008902L007233K935946K734661K667964K534151K374172K430856K393067
3679.4F88551247K277076K309800K366066K325892K065837J787722J830042J926124
3695.7G05439806J868367J698315J529456J474976J503110J490056J295507J024664
3712G17324257J095772J293659J342416J311540J212120J057089J003980J117409J161098
3730.3G27919340J070142R14276Q52704R12785Q43287N69462M63844Q50200R32098
$$ y = [558173120, 563246787, 568338275, 573344052, 578335941, 583453059, 588355362, 592950761, 597393274, 601867914, 606489837, 610941947, 615251124, 619526148, 623745263, 627897918, 631927371, 635831416, 639691591, 643612564, 647460163, 650969565, 654305995, 657788336, 661260605, 664464295, 667473197, 670480430, 673416376, 676151037, 678819001, 681353152, 683727324, 686158180, 688551247, 690828323, 693138123, 695504189, 697830081, 699895918, 701683640, 703513682, 705439806, 707308173, 709006488, 710535944, 712010920, 713514030, 715004086, 716299593, 717324257, 718420029, 719713688, 721056104, 722367644, 723579764, 724636853, 725640833, 726758242, 727919340, 728989482, 729903758, 730756462, 731669247, 732512534, 733081996, 733545840, 734396040, 735328138]
3748.7G35328138N96344N92590Q85546R07838P34747O94513P32303P25448P10904N90563
3769.1G42498934M42028N02408O97076Q24034P43449N07653L89993N03481O28948O04510
3789.5G48342514N24521N15044N96225O66141N33283L52562M74095N46515M52697M62532
3809.9G53466129N00560M50611M37379N10275L84927K65777L83616M32968M35233M59731
3830.3G57727206M59969N02407M15981J74761J71840K92778L29018M15087N46217M72545
3850.7G61507809K1458j46508L14235N21958M53353L04759K05457K38061K46525K52187
3871.1G63919294K57671K23398K74420L08573K81870K78890K39969K35557K15650R4414
3891.5G66329706J13427K44379K90633K46226J16349K9325J09136K28405K29895J77980
$$ y = [735328138, 735924482, 736517072, 737402618, 738310456, 739045203, 739739716, 740472019, 741197467, 741908371, 742498934, 742940962, 743443370, 744140446, 744964480, 745707929, 746215582, 746605575, 747109056, 747738004, 748342514, 748867035, 749382079, 749978304, 750644445, 751177728, 751530290, 752004385, 752550900, 753003597, 753466129, 753966689, 754417300, 754854679, 755364954, 755749881, 756015658, 756399274, 756832242, 757267475, 757727206, 758187175, 758689582, 759105563, 759280324, 759452164, 759744942, 760073960, 760489047, 761035264, 761507809, 761529267, 761382759, 761696994, 762218952, 762672305, 762977064, 763182521, 763420582, 763667107, 763919294, 764176965, 764400363, 764674783, 764983356, 765265226, 765544116, 765784085, 766019642, 766235292, 766329706, 766443133, 766687512, 766978145, 767224371, 767340720, 767370045, 767479181, 767707586, 767937481, 768115461]
3911.9G68115461J57356J16289R8467J69217J87278J38581J43468J54853J35005J56283
3932.3G69572258J71840J29163J27912J40131R0539R0837J35720J32442J19269J23799
3952.7G70833910J25706Q9168P5519J53423J85489Q5533N2631J33097J39833J04785
3973.1G71979094R0181N4300P6115J66118K23279J85073P7844L8027R2268J40965J18196
3995.5G73241460K3365
3997.5G73264825
$$ y = [768115461, 768272817, 768389106, 768487573, 768656790, 768844068, 768982649, 769126117, 769280970, 769415975, 769572258, 769744098, 769873261, 770001173, 770141304, 770231843, 770322680, 770458400, 770590842, 770710111, 770833910, 770959616, 771048784, 771124303, 771277726, 771463215, 771548748, 771601379, 771734476, 771874309, 771979094, 772069275, 772123575, 772199690, 772365808, 772589087, 772774160, 772852004, 772890031, 772982299, 773123264, 773241460, 773264825]
##END=$$ End of the data block
