##TITLE=6 e-Kay $$ Begin of the data block
##JCAMP-DX=5.00 $$ ACD/SpecManager v 10.08
##SPECTROMETER/DATA SYSTEM=Alpha
##DATE=16 Oct 2013 13:51:24
##DATA TYPE=INFRARED SPECTRUM
##DATA CLASS=XYDATA
##ORIGIN=
##OWNER=
##NPOINTS=1765
##FIRSTX=399.75695801
##LASTX=3997.56933594
##MAXX=3997.56933594
##MINX=399.75695801
##MAXY=0.86001295
##MINY=0.32062137
##XFACTOR=1.0000000000
##YFACTOR=1.000000000000000e-9
##FIRSTY=0.64456719
##DELTAX=2.03957629
##XUNITS=1/CM
##YUNITS=ARBITRARY UNITS
##XYDATA=(X++(Y..Y))
399.8F44567192o204784k118647M50849n30183k569795j563310J833319L227353L20792
418.1F37412786l542006k274155Q63433O03974k970636m971564k886772J54555J23560
436.5F22513175k292693k353966J294971M651367L925085P19905n62727J373112K949119
454.8F32217348Q90791k777457l159881n64575P64072j457572m511714m504919j922250
473.2F14973843n72801k216219l989757k797544J94610J376986m45425k454818j775682
491.5F02293193L92378M68790j944959l648281k539456m72844q99791l623903n035281
509.9E84989846l667712j962007k640426n126655n945623l860295j466035j152456
526.2E59168637k163530j990258K29120K843082L544152K664149K592086L848315M266977
$$ plain form
399.8 644567192 638362408 636243761 636694610 636164427 633594632 632031322 633864641 637091994 637412786
418.1 637412786 633870780 631596625 632460058 633064032 630093396 625121832 622235060 622389615 622513175
436.5 622513175 620220482 617866516 619161487 623812854 627737939 628457844 627895117 629268229 632217348
454.8 632217348 633108139 630330682 627170801 626606226 627370298 625912726 621401012 616896093 614973843
473.2 614973843 614401042 612184823 608195066 605397522 605592132 606969118 606523693 604068875 602293193
491.5 602293193 602685571 603154361 601209402 597561121 595021665 594548821 593649030 590025127 584989846
509.9 584989846 581322134 579360127 576719701 571593046 565647423 561787128 560321093 559168637
526.2 559168637 557005107 555014849 555243969 558087051 561631203 564295352 566887438 570735753 575002730
544.6E75002730K180099j021921k204895q19445J93715j150131l431201m254639l372669
562.9E61121643k959371m801750p188678o812692l517329l05593Q47578J322031L219187
581.3E40925026O140053P461608N682289K721072J636743K404034K364397M40896j509249
599.6E68266869j192213Q64089J812995M95195q12650K09510K598703L582120K336204
618E78160822J211226K415896M726946N196214L168285J180470J537740L227532L355026
636.3F04180157J336217k13444O96063K651036K744019P54118n74470M52399K324224
654.7F14350319K333462L08395r56953K52962K192915K753019N45978r03666R69172
673.1F21845603L011048K796471O64175l42370J035870K651929K020479l34144j573205
$$ plain form
544.6 575002730 577182829 576160908 573956013 573136568 573330283 572180152 568748951 564494312 561121643
562.9 561121643 558162272 553360522 546171844 539359152 535841823 535536230 536383808 537705839 540925026
581.3 540925026 547065079 554526687 560208976 562930048 564566791 566970825 569335222 569776118 568266869
599.6 568266869 567074656 567938745 569751740 570246935 569434285 569643795 572242498 575824618 578160822
618 578160822 579372048 581787944 586514890 591711104 594879389 596059859 597597599 600825131 604180157
636.3 604180157 605516374 605302930 605998993 608650029 611394048 612148166 611573696 612026095 614350319
654.7 614350319 616683781 616992176 616035223 616288185 618481100 621234119 621780097 620876431 621845603
673.1 621845603 624856651 627653122 628317297 627974927 629010797 631662726 633683205 633349061 631775856
691.4F31775856m70281Q83460j6808k473354l467620j824438K74300M55678n96941
709.8F24539852k61426K275407M790068M993618L536462L055335M702866O416499N642474
728.1F59691155L063559J809001L001988M249037L051161L34859r34243J35183J063407
746.5F75465107n24521l390372m333913k847254j585603k374113l807664l166973n9605
764.8F53375089L002882L889680L506780M283130O591141P983565O564141L748894
781.2F92945302K606928L916979N027055L646851J210570Q99673L127038M980147M112184
799.5G22472727J846433J370966L095806M109144K464950o3717m54605J415134K414346
817.9G38671184N17129k247750k705574j062513m51326k369046m679561m553318k438307
$$ plain form
691.4 631775856 631305575 632189035 632172227 629698873 626231253 624406815 624681115 625136793 624539852
709.8 624539852 624278426 626553833 631343901 636337519 639873981 642929316 647632182 654048681 659691155
728.1 659691155 662754714 664563715 667565703 671814740 674865901 675200760 674266517 674401700 675465107
746.5 675465107 674940586 671550214 667216301 664369047 662783444 660409331 656601667 653434694 653375089
764.8 653375089 656377971 660267651 663774431 668057561 674648702 682632267 689196408 692945302
781.2 692945302 695552230 699469209 704496264 708143115 709353685 710253358 713380396 718360543 722472727
799.5 722472727 724319160 725690126 728785932 732895076 735360026 735296309 734841704 736256838 738671184
817.9 738671184 739188313 736940563 734234989 733172476 732721150 730352104 725672543 721119225 718680918
836.2G18680918j451850k965986m864336m420816k016962p95841k206922m091501l842413
854.6F92024291j821995n25773n96642K54690L749013Q263648J0405719Q875668O045938
872.9G26674557M943967N336761M280686O41823k839923l363847j966179j825392l795385
891.3G28087068n401671m461825k232909j768470l710211n541682n305648m206001
907.6F95458651m706681p152200r177744q787871p031679o102502o107867n354226
923.9F41037881k925336j14024J017452L33428j01030J329124L694534M820109M106998
942.3F53199136K860368K102553J032293j763820n790532q732200r429097r395957
958.6F24082744j0697305j3218522j5125871j5653670j6030252j7573118j9917071
$$ plain form
836.2 718680918 717229068 714263082 709398746 704977930 702960968 702165127 699958205 695866704 692024291
854.6 692024291 690202296 689676523 689079881 689334571 693083584 701347232 711752951 720628619 726674557
872.9 726674557 731618524 736955285 741235971 741877794 739037871 735674024 733707845 731882453 728087068
891.3 728087068 722685397 718223572 715990663 714222193 710511982 704970300 699664652 695458651
907.6 695458651 690751970 683599770 674422026 665634155 658602476 652499974 646392107 641037881
923.9 641037881 638112545 637998521 639015973 639349401 639248371 640577495 644272029 649092138 653199136
942.3 653199136 656059504 658162057 659194350 657430530 651639998 642907798 633478701 624082744
958.6 624082744 613385439 600166917 585041046 569387376 553357124 535784006 515866935
972.9E15866935k1588176k1936834k1640033k1382749k0843416j9155800j6157181
987.1C73162746j2770205r963572p848889n865842l695220j794874q22366p94410j169175
1005.5C28438193j446605j511127j598209j706034j356155j98692J390189K706289
1021.8C24717849L504396M088342M814178N479336N387395M216612K578228J384765
1038.1C56171101R18657P87258O38276P00027J519114L151685M991382O482274P685750
1056.5C83045524R067089J0614544J1491775J0537565P034630J246065n412579j0640591
1072.8D16984022j2389750j0273337n705774p22557L151893N435855O644606P589042
1089.1D10714000Q303017Q063614O484300M156321K267927J404822J210869J294463
$$ plain form
972.9 515866935 494278759 472341925 450701892 429319143 408475727 389319927 373162746
987.1 373162746 360392541 350428969 342580080 336714238 333019018 331224144 330401778 329607368 328438193
1005.5 328438193 326991588 325480461 323882252 322176218 320820063 320621371 322011560 324717849
1021.8 324717849 328222245 332310587 337124765 342604101 347991496 352208108 354786336 356171101
1038.1 356171101 357089758 357877016 358515292 359215319 360734433 363886118 368877500 375359774 383045524
1056.5 383045524 392112613 402727157 414218932 424756497 431791127 433037192 427624613 416984022
1072.8 416984022 404594272 394320935 388615161 387892604 391044497 396480352 403124958 410714000
1089.1 410714000 419017017 427080631 433564931 437721252 439989179 441394001 442604870 443899333
1105.4D43899333J768411K794325M001111M577815M047484K916544K223671K364427
1121.8D68593121K776473K945185L109485L623098L948361K982408M11450k823889
1138.1D85565692n364269o615668p066638p302105p083476n868077l714532j312047
1154.4D41238880P43717K606571M894107P795424J0727644J2909889J4200151J5170365
1170.7E10286748J6171933J6659975J5853524J4014721J2307703J1330486J0414540
1185F07039630Q589149O043136M009664L081083K496303J362443N245l50774O73235
1203.3F32949114J948774K292216J935362J992286K758264L197849K311349N58555
1219.7F49943769o74188q66175q97467j658142k737164k964616k079308j099408r29236
$$ plain form
1105.4 443899333 445667744 448462069 452463180 457040995 461088479 464005023 466228694 468593121
1121.8 468593121 471369594 474314779 477424264 481047362 484995723 487978131 488389581 485565692
1138.1 485565692 480201423 473585755 466519117 459217012 452133536 446265459 442550927 441238880
1154.4 441238880 441982597 444589168 449483275 457278699 468006343 480916232 495116383 510286748
1170.7 510286748 526458681 543118656 558972180 572986901 585294604 596625090 607039630
1185 607039630 615628779 621671915 625681579 628762662 631258965 632621408 632626653 632275879 632949114
1203.3 632949114 634897888 637190104 639125466 641117752 643876016 647073865 649385214 649943769
1219.7 649943769 649269581 648403406 647505939 645847797 643110633 640146017 638066709 636967301 636038065
1238F36038065j222611q83698L93987J617729J821220J323760J191139J790047K305507
1256.4F44375145J903177R89675P17104J433313K217829K077699J206576O57082Q55684
1274.7F56433284J050890M34458o01470r05157k37643L12507j84894j276970j833796
1293.1F53191209j525641j113653j327395j878441j891613j183331o25610r52840j749694
1311.4F40942991k027810j511693j029849j391828k262831k727627k564133k433002
1327.8F24994218k850413l335297l002584j835406p59721m68015o00577l78847K59757
1346.1F12023115O37949J75953p05243j112699q20816n01692q34286j578212j737237
1364.5F05546832j048267l37601j33037l78907n31971j13964M08589L22879o0976K00332
$$ plain form
1238 636038065 634815454 633931756 634325743 635943472 637764692 639088452 640279591 642069638 644375145
1256.4 644375145 646278322 647267997 647985101 649418414 651636243 653713942 654920518 655577600 656433284
1274.7 656433284 657484174 657918632 657317162 656412005 656174362 656486869 656301975 655025005 653191209
1293.1 653191209 651665568 650551915 649224520 647346079 645454466 644271135 643645525 642692685 640942991
1311.4 640942991 638915181 637403488 636373639 634981811 632718980 629991353 627427220 624994218
1327.8 624994218 622143805 618808508 615805924 613970518 613210797 612742782 612142205 611763358 612023115
1346.1 612023115 612661064 612837017 612131774 611019075 610198259 609696567 608862281 607284069 605546832
1364.5 605546832 604498565 604160964 604027927 603649020 603117049 603003085 603411674 603734553 603673577 603873909
1384.9F03873909J085102J439989O94155n80668j609504j647890j333237j282096j365721
1403.2E99274039j315713p46071j16885k1219j26719K26974J027584J781881J866400
1421.6F01850271J617730J567244J771570J872360J453162Q24451M46856N13554P95126
1439.9F12712324P35402K85685j05262k86698m56214p90119j039684j009405q9824
1458.3F09956205J424611K355873L189027M526019O383479Q619249J0607481R903371
1474.6F56965315P908762O947219O383658N485415M135013L046334K357542J649678
1490.9F94878936Q31187m948q20160j030564p31706o50287j537740l473401l512025
1509.3F83949292k750635k780796k784311k243579j238823q07941j146733j661718
$$ plain form
1384.9 603873909 604959011 606399000 607093155 606512487 604902983 603255093 601921856 600639760 599274039
1403.2 599274039 597958326 597212255 597095370 597074151 596947432 597174406 598201990 599983871 601850271
1421.6 601850271 603468001 605035245 606806815 608679175 610132337 610956788 611403644 611917198 612712324
1439.9 612712324 613447726 613733411 613628149 613341451 612885237 612095118 611055434 610046029 609956205
1458.3 609956205 611380816 613736689 616925716 621451735 627835214 636454463 647061944 656965315
1474.6 656965315 664874077 671821296 678204954 683690369 687825382 690871716 693229258 694878936
1490.9 694878936 695710123 695705175 694885015 693854451 693122745 692472458 690934718 687461317 683949292
1509.3 683949292 681198657 678417861 675633550 673389971 672151148 671343207 670196474 668534756
1525.6F68534756k009392j633823j276612j620233j577676j164853j441241j638114
1541.9F56172812j273215j067281p38084k44021K38061N07414N69165K17378k48730
1560.3F54133499J66714M57346M58420M80651O10352Q63731R68099O30498L07500L54826
1580.7F59431636L14117O676n32747j017988j331329j588940k036036k545952k874434
1599F47825003l076256l303349l681540m248083m928291n221426n052686n652845p004678
1617.4F05655849o254971n516470o433665o839574o859719o819904n747199n024374
1633.7E56159973n540848m503190k303958p71761L92079J142800J531065J747191K258956
1652E50112307L057659L139615L332913M030347M902124N476475N426466N812168O330967
$$ plain form
1525.6 668534756 666525364 664891541 663614929 661994696 660417020 659252167 657810926 656172812
1541.9 656172812 654899597 653832316 653094232 652850211 653088272 653595686 654164851 654382229 654133499
1560.3 654133499 654300213 654757559 655215979 655696630 656306982 657170713 658138812 658769310 659076810 659431636
1580.7 659431636 659745753 659752429 659219682 658201694 656870365 655281425 653245389 650699437 647825003
1599 647825003 644748747 641445398 637763858 633515775 628587484 623366058 618313372 612660527 605655849
1617.4 605655849 599400878 593884408 587450743 580611169 573751450 566931546 561184347 556159973
1633.7 556159973 550619125 546115935 543811977 543040216 543432295 544575095 546106160 547853351 550112307
1652 550112307 553169966 556309581 559642494 563672841 568574965 574051440 579477906 585290074 591621041
1670.4E91621041O023705O431818P050932O615937O340026O992579Q358955P764519
1686.7F47199512O860494P270098P444203Q495688R250999Q398175P982612O360113
1703G09261894N180300M775345L807187L224552L245234L539145L690541L031909K205670
1721.4G41961777J820564J514316R37402K82705l29017j141906j490951j101792j107156
1739.7G41345942p54356O39677K496659M334152N919874O952584P027924P077276O779254
1758.1G81818986N621850M692436L980875L541171L239513K651393K020896J726806
1774.4H09293926J729429J667797J351714J041651J058638J270354J322687J042425
1790.7H19778621P42138Q07047J081287J073957P19011M74095O48618R52422R31800
$$ plain form
1670.4 591621041 597644746 604076564 611127496 617743433 624083459 631076038 639434993 647199512
1686.7 647199512 654060006 661330104 668774307 677269995 686520994 694919169 702901781 709261894
1703 709261894 714442194 719217539 723024726 726249278 729494512 733033657 736724198 739756107 741961777
1721.4 741961777 743782341 745296657 746234059 746516764 746187747 745045841 743554890 742453098 741345942
1739.7 741345942 740591586 741231263 743727922 748062074 753981948 760934532 767962456 775039732 781818986
1758.1 781818986 787440836 792133272 796114147 799655318 802894831 805546224 807567120 809293926
1774.4 809293926 811023355 812691152 814042866 815084517 816143155 817413509 818736196 819778621
1790.7 819778621 820520759 821327806 822409093 823483050 824202061 824676156 825324774 826277196 827208996
1809.1H27208996N99265L83913N73278Q29101P87019N26250L92854N34236P34926O39200
1829.5H33209038K83420J85370M04299O20782N95093L88205J58191J52707L58462L76761
1849.9H36732328J65582N3048K28941M30286L68416J22309N1618K49803L93093K22504
1870.3H39017928o736L3319K82049M65751L65198R6202N245K33352M41671L20673N2511
1892.7H41307163k8431J54435L53873K75731J2756n6982J15573K49982J50621m6909
1913.1H42487812n2512J35482K84552J98782n4717j60694L3497K31088J60098o2645
1933.5H43200743j33455P4447L21269K54511n9425j66595K6822K24352J95682J7106
1953.9H43955457m6193R8765K54929J79708l1949r9539M8578J88648J22547o5744j45137
$$ plain form
1809.1 827208996 827808261 828192174 828765452 829594553 830381572 830907822 831300676 831834912 832569838 833209038
1829.5 833209038 833492458 833677828 834082127 834702909 835298002 835686207 835844398 835997105 836355567 836732328
1849.9 836732328 836897910 836950958 837179899 837610185 837978601 838100910 838152528 838402331 838795424 839017928
1870.3 839017928 839011192 839044511 839326560 839792311 840157509 840253711 840258956 840492308 840933979 841254652 841307163
1892.7 841307163 841278732 841433167 841787040 842062771 842075527 842018545 842134118 842384100 842534721 842487812
1913.1 842487812 842435300 842570782 842855334 843054116 842999399 842838705 842872202 843103290 843263388 843200743
1933.5 843200743 843067288 843141735 843463004 843717515 843658090 843491495 843518317 843742669 843938351 843955457
1953.9 843955457 843909264 844008029 844262958 844442666 844410717 844311178 844359756 844548404 844670951 844605207 844460070
1976.3H44460070j132J81675J57594n7399j70469l7074J23143N6982j52350k13265
1996.7H44347775m0710J34528N4300j65403k56002j56343l7730q4639k67267l72648
2017.1H43155861k63691j03533j32621l22401m13358k74480p9632j06632l20852l89457
2037.5H40749204j86324Q345n8592k53617l09229j27972R5845J00434q2612j63258
2057.9H39772224J1027K19524J78397n2273j57476o914J94550J83761l58r8884M0472
2080.3H40284050K33352J89721k9146j29223K3067K20418K22385O1571k0683J00255
2100.7H41155767K47777K17736L7372n7936O7473K29716K00927O735j35958k4974K08259
2123.2H42152894K15709j4544j50680k7299J58548J71065N961j18435k2292J79828
$$ plain form
1976.3 844460070 844458938 844640613 844798207 844740808 844570339 844533265 844656408 844713390 844561040 844347775
1996.7 844347775 844307065 844441593 844495893 844330490 844074488 843918145 843880415 843795776 843528509 843155861
2017.1 843155861 842892170 842788637 842656016 842333615 841920257 841645777 841566145 841459513 841138661 840749204
2037.5 840749204 840562880 840571225 840512633 840259016 839949787 839821815 839917660 840018094 839935482 839772224
2057.9 839772224 839783251 840002775 840181172 840128899 839971423 839964509 840159059 840342820 840342462 840243578 840284050
2080.3 840284050 840517402 840707123 840677977 840548754 840571821 840792239 841014624 841076195 841055512 841155767
2100.7 841155767 841403544 841621280 841658652 841600716 841668189 841897905 842098832 842105567 841969609 841944635 842152894
2123.2 842152894 842368603 842354059 842203379 842176080 842334628 842505693 842511654 842393219 842370927 842550755
2143.6H42550755K04861J3768r7632M6730K44617K37465N9963j5974J27434K88964
2164H43660951K95400J58191P0035K09749M14014L97086J66357M6253K07663M18663
2184.4H46044362M17411K26736P4625J37389L12566L18170J49369P3910J92404L46422
2204.8H48293364L29018J27613J3113J60456L51071L12150P4565n6982J06573L30091
2225.2H50041032K93076N0187q3685M3988K43068K24829J6510q7082M6551K18809J90377
2247.6H51197660M828r3997K0922J95086J81377L635q1539O3777K66671K17796m2200
2270H51934016j63198M471K05338J34944p4148j30832L6776K51949K58267P5400j2100
2292.5H52520883J37448L27886K87771M5061n4777J76728N02050N69940L38792J44899
$$ plain form
2143.6 842550755 842755616 842769384 842671752 842718482 842963099 843200564 843260527 843244553 843371987 843660951
2164 843660951 843956351 844114542 844184577 844394326 844808340 845205426 845371783 845418036 845625699 846044362
2184.4 846044362 846461773 846688509 846763134 846900523 847213089 847531259 847680628 847754538 847946942 848293364
2204.8 848293364 848622382 848749995 848763108 848923564 849274635 849586785 849661350 849604368 849710941 850041032
2225.2 850041032 850334108 850384295 850300610 850344598 850587666 850812495 850829005 850741923 850788474 851007283 851197660
2247.6 851197660 851202488 851108491 851129413 851324499 851505876 851509511 851427972 851491749 851758420 851976216 851934016
2270 851934016 851770818 851775289 851980627 852115571 852041423 851910591 851947367 852199316 852457583 852532983 852520883
2292.5 852520883 852658331 852986217 853273988 853319049 853264272 853441000 853943050 854512990 854851782 854996681
2312.9H54996681K89977O06119O87480M92752L03149L52443N46097N26428J29700k12073
2333.3H58718753o9320J64807Q1062k49148p75277j335263j053453K7478R94682J338363
2353.6H57842684J180410Q10862J78993m73500r21488j126408j287759j520633j684249
2372H52998912j622617j368940j140356j084268j064062q46565m90844k43366k31743
2390.4H44906151l44813l70085k70486j85966k42353l76284l98755k86639k12252k71618
2410.8H41946900m19557n03600l99113k52723k97547m91023n89847m98474l59595l70383
2431.2H37765038n16474n80967m91976l99292m31955n51164n99861n20289m29690m51863
2451.5H32791507n60522o01649n12183m12285m45485n69999o03855m81367l38257l46601
$$ plain form
2312.9 854996681 855286658 855892777 856580257 857073009 857376158 857728601 858274698 858801126 858930826 858718753
2333.3 858718753 858649433 858814240 858895302 858646154 857870877 856535614 855482161 855509639 856504321 857842684
2353.6 857842684 859023094 859833956 860012949 859539449 858617961 857491553 856203794 854683161 852998912
2372 852998912 851376295 850007355 848866999 847782731 846718669 845872104 845381260 845137894 844906151
2390.4 844906151 844561338 844191253 843920767 843734801 843492448 843116164 842717409 842430770 842218518 841946900
2410.8 841946900 841527343 841023743 840624630 840371907 840074360 839583337 838993490 838495016 838135421 837765038
2431.2 837765038 837248564 836667597 836175621 835776329 835344374 834793210 834193349 833673060 833243370 832791507
2451.5 832791507 832230985 831629336 831117153 830704868 830259383 829689384 829085529 828604162 828265905 827919304
2471.9H27919304m80592n71251n27441m30048m27842n24759n79953m95136l33190k63453
2492.3H23285639l78728n15997m62770l12806k90453m15802n06401m30405k89738k66374
2512.7H19416165l89814n30064n26309m01855l63946m64081n46873m94897l75212l55124
2533.1H14967990m76122o02722n93424m93109m76659n94139o73890n83589m30286l81231
2553.5H09662819n05805o58691o27995m95314m73082n85437o54042n62131m38690m29929
2573.9H04231703n55515o85036o39737m94540m52756n48900o46233n76556l84748l06308
2594.3G98941374m32015o05523o34909n40376n00321n95033o99759o72698n64038n54562
2614.7G93142140o87182q09908q23975p72059p75873q71778r59515r46880q50081q03650
$$ plain form
2471.9 827919304 827438712 826867461 826340020 825909972 825482130 824957371 824377418 823882282 823549092 823285639
2492.3 823285639 822906911 822390914 821928144 821615338 821324885 820909083 820402682 819972277 819682539 819416165
2512.7 819416165 819026351 818496287 817969978 817568123 817204177 816740096 816193223 815698326 815323114 814967990
2533.1 814967990 814491868 813889146 813295722 812802613 812325954 811731815 811057925 810474336 810044050 809662819
2553.5 809662819 809157014 808498323 807870328 807375014 806901932 806316495 805662453 805100322 804661632 804231703
2573.9 804231703 803676188 802991152 802351415 801856875 801404119 800855219 800208986 799632430 799247682 798941374
2594.3 798941374 798509359 797903836 797268927 796728551 796228230 795633197 794933438 794260740 793696702 793142140
2614.7 793142140 792454958 791645050 790821075 790049016 789273143 788401365 787441850 786494970 785644889 784841239
2635.1G84841239q81075r98021j023590r25720q48889r17256j016438r73880q10087
2653.5G76446283p53760r06170j038074r90868q55267p88331q56102r50634q96216
2671.8G68410861p15255o47843p49350q67843q94249p90715o84679p26878q29935q32737
2692.2G60671377p43866o85572p48694q95143r49204q54850q08537r01341r74000r29653
2712.6G52180517q45492q18134q87155r84013r69827q48890p84218q36313q94248q48353
2733G43463874p08819o28590p00236p97927p81894o72578o08981o86050p79688p26879
2753.4G36372232n87284n23865n92172o77705o63400n97596n95629o72639p59601p88033
2773.8G29914308p37489p07268q02398r45270r70245q97586r20415j078725j199364
$$ plain form
2635.1 784841239 783960164 782962143 781938553 781012833 780163944 779246688 778230250 777256370 776446283
2653.5 776446283 775692523 774786353 773748279 772757411 771902144 771113813 770257711 769307077 768410861
2671.8 768410861 767695606 767047763 766298413 765430570 764536321 763745606 763060927 762334049 761504114 760671377
2692.2 760671377 759927511 759241939 758493245 757598102 756648898 755794048 754985511 754084170 753110170 752180517
2712.6 752180517 751335025 750516891 749629736 748645723 747675896 746827006 746042788 745206475 744312227 743463874
2733 743463874 742755055 742126465 741426229 740628302 739846408 739173830 738564849 737878799 737099111 736372232
2753.4 736372232 735784948 735261083 734668911 733991206 733327806 732730210 732134581 731461942 730702341 729914308
2773.8 729914308 729176819 728469551 727667153 726721883 725751638 724854052 723933637 722854912 721655548
2792.2G21655548j176954j121282j190007j361489j480937j490772j471043j519680
2808.5G10843384j670301j814544j832247j812160j892388k058804k218484k314866
2824.8F95229590k375364k494336k742409k994180l139198l344536l837585m671216
2841.1F69630766n670428o651104p481098p820189p202983n458534k995431o96838
2857.4F25654161O56784Q60810J93953q60870j913785k695799k993405k896965k674162
2875.8F13330722k489925k462685k549648k572477k495050k376914k287746k255082
2892.1E93841195k189338k144575k252579k437353k693236l118157l656447m282236
2908.4E71067274n062461n949736o818771p438720p504165o902039n630672l801286
$$ plain form
2792.2 721655548 720478594 719357312 718167305 716805816 715324879 713834107 712363064 710843384
2808.5 710843384 709173083 707358539 705526292 703714132 701821744 699762940 697544456 695229590
2824.8 695229590 692854226 690359890 687617481 684623301 681484103 678139567 674301982 669630766
2841.1 669630766 663960338 657309234 649828136 642007947 634804964 629346430 626350999 625654161
2857.4 625654161 626310945 627171755 627365708 626504838 624591053 621895254 618901849 616004884 613330722
2875.8 613330722 610840797 608378112 605828464 603255987 600760937 598384023 596096277 593841195
2892.1 593841195 591651857 589507282 587254703 584817350 582124114 579005957 575349510 571067274
2908.4 571067274 566004813 560055077 553236306 545797586 538293421 531391382 525760710 521959424
2924.7E21959424j704395L73900K237082L891408N338073O403148P014990P204950
2941E52718580O945729O300449N430580M494845L689290L116011K852261K994359L439009
2959.4E91981113L984868M466832M820645N078197N190908N110205M894495M606187
2975.7F30133450M323006M032075L612280L115714K698004K363860K018273J573325
2992F53869987J016616M72904l0101n72264j075387j437366j569331j349806q90792
3010.4F48434460m84764k44081j08540r2686k52723n44966q96036j209736j378119
3028.7F43222809j459301j549184j701355j886964j911461j820624j890242k081454
3045.1F28922224k158761k123356k130210k191842k205014k166152k131343k089560
$$ plain form
2924.7 521959424 520255029 520628929 522866011 526757419 532095492 538498640 545513630 552718580
2941 552718580 559664309 565964758 571395338 575890183 579579473 582695484 585547745 588542104 591981113
2959.4 591981113 595965981 600432813 605253458 610331655 615522563 620632768 625527263 630133450
2975.7 630133450 634456456 638488531 642100811 645216525 647914529 650278389 652296662 653869987
2992 653869987 654886603 655359507 655329406 654757142 653681755 652244389 650675058 649325252 648434460
3010.4 648434460 647949696 647705615 647597075 647504389 647251666 646706700 645810664 644600928 643222809
3028.7 643222809 641763508 640214324 638512969 636626005 634714544 632893920 631003678 628922224
3045.1 628922224 626763463 624640107 622509897 620318055 618113041 615946889 613815546 611725986
3061.4F11725986k046347k017319k018452k064704k063871j988351j892805j822770
3077.7E95811367j874685j997113k054751k062977k037942j998604k033352k083898
3094E79668045k053142j999437j985848k038002k102256k096236k097189k184332k189636
3112.4E60921967k051711k023339k172530k353668k441287k362013k263129k276182
3128.7E42978108k312064k330661k343595k303183k259255k344668k460897k431094
3145E24192691k327264k234220k179801k295077k513171k536714k386331k309323k323269
3163.4E03087521k301634k243757k231926k251893k267510k275824k266258k233595
3179.7D85015124k217889k194553k142966k119482k121180k113909k077251k051264
$$ plain form
3061.4 611725986 609679639 607662320 605643868 603579164 601515293 599526942 597634137 595811367
3077.7 595811367 593936682 591939569 589884818 587821841 585783899 583785295 581751943 579668045
3094 579668045 577614903 575615466 573629618 571591616 569489360 567393124 565295935 563111603 560921967
3112.4 560921967 558870256 556846917 554674387 552320719 549879432 547517419 545254290 542978108
3128.7 542978108 540666044 538335383 535991788 533688605 531429350 529084682 526623785 524192691
3145 524192691 521865427 519631207 517451406 515156329 512643158 510106444 507720113 505410790 503087521
3163.4 503087521 500785887 498542130 496310204 494058311 491790801 489514977 487248719 485015124
3179.7 485015124 482797235 480602682 478459716 476340234 474219054 472105145 470027894 467976630
3196D67976630k037138j997888j961678j911164j853376j863659j879841j842767j810849
3214.3D50818270j790285j777857j767516j762689j772552j755387j697600j613825
3230.7D36880559j565188j678855j832068j799732j693994j634389j597643j596063
3247D23482627j626224j630067j571984j513630j490056j490057j509607j495540j438737
3265.3D09716725j354515j252651j268089j371652j377136j319289j271516j213670
3281.6C99288207j181066j166790j094014r79453r52542j059413j170069j194775j127631
3300C89362454r87589r02474r87708j160831j260519j254588j205683j190394j205325
3318.4C79207343j200050j186490j201004j268149j328438j338691j349359j315326
$$ plain form
3196 467976630 465939492 463941604 461979926 460068762 458215386 456351727 454471886 452629119 450818270
3214.3 450818270 449027985 447250128 445482612 443719923 441947371 440191984 438494384 436880559
3230.7 436880559 435315371 433636516 431804448 430004716 428310722 426676333 425078690 423482627
3247 423482627 421856403 420226336 418654352 417140722 415650666 414160609 412651002 411155462 409716725
3265.3 409716725 408362210 407109559 405841470 404469818 403092682 401773393 400501877 399288207
3281.6 399288207 398107141 396940351 395846337 394866884 393914342 392854929 391684860 390490085 389362454
3300 389362454 388374865 387472391 386484683 385323852 384063333 382808745 381603062 380412668 379207343
3318.4 379207343 378007293 376820803 375619799 374351650 373023212 371684521 370335162 369019836
3334.7C69019836j220882j269638j452506j495182j460970j419812j287043j330465
3351C58083338j589001j675784j536459j400411j386404j425445j347929j240343j345158
3369.3C45136404j593351j635701j403689j228631j202851j193255j115919r92983
3385.7C34770024q39502o24746o24180q84890r18508n95569l98875o56545r42260p58082
3406.1C27526867m28766l37511l51429l80516l92616k86400j87039j61380m4823J76937
3426.5C25133324L74496L94702M33743O05940N13822K18302K34962N58018Q17568Q48352
3446.8C30133229P64698Q47251J064121J173318J217037J291990J264394J249313J476526
3465.2C40481877J686752J512528J164883J161754J430839J702846J766145J552939
$$ plain form
3334.7 369019836 367798954 366529316 365076810 363581628 362120658 360700846 359413803 358083338
3351 358083338 356494337 354818553 353282094 351881683 350495279 349069834 347721905 346481562 345136404
3369.3 345136404 343543053 341907352 340503663 339275032 338072181 336878926 335763007 334770024
3385.7 334770024 333930522 333305776 332681596 331796706 330878198 330282629 329883754 329227209 328284949 327526867
3406.1 327526867 327098101 326760590 326409161 326028645 325636029 325349629 325162590 325001210 324956387 325133324
3426.5 325133324 325507820 325902522 326336265 326942205 327456027 327674329 327909291 328467309 329284877 330133229
3446.8 330133229 330897927 331745178 332809299 333982617 335199654 336491644 337756038 339005351 340481877
3465.2 340481877 342168629 343681157 344846040 346007794 347438633 349141479 350907624 352460563
3481.5C52460563J516551J723915J722426J627802J749814J909137J982867J965344
3497.8C66658419J932949J945466J865506J785994J888066K077818K237201K245963
3514.2C82637382K144306K170712K351403K549679K487242K248019K237975K456814
3530.5D01283532K664239K819448K856851K758145K858997L116727L148257K915204
3546.8D24421400K849877L082245L290803L385484L504365L659517L770947L778577
3563.1D51743215L707379L892571M200757M205137M194528M372418M529566M679411
3579.4D85524982M877031M947066M837722M755139M844845M892051M965246N123496
3595.7E24767578N226433N201042N140721N094707M953266M942655N091667N153299
$$ plain form
3481.5 352460563 353977114 355701029 357423455 359051257 360801071 362710208 364693075 366658419
3497.8 366658419 368591368 370536834 372402340 374188334 376076400 378154218 380391419 382637382
3514.2 382637382 384781688 386952400 389303803 391853482 394340724 396588743 398826718 401283532
3530.5 401283532 403947771 406767219 409624070 412382215 415241212 418357939 421506196 424421400
3546.8 424421400 427271277 430353522 433644325 437029809 440534174 444193691 447964638 451743215
3563.1 451743215 455450594 459343165 463543922 467749059 471943587 476316005 480845571 485524982
3579.4 485524982 490402013 495349079 500186801 504941940 509786785 514678836 519644082 524767578
3595.7 524767578 529994011 535195053 540335774 545430481 550383747 555326402 560418069 565571368
3612.1E65571368N135715M998147M976571N135059M943371M639506M475177M540026
3628.4F04414940M704118M459500M325628M348815M216253M062772M029036L987312
3644.7F38548374L855288L807605L780901L539681L378392L533542L530204L211916
3661F67185903L009319L016293K906024K731145K720952K511799K291203K393067K398133
3679.4F91163838K319634K346575K386034K387941K090811J716197J766860J892865
3695.7G08070755J835048J672268J524985J497507J529753J464725J228630J026333
3712G19850004J179635J361311J349032J274407J157105R96291R77934J125097J148581
3730.3G30419397J038432Q96991Q59082R58204Q74936N21243M49777R30309R72271
$$ plain form
3612.1 565571368 570707083 575705230 580681801 585816860 590760231 595399737 599874914 604414940
3628.4 604414940 609119058 613578558 617904186 622253001 626469254 630532026 634561062 638548374
3644.7 638548374 642403662 646211267 649992168 653531849 656910241 660443783 663973987 667185903
3661 667185903 670195222 673211515 676117539 678848684 681569636 684081435 686372638 688765705 691163838
3679.4 691163838 693483472 695830047 698216081 700604022 702694833 704411030 706177890 708070755
3695.7 708070755 709905803 711578071 713103056 714600563 716130316 717595041 718823671 719850004
3712 719850004 721029639 722390950 723739982 725014389 726171494 727167785 728145719 729270816 730419397
3730.3 730419397 731457829 732354820 733213902 734172106 735047042 735568285 736018062 736948371 737920642
3748.7G37920642O11663N64694P93100Q80897P72237O83248P04766P28488P24733O14523
3769.1G44998991M83513N48184P03931P83205O99222N04077M11868M95374N96583O15120
3789.5G50840068O05106N63443N46575O19053N40018L73126M59253M91381M27961M74036
3809.9G55940020N10395M51803M24981M95434L57687K59936M13835M54784M62710M70102
3830.3G60241687M20034M33684L66091J90258K09630L05235L57449M77612N67139L92615
3850.7G63961434j04367j31905M52876N83946L91841K18690K22146L21150K50280J88708
3871.1G66354799K44916K87235L32593K91169K60115L08811K51234K22325K43724J22964
3891.5G68919885R4414K41518K94566K07484N1796k0861J29342K72393K41995J97053
$$ plain form
3748.7 737920642 738532305 739096999 739890099 740770996 741543233 742226481 742931247 743659735 744384468 744998991
3769.1 744998991 745482504 746030688 746734619 747517824 748217046 748721123 749132991 749628365 750224948 750840068
3789.5 750840068 751445174 752008617 752555192 753174245 753714263 754087389 754546642 755038023 755465984 755940020
3809.9 755940020 756450415 756902218 757327199 757822633 758180320 758440256 758854091 759308875 759771585 760241687
3830.3 760241687 760661721 761095405 761461496 761651754 761861384 762166619 762524068 763001680 763568819 763961434
3850.7 763961434 763857067 763725162 764178038 764761984 765153825 765372515 765594661 765915811 766166091 766354799
3871.1 766354799 766599715 766886950 767219543 767510712 767770827 768079638 768330872 768553197 768796921 768919885
3891.5 768919885 769014299 769255817 769550383 769757867 769809663 769788802 769918144 770190537 770432532 770629585
3911.9G70629585J91808J12056M9770J45018J83940J22369J77800K45512J63495Q6844
3932.3G72108197P9036O6817J09374J67966J60515J37270J04427R5606J27971J42515
3952.7G73299694J29640P7248O6817J39474J82152J43230P9215N5074O8665J26362
3973.1G74367571J56164J05560Q1122J11818J44065J37925J27196J16587Q4817J02639
3993.4G75535464J20938P2241
3997.5G75728643
$$ plain form
3911.9 770629585 770821393 770933449 770983219 771128237 771312177 771434546 771612346 771857858 772021353 772108197
3932.3 772108197 772187233 772254050 772363424 772531390 772691905 772829175 772933602 773029208 773157179 773299694
3952.7 773299694 773429334 773506582 773573399 773712873 773895025 774038255 774117470 774172544 774241209 774367571
3973.1 774367571 774523735 774629295 774710417 774822235 774966300 775104225 775231421 775348008 775432825 775535464
3993.4 775535464 775656402 775728643
3997.5 775728643
##END=$$ End of the data block
