##TITLE=$$ Begin of the data block
##JCAMP-DX=5.00 $$ ACD/SpecManager v 10.08
##SPECTROMETER/DATA SYSTEM=Alpha
##DATE=23 Dec 2014 09:14:34
##DATA TYPE=INFRARED SPECTRUM
##DATA CLASS=XYDATA
##ORIGIN=
##OWNER=
##NPOINTS=1765
##FIRSTX=399.76428223
##LASTX=3997.64306641
##MAXX=3997.64306641
##MINX=399.76428223
##MAXY=0.84460580
##MINY=0.36046189
##XFACTOR=1.0000000000
##YFACTOR=1.000000000000000e-9
##FIRSTY=0.62716204
##DELTAX=2.03961372
##XUNITS=1/CM
##YUNITS=ARBITRARY UNITS
##XYDATA=(X++(Y..Y))
399.8F27162039m936099m263222k858222o62565R23336J400113J154184J088679J348496
$$ 627162039 622225940 617962718 615104496 614441931 615365267 616765380 617919564 619008243 620356739
418.1F20356739j31369k178311l199697l667951k748549j570820j793683k746224k501846
$$ 620356739 620225370 618047059 614847362 611179411 608430862 606860042 605066359 602320135 599818289
436.5E99818289k36273K553702L917456L543436K845109K541005K147198J182854N901
$$ 599818289 599582016 602135718 606053174 609596610 612441719 614982724 617129922 618312776 618318677
454.8F18318677n80311n88417q23498k167403l563822l366410k081216j533627k538681
$$ 618318677 617738366 617149949 616326451 614159048 610595226 607228816 605147600 603613973 601075292
473.2F01075292l400922k608478r22919K10762R2626o70195p93337l7790K58863p64191
$$ 601075292 597674370 595065892 594142973 594353735 594446361 593776166 592982829 592945039 593203902 592439711
493.6E92439711k092600k340257j511395r74953j623631k814531l437221k926052k281904
$$ 592439711 590347111 588006854 586495459 585520506 583896875 581082344 577645123 574719071 572437167
511.9E72437167k674758l841341m530012l680766k232254j529574j435041q65996N14745
$$ 572437167 569762409 565921068 561391056 557710290 555478036 553948462 552513421 551647425 552162170
530.3E52162170J798690K399921K726317L530204M648924M808545L368735J292348
$$ 552162170 553960860 556360781 559087098 562617302 567266226 572074771 575443506 576735854
546.6E76735854j30236p00951r65476j565814k802372l961205m102111l866136m455566
$$ 576735854 576605618 575904667 574939191 573373377 570571005 566609800 562507689 558641553 554185987
565E54185987n732894o350100n112470k596140k84254J345932K966881M979193O627202
$$ 554185987 548453093 542102993 536990523 534394383 534110129 535456061 538422942 543402135 550029337
583.3E50029337O861747N601883L938257K765060J820683R25303J73151m61578n68986
$$ 550029337 556891084 562492967 566431224 569196284 571016967 571942270 572115421 571653843 571084857
601.7E71084857n424M71473L78370L00109P80344J555860K185405K508700K680897
$$ 571084857 571079433 571550906 571929276 572229385 573009729 574565589 576750994 579259694 581940591
620E81940591L094673L648460L670395L067076K364934K016425J944184J686394J246572
$$ 581940591 585035264 588683724 592354119 595421195 597786129 599802554 601746738 603433132 604679704
638.4F04679704R77993R49740J009703J014709J020074J072645J071215R46045Q25286
$$ 604679704 605657697 606607437 607617140 608631849 609651923 610724568 611795783 612741828 613567114
656.8F13567114R30071J051843J008153Q14438O57379J082063J441360J339137J266182
$$ 613567114 614497185 615549028 616557181 617371619 618028998 619111061 620552421 621891558 623157740
675.1F23157740J191496J162947J316011J453280J230717P10010K26438J0729k52306
$$ 623157740 624349236 625512183 626828194 628281474 629512191 630222201 630448639 630459368 630207062
693.5F30207062r37045j854539k544224k680242k324522j771688j123130k27929J087428
$$ 630207062 629270017 627415478 624871254 622191012 619866490 618094802 616971672 616743743 617831171
711.8F17831171K555728L509402L788471M009843M542827N129695N301238M706323
$$ 617831171 620386899 623896301 627684772 631694615 636237442 641367137 646668375 651374698
728.1F51374698L754794L240228L242075L060580K080142P58291J430k50816q41201
$$ 651374698 655129492 658369720 661611795 664672375 666752517 667510808 667512238 667261422 666420221
746.5F66420221k111435l456294l979445l661215l378689l516674l477335k582789
$$ 666420221 664308786 660852492 656873047 653211832 649833143 646316469 642839134 640256345
762.8F40256345q44717J084626K629161L811002N082249O660283P908404P857501O540299
$$ 640256345 639411628 640496254 643125415 646936417 652018666 658678949 666587353 674444854 680985153
781.2F80985153N202889M694820M553139M034400L072858K478659K933621L907442
$$ 680985153 686188042 690882862 695436001 699470401 702543259 705021918 707955539 711862981
797.5G11862981M239858L489553K480507K258242K633392K493263J469969M78268L54528
$$ 711862981 716102839 719592392 722072899 724331141 726964533 729457796 730927765 731406033 731760561
815.8G31760561P42138P46310j29462j374721k029121k055347k360225l475725m732311
$$ 731760561 732502699 733249009 733119547 731744826 729715705 727660358 725300133 721824408 717092097
834.2G17092097n049765m290760l441751l302872l617823l575444k989710k552092
$$ 717092097 712042332 707751572 704309821 701006949 697389126 693813682 690823972 688271880
850.5F88271880k924025l952205m623592l914058j429737K232254N468011P441282
$$ 688271880 685347855 681395650 676772058 672858000 671428263 673660517 679128528 686569810
866.8F86569810Q945525J0151147R869695P649541M626274K091646J96696j682520
$$ 686569810 695515335 705666482 715536177 723185718 727811992 729903638 730100334 728417814
883.2G28417814l795386n492091o011247n449713m735410m605472m862070m823625
$$ 728417814 724622428 719130337 713119090 707669377 702933967 698328495 693466425 688642800
899.5F88642800m366696m244745n037546o402254p559896q125364q382500q664846
$$ 688642800 684276104 680031359 674993813 668591559 661031663 652906299 644523799 635858953
915.8F35858953q628607p558703n430162l088176j410783n97000l5465R63927K283632
$$ 635858953 627230346 619671643 614241481 611153305 609742522 609145522 609110057 610073984 612357616
934.1F12357616L281355L677547L778696L692091K710581M8458l943145p854462j0585844
$$ 612357616 615638971 619316518 623095214 626787305 629497886 629546344 625603199 617748737 607162893
952.5F07162893j2146056j3213217j4263272j5260995j6011774j6447783j6755640
$$ 607162893 595016837 581803620 567540348 552279353 536267579 519819796 503064156
966.8E03064156j7207593j7731309j7871827j7337024j6244382j4741838j2841254
$$ 503064156 485856563 468125254 450253427 432916403 416672021 401930183 389088929
981.1C89088929j0526777p886350n255282l049761j479327m29541M38600J187683J618802
$$ 389088929 378562152 370675802 365420520 362370759 360891432 360461891 360900491 362088174 363706976
999.4C63706976J615107J244307P16030K11329j87457m46021m23104n156P42138J598060
$$ 363706976 365322083 366566390 367282420 367493749 367306292 366860271 366437167 366432011 367174149 368772209
1019.8C68772209K309739K798021L189147L539979L748298L659427L124297K293110
$$ 368772209 371081948 373879969 377069116 380609095 384357393 388016820 391141117 393434227
1036.1C93434227J526147J017600P58260P10160Q43167J274675K210021L526092M845589
$$ 393434227 394960374 395977974 396736234 397446394 398289561 399564236 401774257 405300349 410145938
1054.5D10145938N947143O935060Q039952R245216R761304Q049637L097981l765076
$$ 410145938 416093081 423028141 431068093 440313309 450074613 458124250 461222231 457457155
1070.8D57457155r058952j0183245p750124m218459j132399J248062K940237M009903
$$ 457457155 448398203 438214958 430464834 426246375 425113976 426362038 429302275 433312178
1087.1D33312178M697084N212069N548000N472928M661501L171295J586854O36339
$$ 433312178 438009262 443221331 448769331 454242259 458903760 462075055 463661909 464298248
1103.4D64298248P02650J537114K478838L119141L485352L576904L254503K538294
$$ 464298248 465000898 466538012 469016850 472135991 475621343 479198247 482452750 484991044
1119.8D84991044J757920J383215J757085K789706L882170M264444L530323J789034
$$ 484991044 486748964 488132179 489889264 492678970 496561140 500825584 504355907 506144941
1136.1E06144941o55830l367841n692184p065118p345199o792605n827069m727096
$$ 506144941 505489111 502121270 496429086 489363968 482018769 475226164 469399095 464671999
1152.4D64671999l551870k204925p34538O21885J889616L328800N075723O973476Q711338
$$ 464671999 461120129 458915204 458180666 458802551 460692167 464020967 469096690 476070166 484781504
1170.7D84781504J0013699J0782898J1209428J1574864J1804045J1586308J0849238
$$ 484781504 494795203 505578101 516787529 528362393 540166438 551752746 562601984
1185E62601984R767949Q570910P277786N758286M108488K730370J997471J871824J951039
$$ 562601984 572369933 580940843 588218629 593976915 598085403 600815773 602813244 604685068 606636107
1203.4F06636107J962900K129436K774536L754199M541874M698336M239142L543198
$$ 606636107 608599007 610728443 613502979 617257178 621799052 626497388 630736530 634279728
1219.7F34279728K831221J982986Q69275k96355j056194j231074j134575j177787j366437
$$ 634279728 637110949 639093935 639963210 639666855 638610661 637379587 636245012 635067225 633700788
1238.1F33700788j344323q61228o1810O68705J076579J287162J546264J788318J708925
$$ 633700788 632356465 631495237 631433427 632102132 633178711 634465873 636012137 637800455 639509380
1256.4F39509380J217663O94990N97596R97246J565873J868368J783847J506031J185775
$$ 639509380 640727043 641422033 642019629 643016875 644582748 646451116 648234963 649740994 650926769
1274.8F50926769P57158J32441m88520p60138o55233n02706n75602q52585j151681
$$ 650926769 651683927 651816368 651327848 650567710 649912477 649409771 648834169 647981584 646829903
1293.1F46829903j309812j353800j457632j606285j630307j507163j339197j157045
$$ 646829903 645520091 644166291 642708659 641102374 639472067 637964904 636625707 635468662
1309.4F35468662r99689r19521q31604p24197q34465j372635k263010l258884m046380
$$ 635468662 634468973 633549452 632717848 631993651 631159186 629786551 627523541 624264657 620218277
1327.8F20218277m425168m436076m120528l424705k416849j315534m34279M6551K36750
$$ 620218277 615793109 611357033 607236505 603811800 601394951 600079417 599645138 599691689 599928439
1346.2E99928439K22921L7015k42889n61417q43465r90271r62615q59321p74681p04587
$$ 599928439 600151360 600188375 599945486 599384069 598540604 597550333 596587718 595728397 594953716 594249129
1366.6E94249129n28753j22904L91662P71761P62045N94974O15060J064479K167583
$$ 594249129 593720376 593597472 593989134 594760895 595522940 596117914 596732974 597797453 599965036
1384.9E99965036L650546M098535L196835K299547J441419L56675n29766r12965j046598
$$ 599965036 603615582 607714117 610910952 613210499 614651918 615008593 614478827 613565862 612519264
1403.3F12519264j293301j523912j675487j746297j554966j208722j030207r64284
$$ 612519264 611225963 609702051 608026564 606280267 604725301 603516579 602486372 601522088
1419.6F01522088n88775n0604L67939O47724Q68797R83298J067579J459956J709700
$$ 601522088 600933313 600882709 601250648 601898372 602767169 603750467 604818046 606278002 607987702
1437.9F07987702J330316J146734J034856P25269J80602n01871j000106j236797j699388
$$ 607987702 609318018 610464752 611499608 612224877 612405479 611903608 610903502 609666705 607967317
1456.3F07967317j931965q11041K85387J425147K600074L424824M879593P540226Q313656
$$ 607967317 606035352 605224311 605509698 606934845 609534919 612959743 617839336 625379562 633693218
1474.7F33693218P117808O415725O176472N959630N352735N114734N342484N023896
$$ 633693218 640811026 647226751 653403223 659362853 664715588 669830322 675172806 680196702
1491F80196702L860474L491044L908336L608227K895951K493739K757431L376901K431452
$$ 680196702 684057176 687548220 691456556 695064783 697960734 700454473 703211904 706588805 709020257
1509.3G09020257J767933J860857J938999J950026J814663J900673J722813J323700
$$ 709020257 710788190 712649047 714588046 716538072 718352735 720253408 721976221 723299921
1525.6G23299921J215875J088321J149714J308799J092314R01938J032054O19769K51472
$$ 723299921 724515796 725604117 726753831 728062630 729154944 730056882 731088936 731708705 731960177
1544G31960177K56062J97649J69337K16186L30150M25279K16961o17504n74291k61187
$$ 731960177 732216239 732413888 732583225 732799411 733129561 733554840 733771801 733154297 732580006 732318819
1564.4G32318819j47164l00169o08743n47230m12941o38604q50141q77321r73463r95517
$$ 732318819 732171655 731871486 731262743 730715513 730302572 729663968 728813827 727936506 726963043 725967526
1584.8G25967526j081764j344443j684606j867890j950502k033890k182424k479076
$$ 725967526 724885762 723541319 721856713 719988823 718038321 716004431 713822007 711342931
1601.1G11342931k688825k691925k758860l118814l390789l331661l629386m220665
$$ 711342931 708654106 705962181 703203321 700084507 696693718 693362057 689732671 685512006
1617.4F85512006l438115k969682l542304l519476l200411l009916k370834j829684
$$ 685512006 682073891 679104209 675561905 672042429 668842018 665832102 663461268 661631584
1633.7F61631584j793980j364470o94931k87413R3400O86109J226306J172305J755833
$$ 661631584 659837604 658473134 657778203 657490790 657584190 658270299 659496605 660668910 662424743
1652.1F62424743K798140K094925K010941K683222L360034L411531K959073L482878
$$ 662424743 665222883 667317808 669328749 672011971 675372005 678783536 681742609 685225487
1668.4F85225487M345178L830672L763020M068792L685355L582477M195214N174696
$$ 685225487 689570665 693401337 697164357 701233149 704918504 708500981 712696195 717870891
1684.7G17870891M055321L188074L445327L185868L188611L144919K698541K808094
$$ 717870891 721926212 725114286 728559613 731745481 734934092 738079011 740777552 743585646
1701.1G43585646K163828J573801J420676J270354J380205J555324J644373J688242
$$ 743585646 745749474 747323275 748743951 750014305 751394510 752949834 754594207 756282449
1717.4G56282449J364648J140416J359343J611591J610934J660228J799166K242327
$$ 756282449 757647097 758787513 760146856 761758447 763369381 765029609 766828775 769071102
1733.7G69071102K180755J548529J614034J908243K067029K152264K063454K024889
$$ 769071102 771251857 772800386 774414420 776322663 778389692 780541956 782605410 784630299
1750G84630299K069175J922786J868725J770317J481176J477539J502753J409590J300395
$$ 784630299 786699474 788622260 790490985 792261302 793742478 795220017 796722770 798132360 799432755
1768.4G99432755J094996R75967R84430R61304Q72910P26879O46829P85053R53495
$$ 799432755 800527751 801503718 802488148 803449452 804322362 805049241 805696070 806481123 807434618
1786.7H07434618Q67606O81281O10292O41703P70927P93874N92768M56810N66006P84099
$$ 807434618 808302224 808983505 809593797 810235500 811006427 811800301 812393069 812849879 813415885 814199984
1807.1H14199984Q43942O11127L31759L58403O14762P53284N71370L23534L30388N24044
$$ 814199984 815043926 815655053 815986812 816345215 816959977 817713261 818284631 818608165 818938553 819462597
1827.5H19462597O42836M74334J85430J30952L54409N43058M59254J91629R53J49548
$$ 819462597 820105433 820579767 820765197 820896149 821250558 821793616 822252870 822444499 822445452 822595000
1847.9H22595000M20392M03941Q1479q6963J07229L71635L66509J52111l398Q9288
$$ 822595000 823015392 823419333 823500812 823413849 823521078 823892713 824259222 824411333 824407935 824497223
1868.3H24497223L45707L93152J72615l4571P1824L60251M87506L22640P2241P5340
$$ 824497223 824842930 825236082 825408697 825374126 825445950 825806201 826293707 826616347 826688588 826763928
1888.7H26763928L26633M54128K70486j6808m8995J94072L58641K33949l8863j33335
$$ 826763928 827090561 827544689 827815175 827798367 827749372 827943444 828302085 828536034 828497171 828363836
1909.1H28363836P5757L01183K64108Q642j47640J5795K87831K90215K3901j45018
$$ 828363836 828439593 828740776 829004884 829013526 828865886 828881681 829169512 829459727 829483628 829338610
1929.5H29338610m17K87652L16501M6491j62363o9797K03729L16739J43945p7605m0949
$$ 829338610 829338193 829625845 829942346 829988837 829826474 829756677 829960406 830277145 830421090 830343485 830302536
1951.9H30302536K25485L86059K34068m3571r2209J51515L51966K17497p9989j30415
$$ 830302536 830528021 830914080 831148148 831104577 831012368 831163883 831515849 831733346 831653357 831522942
1972.3H31522942J00910L03865K50816J0192j23381j0550J69396J69754j4543j71662
$$ 831522942 831623852 831927717 832178533 832188725 832065344 832054794 832224190 832393944 832379401 832207739
1992.7H32207739r0778J40667J89364m1186k53618j96040O0O5207j00434l31103l79324
$$ 832207739 832116961 832257628 832446992 832405806 832152188 831956148 831956208 832021415 831920981 831589878 831210554
2015.2H31210554k45035j96099l89755o62088o32406j57833J76013j0670l29136m38333
$$ 831210554 830965519 830769420 830379665 829717577 829085171 828927338 829103351 829092681 828763545 828325212
2035.6H28325212l25620j51813j26004k84672l95656k64883k0087M1664j04547j99317
$$ 828325212 827999592 827847779 827721775 827437103 827041447 826776564 826756477 826798141 826693594 826494277
2056H26494277j07170P3016J49310M4584r3341p5459O6578J59740Q2255p7427r6619
$$ 826494277 826387107 826460123 826609433 826654017 826560676 826485217 826551795 826711535 826793790 826716363 826619744
2078.4H26619744N7876K02597J65402m529p7665M2498K02060K12013O9082l1888L3438
$$ 826619744 826677620 826880217 827045619 827041090 826963425 827005923 827207983 827419996 827489078 827457190 827490628
2100.8H27490628J91509K53201J38760K6166L8922J33276J81854Q6844n1797o1214
$$ 827490628 827682137 827935338 828074098 828100264 828139186 828272462 828454316 828541160 828489363 828428149
2121.2H28428149P1764J58131P1049n7161o1452L8087J32084J06394l6001j16169k1220
$$ 828428149 828499913 828658044 828729093 828671932 828610480 828648567 828780651 828887045 828851044 828734875 828713655
2143.7H28713655J39237J90437P7367n9307k5094J49250K62380K18392J29044J29818
$$ 828713655 828852892 829043329 829120696 829061389 829036295 829185545 829447925 829666317 829795361 829925179
2164.1H29925179K28405L33608L76701L30746K67863L55661M84944M33445K83122K20001
$$ 829925179 830153584 830487192 830863893 831194639 831462502 831818163 832303107 832736552 833019674 833239675
2184.5H33239675K93552M19558M31060K83182J67847K50280M27246M45127K81215J63734
$$ 833239675 833533227 833952785 834383845 834667027 834834874 835085154 835512400 835957527 836238742 836402476
2204.8H36402476K38478L93331M33445L17216J72615J76966L24249M20988L16501J24812
$$ 836402476 836640954 837034285 837467730 837784946 837957561 838134527 838458776 838879764 839196265 839321077
2225.2H39321077R6381K58505L86000K91824P4983n96J34468K89380L00348J49667
$$ 839321077 839417458 839675963 840061963 840353787 840428770 840428174 840562642 840852022 841152370 841302037
2245.6H41302037K1219J03891K47479K33173J00076K1399Q5055K31743L04580J97470
$$ 841302037 841323256 841427147 841674626 841907799 842007875 842029274 842114329 842346072 842650652 842848122
2266H42848122J0848K980J98663L09229K18629Q7202J13189K73168L02136P9751j18732
$$ 842848122 842858970 842861950 843060613 843369842 843588471 843675673 843788862 844062030 844364166 844443917 844325185
2288.5H44325185l3975J58251J56342o8604k28048j89185j01566l0577m5538j87457
$$ 844325185 844291210 844449461 844605803 844537199 844309151 844119966 844018400 843987823 843942285 843754828
2308.9H43754828k88785j68263K5451m8220l46005n16713l79264j13726p5460k53498
$$ 843754828 843466043 843297780 843323231 843275011 842929006 842412293 842033029 841919303 841843843 841590345
2329.3H41590345l67820l23475j80244r4056j68860k55466o6459M29869N49078o795
$$ 841590345 841222525 840899050 840718806 840624750 840455890 840200424 840133965 840563834 841112912 841106117
2349.7H41106117o73652r21190p18355l92794j38462n0902P2062L02314M68672M84109
$$ 841106117 840432465 839511275 838792920 838400126 838261664 838210762 838282824 838585138 839053810 839537919
2370.1H39537919L14712K13504M00603O15120N59687L13700J08182K0146K5273J4305
$$ 839537919 839852631 840066135 840466738 841081858 841641545 841955245 842063427 842083573 842108846 842123151
2390.4H42123151j26600k77639k45869r7454m7147j67906l13103k97487j92940j86980
$$ 842123151 841996551 841718912 841473043 841375589 841328442 841160536 840847433 840549946 840357006 840170026
2410.8H40170026k75433l47972l50177l05593k80917l34323m40836m83810l90947k79069
$$ 840170026 839894593 839546621 839196444 838890851 838609934 838275611 837834775 837350965 836960018 836680949
2431.2H36680949l05891m47631n30243m57406l45051l46244m49300n23865m85003l85880
$$ 836680949 836375058 835927427 835397184 834939778 834594727 834248483 833799183 833275318 832790315 832404435
2451.6H32404435l57330m33982n02109m50373l55065l32713l64065m11570m29571l61740
$$ 832404435 832047105 831613123 831111014 830660641 830305576 829972863 829608798 829197228 828767657 828405917
2472H28405917l12031l89576m61161m18246l19063k71797l11256l47554l23475k43902
$$ 828405917 828093886 827704310 827243149 826824903 826505840 826234043 825922787 825575233 825251758 825007856
2492.4H25007856j96040k39908k97308l12090k77162k03788j65105j91867k27154k30729
$$ 825007856 824811816 824571908 824274600 823962510 823685348 823481560 823316455 823124588 822897434 822666705
2512.8H22666705k22862k42531k95341l65019l86179l30865l01004l53098m32550m56393
$$ 822666705 822443843 822201312 821905971 821540952 821154773 820823908 820522904 820169806 819737256 819280863
2533.2H19280863m20451m28081n03302n45263n31137n07474m67300m55499m88460m83930
$$ 819280863 818860412 818432331 817929029 817383766 816852629 816345155 815877855 815422356 814933896 814449966
2553.6H14449966m67360m58837m39405m75586n24520m98951m29690l89576m21762m67718
$$ 814449966 813982606 813523769 813084364 812608778 812084258 811585307 811155617 810766041 810344279 809876561
2574H09876561m57644m34697m38333m36842m20034l76940l36051l44813l56555l31103
$$ 809876561 809418917 808984220 808545887 808109045 807689011 807312071 806976020 806631207 806274652 805943549
2594.4H05943549k93076k87831k98798l06428l55303m26650m79698n07057n13554n34296
$$ 805943549 805650473 805362642 805063844 804757416 804402113 803975463 803495765 802988708 802475154 801940858
2614.8H01940858n75304o01470o31988p12991p95960q03113p90298q45135r10103r16541
$$ 801940858 801365554 800764084 800132096 799419105 798623145 797820032 797029734 796184599 795274496 794357955
2635.2G94357955q81671q53897q67307r02354r31025r14991q58843q46505q83818r01044
$$ 794357955 793476284 792622387 791755080 790852726 789921701 789006710 788147867 787301362 786417544 785516500
2655.6G85516500q65519q16345p99119q10266q39174q43286p89166p27534p17163p40707
$$ 785516500 784650981 783834636 783035517 782225251 781386077 780542791 779753625 779026091 778308928 777568221
2676G77568221p22170o88076p00176p01189p04646p60555p53224o63578o60241p62284
$$ 777568221 776846051 776157975 775457799 774756610 774051964 773291409 772538185 771874607 771214366 770452082
2696.4G70452082q36611q13663p64370q23617r46581r69112r03904q36611p89225q08537
$$ 770452082 769615471 768801808 768037438 767213821 766267240 765298128 764394224 763557613 762768388 761959851
2716.8G61959851q44300p84755o94632o98090p39515p04765o35326o17683o29306o30915
$$ 761959851 761115551 760330796 759636164 758938074 758198559 757493794 756858468 756240785 755611479 754980564
2737.2G54980564o31034o06835n42224n23150n99920o55294o13272n34415m74036m70400
$$ 754980564 754349530 753742695 753200471 752677321 752077401 751422107 750808835 750274420 749800384 749329984
2757.6G49329984n08666n06818m60863m26591m45664n32508o08921o22272o33538o67035
$$ 749329984 748821318 748314500 747853637 747427046 746981382 746448874 745839953 745217681 744584143 743917108
2778G43917108p17521q01146q42035p87020p91192r26792j055360j103878j102627
$$ 743917108 743199587 742398441 741556406 740769386 739978194 739051402 737996042 736892164 735789537
2796.3G35789537j148641j275479j354754j367629j384199j423835j516581j627684
$$ 735789537 734640896 733365417 732010663 730643034 729258835 727835000 726318419 724690735
2812.6G24690735j671016j636624j630485j728475j861871j954615j986742j977145
$$ 724690735 723019719 721383095 719752610 718024135 716162264 714207649 712220907 710243762
2828.9G10243762k017022k157271k307951k377093k457023k652943k893209l089666
$$ 710243762 708226740 706069469 703761518 701384425 698927402 696274459 693381250 690291584
2845.3F90291584l196240l156424k955794k668977k409696k242625k211869k343058
$$ 690291584 687095344 683938920 680983126 678314149 675904453 673661828 671449959 669106901
2861.6F69106901k642811l089189l552318l878236m046619m188299m356146m318773
$$ 669106901 666464090 663374901 659822583 655944347 651897728 647709429 643353283 639034510
2877.9F39034510l911734l287911k687276k231121j802921j277149p97987n29110m89772
$$ 639034510 635122776 631834865 629147589 626916468 625113547 623836398 623038411 622509301 622019529
2896.3F22019529o29723p77721q49188r63449j187921j499533j870454k258181k658725
$$ 622019529 621389806 620612085 619762897 618799448 617611527 616111994 614241540 611983359 609324634
2914.6F09324634l043890l283322l270924k962291k418697j769900j112521m16398
$$ 609324634 606280744 602997422 599726498 596764207 594345510 592575610 591463089 591046691
2930.9E91046691N03302J622259K642393L387332L940165M364789M571676M564166
$$ 591046691 591549993 593172252 595814645 599201977 603142142 607506931 612078607 616642773
2947.2F16642773M499197M458964M396021M369259M455388M481196M268825L948748
$$ 616642773 621141970 625600934 629996955 634366214 638821602 643302798 647571623 651520371
2963.6F51520371L752828L649056L468812L243267L079116K987981K968490K864957
$$ 651520371 655273199 658922255 662391067 665634334 668713450 671701431 674669921 677534878
2979.9F77534878K495110K083600J917004J891196J784623J460194J029552Q10742
$$ 677534878 680029988 682113588 684030592 685921788 687706411 689166605 690196157 691006899
2996.2F91006899P33793N07414J48892j80244l80516l97325m06861o87659j128018
$$ 691006899 691740692 692248106 692396998 692216754 691836238 691438913 691032052 690344393 689216375
3014.5F89216375j423061j505911j512527j575828j744568j915217j897752j761377
$$ 689216375 687793314 686287403 684774876 683199048 681454480 679539263 677641511 675880134
3030.9F75880134j760006k025187k299905k214253j975059j997769k271056k484381
$$ 675880134 674120128 672094941 669795036 667580783 665605724 663607955 661336899 658852518
3047.2F58852518k397180k211571k228021k344728k459764k495110k331198k156019
$$ 658852518 656455338 654243767 652015746 649671018 647211254 644716144 642384946 640228927
3063.5F40228927k178848k382040k579033k553403k323747k109826k152025k377928
$$ 640228927 638050079 635668039 633089006 630535603 628211856 626102030 623950005 621572077
3079.8F21572077k434194k321541k305269k376259k443373k500415k442837k273798
$$ 621572077 619137883 616816342 614511073 612134814 609691441 607191026 604748189 602474391
3096.1F02474391k192974k308368k445519k328515k076924k065778k294421k313376
$$ 602474391 600281417 597973049 595527530 593199015 591122091 589056313 586761892 584448516
3112.4E84448516k035081j924038k092898k376497k600133k460241k084256j952648
$$ 584448516 582413435 580489397 578396499 576020002 573419869 570959628 568875372 566922724
3128.8E66922724k136111k286553k148569j865864j833975k116621k285182k161503
$$ 566922724 564786613 562500060 560351491 558485627 556651652 554535031 552249849 550088346
3145.1E50088346j963317j766444j695037j942992k210498k116680j895964j856625
$$ 550088346 548125029 546358585 544663548 542720556 540510058 538393378 536497414 534640789
3161.4E34640789j904249j883328j800358j725793j709163j747311j754403j698494
$$ 534640789 532736540 530853212 529052854 527327061 525617898 523870587 522116184 520417690
3177.7E20417690j635611j612484j639903j668393j610399j505613j515627j610100
$$ 520417690 518782079 517169595 515529692 513861299 512250900 510745287 509229660 507619560
3194E07619560j638234j572132j450419j363337j383543j448781j452684j379073j301885
$$ 507619560 505981326 504409194 502958775 501595438 500211895 498763114 497310430 495931357 494629472
3212.4D94629472j268297j263410j283109j286894j243442j219720j233548j190871
$$ 494629472 493361175 492097765 490814656 489527762 488284320 487064600 485831052 484640181
3228.7D84640181j003236q64088j081288j380473j349837j134753r54390q49425r26525
$$ 484640181 483636945 482772857 481691569 480311096 478961259 477826506 476872116 476022691 475096166
3247.1D75096166j122177j113921q88675p52718q36491r78142r89795q53270o90192
$$ 475096166 473973989 472860068 471971393 471218675 470382184 469404042 468414247 467560977 466870785
3265.4D66870785n98610n86182p17699q59946q65370q84384r08017q57294p81447p09116
$$ 466870785 466272175 465685993 464968294 464108348 463242978 462358594 461450577 460593283 459811836 459102720
3285.8D59102720o40333n58138n64515o76930p75904q69721q88586p44700n91427o57887
$$ 459102720 458462387 457904249 457339734 456662804 455886900 455017179 454128593 453383893 452792466 452134579
3306.2D52134579r31263j165598j168728j036018r75222r67294r56803r32276r03786
$$ 452134579 451203316 450037718 448868990 447832972 446857750 445890456 444933653 444001377 443097591
3324.6D43097591r96023j129359j145065j090646r42945p84755r01818j174718j282335
$$ 443097591 442101568 440972209 439827144 438736498 437793553 437008798 436106980 434932262 433649927
3342.9D33649927j261711j130253r50336j073122j380146j448005j247704j016915
$$ 433649927 432388216 431257963 430307627 429234505 427854359 426406354 425158650 424141735
3359.2D24141735j020879j116156r86219q71360j093030j400322j388758j157493j020848
$$ 424141735 423120856 422004700 421018481 420147121 419054091 417653769 416265011 415107518 414086670
3377.6D14086670r86398r88632r31919p53730n09173l21984m58717q20011q30174m01020
$$ 414086670 413100272 412111640 411179721 410425991 409916818 409594834 409136117 408316106 407485932 407084912
3398D07084912k12640o24179r81808p42018l75212k96354l60101m91351n83589m76152
$$ 407084912 406872272 406248093 405266285 404524267 404149055 403852701 403492600 403001249 402417660 401941508
3418.4D01941508l23743k37464r4295Q0407J68532J52498J91927K70367J18494j81913
$$ 401941508 401617765 401380301 401286006 401366413 401534945 401687443 401879370 402149737 402268231 402086318
3438.8D02086318j98454R8675L36379M14074M15355M09424M45783N33611O87688P98047
$$ 402086318 401887864 401986539 402322918 402736992 403152347 403561771 404007554 404541165 405228853 406026900
3459.2D06026900O87957O45071R46939J122594P59810L05653L43471O92696R97752
$$ 406026900 406714857 407359928 408306867 409429461 410189271 410494924 410838395 411531091 412528843
3477.5D12528843R84281O73741O50823R18240R24795P77305Q50200J020074J072467
$$ 412528843 413513124 414186865 414837688 415755928 416680723 417458028 418308228 419328302 420400769
3495.9D20400769R80138R64850J036555Q68768O80446Q35538J136571J308739J155585
$$ 420400769 421380907 422345757 423382312 424251080 424931526 425767064 426903635 428212374 429367959
3514.2D29367959Q62122Q60959J136542J378447J209259Q69810Q82387J104087J298189
$$ 429367959 430230081 431091040 432227582 433606029 434815288 435685098 436567485 437671572 438969761
3532.6D38969761J429200J349956J166493J267701J528293J520008J205504J084000
$$ 438969761 440398961 441748917 442915410 444183111 445711404 447231412 448436916 449520916
3548.9D49520916J251757J430660J544714J634717J777172J826406J608282J537890
$$ 449520916 450772673 452203333 453748047 455382764 457159936 458986342 460594624 462132514
3565.2D62132514K105265K477795K147407J979708K216041K470523K662212K749056
$$ 462132514 464237779 466715574 468862981 470842689 473058730 475529253 478191465 480940521
3581.5D80940521K621770K517014K690226K871454K726108K739400L031134L221929
$$ 480940521 483562291 486079305 488769531 491640985 494367093 497106493 500137627 503359556
3597.9E03359556L252983L222287L022194K821684L063559L368676L406107L445149
$$ 503359556 506612539 509834826 512857020 515678704 518742263 522110939 525517046 528962195
3614.2E28962195L260434L314912L764748L497005K903581K670288L308534M043997
$$ 528962195 532222629 535537541 539302289 542799294 545702875 548373163 551681697 555725694
3630.5E55725694L527820L250003L297507L222466L194988L128588K910852K873958
$$ 555725694 559253514 562503517 565801024 569023490 572218478 575347066 578257918 581131876
3646.8E81131876L484129L864348L148854K811670L402710L460884K751709K442181
$$ 581131876 584616005 588480353 591629207 594440877 597843587 601304471 604056180 606498361
3663.1F06498361K565920K487779K506435K773046K476513K538801K885520K456606
$$ 606498361 609064281 611552060 614058495 616831541 619308054 621846855 624732375 627188981
3679.4F27188981K151131K215564K351463K472103K291441J883447J740754J751542
$$ 627188981 629340112 631555676 633907139 636379242 638670683 640554130 642294884 644046426
3695.8F44046426J733362J605630J610578J771688J647294J422226J357615J508236
$$ 644046426 645779788 647385418 648995996 650767684 652414978 653837204 655194819 656703055
3712.1F56703055J636147J448334J289248J251102J204431J177966J263023J271009
$$ 656703055 658339202 659787536 661076784 662327886 663532317 664710283 665973306 667244315
3728.4F67244315J092196J074552J280964J456558J295925P67946K82347O98030J315534
$$ 667244315 668336511 669411063 670692027 672148585 673444510 674212456 674494803 675192833 676508367
3746.7F76508367Q87513O79255J058101J155079R64522R41515J071572R21011P43151
$$ 676508367 677395880 678075135 679133236 680288315 681252837 682194352 683265924 684186935 684930086
3765.1F84930086P56145P91847Q50439Q34883P82489Q38876Q58903O94215N23091O10530
$$ 684930086 685686231 686478078 687328517 688163400 688945889 689784765 690643668 691337883 691860974 692471504
3785.5F92471504P76291Q25524P66755N63502N23329O42061N02646N72681P69258N73695
$$ 692471504 693247795 694073319 694840074 695403576 695926905 696568966 697071612 697644293 698413551 698987246
3805.9F98987246O57796P88153N81562L36468L78847N66960O08861Q64387P64489M66347
$$ 698987246 699645042 700433195 701014757 701351225 701730072 702297032 702905893 703770280 704534769 705001116
3826.3G05001116M00901L77178N21719O60956M49062K01761L55840O69122P45237N42819
$$ 705001116 705402017 705779195 706300914 706961870 707410932 707612693 707968533 708637655 709382892 709925711
3846.7G09925711K63930n2155K3962Q61346R42171M51922J62006J94430M45128L77476
$$ 709925711 710189641 710137486 710161448 711022794 711964965 712416887 712578893 712773323 713218451 713595927
3867.1G13595927J93417M44174O38604O39677M13596R2626K69771N09083M46856L14832
$$ 713595927 713789344 714233518 714872122 715511799 715925395 716018021 716287792 716796875 717243731 717558563
3887.5G17558563J92463K99573M29809K67029Q7559J13547K24292L48509M81724L84868
$$ 717558563 717751026 718050599 718480408 718747437 718834996 718948543 719172835 719521344 720003068 720387936
3907.9G20387936K24292K22504K22981J93119K13206J76966Q3089J64151L54886K49148
$$ 720387936 720612228 720834732 721057713 721250832 721464038 721641004 721724093 721888244 722243130 722492278
3928.3G22492278O3955K62916M76599K98798L9637m4465O9201K11537K31624K97904
$$ 722492278 722556233 722819149 723295748 723594546 723634183 723589718 723658919 723870456 724102080 724399984
3948.7G24399984L71933K67923J62780J69039J74463J68740J97351J97590J41561Q1837
$$ 724399984 724771917 725039840 725202620 725371659 725546122 725714862 725912213 726109803 726251364 726333201
3969.1G26333201O2704J37150K65301K85208J81913J57952K03968J16169j8716J6988
$$ 726333201 726395905 726533055 726798356 727083564 727265477 727423429 727627397 727743566 727724850 727741838
3989.5G27741838J97529L17812K57254J34945
$$ 727741838 727939367 728257179 728514433 728649378
3997.6G28649378
$$ 728649378
##END=$$ End of the data block
