##TITLE=$$ Begin of the data block
##JCAMP-DX=5.00 $$ ACD/SpecManager v 10.08
##SPECTROMETER/DATA SYSTEM=Alpha
##DATE=23 Dec 2014 09:14:34
##DATA TYPE=INFRARED SPECTRUM
##DATA CLASS=XYDATA
##ORIGIN=
##OWNER=
##NPOINTS=1765
##FIRSTX=399.76428223
##LASTX=3997.64306641
##MAXX=3997.64306641
##MINX=399.76428223
##MAXY=0.84563392
##MINY=0.36046913
##XFACTOR=1.0000000000
##YFACTOR=1.000000000000000e-9
##FIRSTY=0.62517983
##DELTAX=2.03961372
##XUNITS=1/CM
##YUNITS=ARBITRARY UNITS
##XYDATA=(X++(Y..Y))
399.8 625179827 619832218 615301311 612435937 611927986 613196135 614897013 616293550 617763460 619349301
418.1 619349301 618942320 616295338 612734556 609089613 606615841 605051100 603114665 600403368 598041952
436.5 598041952 598053396 600667953 604236901 607488751 610354364 613281667 616054595 617564261 617522717
454.8 617522717 616825640 616069496 615082264 612913191 609539568 606460512 604559124 603050351 600485384
473.2 600485384 596931398 594097912 593071938 593306303 593436599 592841089 592171133 592191279 592563152
491.5 592563152 591983974 590010822 587745965 586177886 585039377 583281159 580393970 577007949 574214280
509.9 574214280 572028875 569305480 565320909 560812593 557282567 555131316 553634405 552211523
526.2 552211523 551280499 551667929 553432584 555970848 558902323 562580645 567276716 572098434 575550139
544.6 575550139 576785088 576316178 575444281 574643612 573157668 570261896 566351891 562394798 558562636
562.9 558562636 554070175 548295915 542001724 536991894 534432471 534186602 535536826 538321376 543030858
581.3 543030858 549502730 556334615 561997056 566030562 568960369 571046174 572121263 572246015 571698606
599.6 571698606 571040094 570960641 571427882 571776807 572041392 572849989 574400663 576500595 578974187
618 578974187 581766486 584964454 588592052 592274249 595446289 597857535 599818051 601705253 603461385
636.4 603461385 604863048 605906606 606819808 607818425 608854830 609820247 610812485 611868560 612882912
654.7 612882912 613801599 614668608 615612805 616638720 617449999 618046999 619161069 620680571 622088850
673.1 622088850 623488188 624805152 625940740 627104938 628429532 629606485 630285144 630515337 630545616
691.4 630545616 630326629 629435241 627538204 624923825 622286320 620118499 618470013 617325962 617049038
709.8 617049038 618145168 620670557 624075413 627765954 631753266 636384249 641657233 647030890
726.1 647030890 651710868 655427217 658660710 661851943 664763331 666745305 667606592 667790294 667627096
744.5 667627096 666763604 664600790 661108613 657065332 653322756 649925590 646445572 643011689 640486777
762.8 640486777 639683068 640794039 643480062 647337377 652429819 659068346 666885972 674632430 681167424
781.2 681167424 686434925 691188753 695865095 700015306 703070819 705468774 708291054 712074697
797.5 712074697 716234684 719740093 722387731 724798441 727396011 729741514 731062293 731450558 731840074
815.8 731840074 732737124 733641982 733592272 732186198 730032027 727844894 725379288 721850216 717201173
834.2 717201173 712314725 708069146 704545021 701158941 697466433 693808079 690803826 688334107
850.5 688334107 685480773 681548893 676952064 673060715 671591580 673714042 679130137 686670065
866.8 686670065 695751905 705953717 715776980 723338068 727901220 729982018 730183065 728439927
883.2 728439927 724530518 718975067 712984741 707552075 702752233 698067963 693212509 688465655
899.5 688465655 684186220 679997683 674918652 668374956 660698771 652567565 644265354 635706484
915.8 635706484 627145827 619581819 614111245 611012697 609627604 609065235 609081864 610118687 612438500
934.1 612438500 615676999 619251370 622930467 626590729 629308701 629366219 625455141 617628574 606997311
952.5 606997311 594761789 581530631 567320347 552072585 536046684 519638896 502927840
966.8 502927840 485696137 467919141 450040162 432700694 416430175 401668817 388865620
981.1 388865620 378433704 370621860 365402371 362359643 360872984 360469133 360942453 362147480 363770396
999.4 363770396 365360498 366590738 367333174 367540032 367319822 366881132 366467685 366476059 367266268 368859112
1019.8 368859112 371089399 373844504 377056420 380613983 384356856 388009936 391124964 393398941
1036.1 393398941 394899070 395908326 396695077 397467703 398394734 399732649 401937604 405410856 410227776
1054.5 410227776 416190267 423142254 431172967 440373152 450060457 458051890 461120665 457358360
1070.8 457358360 448377967 438308924 430613220 426380008 425209671 426440746 429402649 433425933
1087.1 433425933 438079178 443259597 448830456 454291165 458903342 462065935 463672876 464316636
1103.4 464316636 465031117 466604173 469140202 472338468 475868344 479412347 482612789 485115528
1119.8 485115528 486860514 488264978 490048379 492834479 496699691 500960052 504486203 506248534
1136.1 506248534 505567372 502194464 496502012 489449024 482128948 475363463 469555020 464834541
1152.4 464834541 461300969 459102899 458335549 458946586 460878164 464239359 469301045 476254195 484962791
1170.7 484962791 494957149 505718112 516937852 528514862 540315688 551926255 562798917
1185 562798917 572574556 581121743 588375926 594177246 598317087 601011038 602986097 604874849 606862247
1203.4 606862247 608876169 611033142 613798559 617550969 622089863 626741171 630918205 634433508
1219.7 634433508 637282789 639291167 640144050 639818430 638758004 637529492 636413336 635270596 633908093
1238.1 633908093 632538795 631665289 631619751 632322550 633428633 634725213 636253893 637996256 639678597
1256.4 639678597 640939415 641691566 642299771 643276632 644813299 646659791 648438990 649976373 651209891
1274.8 651209891 651986420 652123272 651631653 650865555 650225937 649736047 649150491 648269057 647060990
1293.1 647060990 645703793 644356608 642935574 641356230 639725149 638187885 636834264 635714889
1309.4 635714889 634761810 633840621 632977426 632235289 631406665 630071461 627847672 624591708 620525420
1327.8 620525420 616067350 611604989 607480526 604058444 601664186 600401223 600001276 600017786 600188911
1346.2 600188911 600372434 600407481 600197017 599676251 598841012 597858131 596923947 596066296 595261395 594544172
1366.6 594544172 594031215 593943596 594372034 595134616 595852196 596425235 597031891 598107219 600310206
1384.9 600310206 603964984 608021498 611167312 613444626 614914000 615296662 614754677 613829076 612787783
1403.3 612787783 611491919 609958351 608302593 606597722 605072439 603889585 602874517 601902187
1419.6 601902187 601321220 601278841 601632297 602269888 603136659 604113758 605183065 606649041 608351052
1437.9 608351052 609671295 610809207 611828804 612538815 612724245 612250507 611282349 610107243 608517468
1456.3 608517468 606598854 605694413 605923593 607359290 609976590 613385797 618262768 625818074 634129167
1474.7 634129167 641247988 647671878 653828144 659747064 665075123 670190156 675557017 680608928
1491 680608928 684491098 688011110 691925228 695487857 698351741 700859308 703657210 707074702 709506691
1509.3 709506691 711236596 713058054 715022326 717029750 718843937 720726490 722450495 723781466
1525.6 723781466 725010395 726107240 727272213 728581846 729653180 730569720 731659234 732313454 732533395
1544 732533395 732729673 732885540 733027756 733228862 733579814 734068215 734337270 733697057 733101189 732835293
1564.4 732835293 732687414 732393503 731780469 731222093 730832934 730220675 729329288 728408575 727428675 726430655
1584.8 726430655 725339711 724000156 722332954 720466197 718499541 716455877 714263439 711784661
1601.1 711784661 709114790 706430972 703675210 700570881 697178006 693833768 690214038 686007500
1617.4 686007500 682571948 679618061 676107049 672596276 669360459 666307151 663923442 662110209
1633.7 662110209 660348833 659022748 658353448 658075869 658195376 658949733 660238504 661442041 663232565
1652.1 663232565 666018963 668065548 670050621 672735751 676124454 679567993 682561994 686072350
1668.4 686072350 690400481 694211006 697999299 702108562 705823898 709446073 713671803 718797982
1684.7 718797982 722772539 725926816 729367197 732556045 735738516 738855720 741530657 744324923
1701.1 744324923 746469796 748041391 749476254 750740707 752107561 753671229 755348206 757055759
1717.4 757055759 758401155 759543419 760924518 762537122 764135122 765801370 767625391 769874334
1733.7 769874334 772022247 773562431 775216162 777156413 779208124 781330884 783397615 785443783
1750 785443783 787493944 789374352 791226089 793010592 794516385 796017349 797519803 798900843 800177515
1768.4 800177515 801289022 802303016 803299546 804265797 805155993 805870175 806463063 807212532 808173478
1786.7 808173478 809082508 809810936 810424924 811043859 811799526 812578857 813154995 813593268 814163029 814969122
1807.1 814969122 815807879 816397011 816721141 817089260 817719638 818466067 819017589 819343209 819701076 820256114
1827.5 820256114 820911109 821375966 821562409 821710885 822072148 822607696 823055923 823234200 823238015 823407054
1847.9 823407054 823819101 824186802 824249208 824166954 824290514 824698389 825114965 825282753 825250804 825308979
1868.3 825308979 825639725 826031029 826209366 826182544 826269925 826635361 827091992 827382267 827460170 827553689
1888.7 827553689 827888787 828350246 828626692 828609109 828554809 828747392 829111218 829345763 829294741 829131484
1909.1 829131484 829175413 829501748 829839468 829897463 829753518 829758704 830046952 830341816 830359817 830199480
1929.5 830199480 830179095 830460489 830800176 830869317 830720425 830683172 830915570 831219375 831314445 831192374
1949.9 831192374 831151903 831407249 831800759 832011938 831960320 831896365 832078218 832426608 832625151 832558334
1970.3 832558334 832459271 832560718 832833767 833049476 833046556 832934439 832921267 833072841 833249629 833257496 833091557
1992.7 833091557 833007812 833159566 833338976 833294034 833067536 832905293 832912624 832939684 832794845 832472682
2013.1 832472682 832124889 831902564 831735671 831364930 830693364 830025256 829838932 830032647 830050588 829701543
2033.5 829701543 829227865 828906298 828777313 828660131 828366876 827976763 827727318 827673376 827666044 827551484
2053.9 827551484 827353001 827255666 827352166 827521980 827579618 827472627 827368081 827442527 827635348 827725053
2074.3 827725053 827633917 827528954 827597201 827814400 827960551 827900589 827786028 827859223 828127980 828387618
2094.7 828387618 828463554 828419268 828469574 828696609 828958809 829067528 829045534 829061091 829204082 829398870
2115.1 829398870 829505026 829466343 829385519 829426110 829585314 829693556 829642355 829531610 829522550 829648018 829777956
2137.5 829777956 829769492 829673648 829671502 829836547 830037832 830102146 830034792 830019414 830187261 830462515 830670893
2160 830670893 830783963 830928266 831181943 831516922 831879079 832196653 832456410 832804978 833287060 833730459
2180.4 833730459 834029377 834248006 834523976 834935188 835379004 835681379 835854769 836102188 836534321 836985111
2200.8 836985111 837265551 837424457 837658823 838061154 838493228 838783622 838938117 839116812 839444697 839858174
2221.2 839858174 840181530 840341508 840449989 840693176 841088057 841419160 841533363 841545582 841670215 841946661
2241.6 841946661 842234254 842383981 842427611 842551410 842801571 843042254 843136549 843105137 843160331 843443394
2262 843443394 843791366 843968689 843952477 843952417 844154179 844453931 844669998 844783545 844921887 845200717 845512927
2284.4 845512927 845633924 845583797 845528245 845485210 845496058 845518470 845417202 845302343 845289052 845301747 845228553
2306.8 845228553 845003545 844725966 844596446 844606459 844515741 844185472 843738854 843420923 843345225 843317866
2327.2 843317866 843080759 842677236 842353165 842221439 842173576 841999114 841692328 841604888 842016220 842496216
2347.6 842496216 842446864 841831446 841030598 840402305 840062261 839956999 839877844 839816928 839973509 840389729
2368 840389729 840873897 841204405 841448247 841832936 842365026 842842460 843120515 843231440 843279600 843327582
2388.4 843327582 843310237 843126178 842847407 842642784 842573345 842529297 842343569 842017710 841722250 841523647
2408.8 841523647 841337800 841083646 840743244 840364218 840033054 839767277 839450240 839030445 838602901 838243961
2429.2 838243961 837936878 837584496 837114811 836580575 836116016 835769057 835415244 834951043 834438562 833983541
2449.6 833983541 833613753 833240509 832763135 832265735 831890166 831587672 831260324 830889642 830450177 829972148
2470 829972148 829548180 829200268 828852534 828444541 828027964 827693343 827431679 827147782 826810360 826490045
2490.4 826490045 826240361 826000750 825720429 825445533 825190604 824949026 824746013 824553192 824328601 824104607
2510.8 824104607 823901474 823684871 823435724 823133588 822767496 822394073 822063565 821746945 821398616 820994616
2531.2 820994616 820543587 820091963 819645405 819156885 818624854 818095505 817613304 817173004 816696107 816184402
2551.6 816184402 815730810 815307856 814842939 814359844 813884437 813410044 812943041 812495828 812066615 811618984
2572 811618984 811142206 810677886 810237050 809806287 809386671 808969975 808563769 808186352 807825565 807476401
2592.4 807476401 807168126 806911945 806650579 806330204 805978775 805633962 805267811 804830313 804312706 803754091
2612.8 803754091 803210258 802671731 802080333 801410675 800667226 799904823 799150586 798343599 797474205 796596229
2633.2 796596229 795706868 794799328 793918908 793063521 792171359 791222692 790283322 789407074 788550675 787674606
2653.5 787674606 786802351 785958946 785142004 784329295 783504009 782672644 781849623 781046152 780274510 779517293
2673.9 779517293 778756022 778026283 777339816 776659667 775971949 775277197 774568558 773861468 773166716 772441089
2694.3 772441089 771645784 770816803 770031393 769282341 768470645 767561436 766631246 765743732 764907300 764092028
2714.7 764092028 763248622 762398362 761614680 760905743 760211527 759484708 758764088 758110285 757499993 756877542
2735.1 756877542 756240726 755626857 755040944 754472554 753913045 753317237 752696276 752116621 751597643 751113832
2755.5 751113832 750605166 750054061 749536932 749104083 748695433 748236656 747713804 747129858 746517122 745904505
2775.9 745904505 745244682 744490445 743656218 742816508 742037892 741247416 740313649 739243925 738148570
2794.3 738148570 737064719 735912561 734613597 733234048 731881022 730535328 729125857 727591157
2810.6 727591157 725917995 724227071 722607255 720970750 719231308 717380583 715449452 713495016
2826.9 713495016 711520672 709478140 707314432 705024600 702659547 700194716 697530389 694641411
2843.2 694641411 691561878 688339114 685133755 682167470 679504156 677077353 674823761 672623336
2859.5 672623336 670273840 667587161 664463699 660884619 656968772 652926683 648777485 644457459
2875.9 644457459 640151978 636189878 632821858 630094171 627873898 626097381 624822795 624026835
2892.2 624026835 623510957 623017609 622378647 621594727 620736480 619782388 618617594 617109597 615199387
2910.5 615199387 612919390 610274792 607237160 603929460 600648046 597691774 595249474 593422532
2926.8 593422532 592280328 591903508 592455328 594099462 596781313 600206673 604127049 608455718 613054514
2945.2 613054514 617684722 622205317 626626253 630990684 635392427 639896333 644359708 648607910
2961.5 648607910 652613044 656431615 660117567 663614273 666872919 669978619 673011601 675994992
2977.8 675994992 678820193 681290984 683421075 685400724 687319458 689095557 690534413 691556513
2994.2 691556513 692367792 693089604 693587899 693768501 693629444 693260491 692858517 692447007 691768527 690653980
3014.5 690653980 689223647 687708557 686211586 684638858 682856560 680889130 678962052 677210569
3030.9 677210569 675464392 673427761 671127915 668972731 667070210 665077984 662765682 660270572
3047.2 660270572 657889664 655671775 653427660 651053846 648543477 646032512 643723428 641581059
3063.5 641581059 639420152 637052238 634456456 631910741 629630208 627533913 625376403 623005986
3079.8 623005986 620559037 618192792 615837634 613441229 611017942 608542860 606113315 603826165
3096.1 603826165 601583242 599221289 596760690 594461620 592405677 590288997 587935030 585653365
3112.4 585653365 583660662 581701159 579555690 577188253 574645460 572201788 570047319 567998886
3128.8 567998886 565810084 563518465 561401308 559560835 557707071 555557787 553256094 551092029
3145.1 551092029 549141884 547381938 545668006 543720603 541535199 539416671 537467599 535576522
3161.4 535576522 533697724 531835973 530020535 528275371 526556253 524790525 522993326 521267474
3177.7 521267474 519645214 518042207 516402304 514736950 513112664 511589587 510106266 508569002
3194 508569002 506963313 505374730 503886819 502482891 501083493 499628007 498178661 496834338 495561302
3212.4 495561302 494270563 492938012 491580933 490249127 488983423 487752527 486507595 485314220
3228.7 485314220 484322578 483439863 482338369 480987847 479669005 478535295 477583200 476737827 475797325
3247.1 475797325 474638045 473484188 472575188 471789092 470898569 469897956 468928993 468098491 467387259
3265.4 467387259 466752112 466171533 465478390 464613557 463736117 462889016 462028146 461169958 460383147 459683478
3285.8 459683478 459042698 458478510 457915872 457231551 456406236 455473095 454555690 453821540 453265786 452649862
3306.2 452649862 451742113 450547814 449278384 448150426 447189420 446287811 445384055 444501460 443588108
3324.6 443588108 442497849 441271693 440109342 439074337 438149333 437291026 436319292 435177922 433985829
3342.9 433985829 432741672 431550652 430580854 429543376 428130627 426629037 425409079 424362510
3359.2 424362510 423215359 422060013 421157092 420363396 419283509 417823195 416334927 415144145 414168447
3377.6 414168447 413205594 412195742 411270738 410551310 410051703 409724921 409259528 408444732 407628804
3395.9 407628804 407207668 406947523 406286180 405282021 404523581 404141068 403854549 403484941 402928472
3414.3 402928472 402306736 401920468 401729614 401508421 401336998 401390225 401596814 401740044 401892185 402168959
3434.7 402168959 402286887 402090877 401884884 401979089 402378887 402875841 403288901 403658658 404089481 404617339
3455.1 404617339 405294091 406086504 406781673 407466501 408445090 409529090 410259128 410605013 410997421
3473.4 410997421 411679715 412601918 413536310 414237410 414934427 415864795 416765779 417522550 418383867 419445962
3493.8 419445962 420578957 421613127 422582179 423558831 424366653 425040334 425926208 427108675 428385079
3512.2 428385079 429466069 430290461 431167275 432305127 433655620 434925705 435921073 436827213 437881708
3530.6 437881708 439179868 440655112 442010134 443157464 444468737 446029335 447536737 448787272
3546.9 448787272 449977845 451321840 452772707 454301327 455945760 457732707 459544003 461146623
3563.2 461146623 462719381 464884549 467407078 469585896 471611381 473876119 476311445 478841603
3579.5 478841603 481525749 484211057 486754000 489390343 492317140 495192558 498007566 501032114
3595.8 501032114 504269481 507534087 510759711 513866544 516800344 519896686 523236692 526633203
3612.1 526633203 530132890 533454657 536738336 540475607 544047415 547053993 549802363 553053558
3628.5 553053558 556946218 560446084 563765466 567130327 570360422 573568225 576799273 579837799
3644.8 579837799 582770526 586190939 589897156 592962205 595790088 599146485 602504075 605363429
3661.1 605363429 608057559 610731363 613214612 615705669 618456841 620903790 623278379 625985801
3677.4 625985801 628529608 630894959 633197665 635500610 637894094 640130520 642069340 643932700
3693.7 643932700 645752490 647460699 649046004 650689483 652392149 653941095 655414939 656885743
3710 656885743 658400893 659958303 661312699 662540257 663842022 665122569 666253626 667478800 668834031
3728.4 668834031 670009613 671083987 672348797 673809588 675081730 675833941 676139355 676837444 678158760
3746.7 678158760 679092586 679735303 680707395 681869984 682895303 683880568 684948087 685820520 686532140
3765.1 686532140 687286675 688089132 688956797 689753175 690474689 691317916 692250073 693033516 693604946 694207728
3785.5 694207728 694981277 695824623 696589053 697138250 697640121 698276281 698832333 699445426 700130701 700590134
3805.9 700590134 701221585 702060699 702717304 703135908 703595400 704171062 704676390 705426395 706138611 706557035
3826.3 706557035 706954479 707442224 708098948 708818018 709294081 709542513 709887266 710442901 711084485 711601317
3846.7 711601317 711897612 711925685 711941481 712646246 713529468 714003503 714204013 714494050 715044379 715446830
3867.1 715446830 715639710 716104329 716749907 717307925 717561483 717563570 717893958 718516469 719027817 719345689
3887.5 719345689 719503760 719744205 720104516 720340669 720484376 720672429 720871568 721198559 721733928 722135425
3907.9 722135425 722347438 722605348 722886443 723104119 723311782 723483086 723554254 723658741 723920822 724147618
3928.3 724147618 724279463 724569619 725007534 725279987 725296915 725253105 725376606 725658417 725928366 726225019
3948.7 726225019 726573169 726797938 726902425 727045298 727235615 727388084 727541447 727738738 727933049 728081405
3969.1 728081405 728198230 728353977 728561759 728760839 728920341 729094923 729297161 729449034 729492903 729492664
3989.5 729492664 729609489 729867935 730143905 730346143
3997.6 730346143
##END=$$ End of the data block
