##TITLE=$$ Begin of the data block
##JCAMP-DX=5.00 $$ ACD/SpecManager v 10.08
##SPECTROMETER/DATA SYSTEM=Alpha
##DATE=23 Dec 2014 09:14:34
##DATA TYPE=INFRARED SPECTRUM
##DATA CLASS=XYDATA
##ORIGIN=
##OWNER=
##NPOINTS=1765
##FIRSTX=399.76428223
##LASTX=3997.64306641
##MAXX=3997.64306641
##MINX=399.76428223
##MAXY=0.84693933
##MINY=0.36076441
##XFACTOR=1.0000000000
##YFACTOR=1.000000000000000e-9
##FIRSTY=0.62903285
##DELTAX=2.03961372
##XUNITS=1/CM
##YUNITS=ARBITRARY UNITS
##XYDATA=(X++(Y..Y))
399.8 629032850 623288691 618492663 614962220 613888741 615148842 617037952 618317366 619662166
416.1 619662166 621793270 622012436 619314253 615733981 612149000 609379053 607360601 605234504 602631867
434.4 602631867 600298166 599936485 602268398 606198251 609896600 612733603 615327418 617787659 619252443
452.8 619252443 619120181 618063867 617164016 616379261 614513576 611275792 607843101 605468392 603831232
471.2 603831232 601368487 598097026 595598161 594687164 594826758 594827950 594135880 593393922 593293250 593479276
491.5 593479276 592899740 591042042 588706613 587064743 586046457 584553599 581887901 578428924 575313210
509.9 575313210 572820187 570053577 566222906 561752141 558130920 555924296 554552436 553469598
526.2 553469598 552740216 552943051 554373562 556745231 559687257 563268244 567811072 572728574 576340437
544.6 576340437 577683389 577393234 576473713 575352132 573805511 571151853 567335546 563290954 559366167
562.9 559366167 554788589 548962712 542644262 537665308 535219550 535007119 536310792 539260924 544292212
581.3 544292212 550827265 557428658 562885642 566848814 569640100 571543276 572711110 573101103 572700739
599.6 572700739 572083652 571919501 572199225 572518587 572884679 573729694 575339198 577559114 580059111
618 580059111 582747698 585887909 589607716 593350768 596425891 598754764 600772262 602780461 604523242
636.4 604523242 605749547 606738329 607747436 608767033 609736383 610643446 611597180 612651348 613737583
654.7 613737583 614739954 615656435 616616249 617666483 618626237 619438469 620454013 621670127 622951448
673.1 622951448 624353051 625698626 626953602 628313124 629726529 630829930 631392181 631617129 631711125
691.4 631711125 631426156 630406082 628562331 626132965 623544514 621217728 619400263 618237674 617988050
709.8 617988050 619035482 621511459 624951243 628754854 632847667 637469888 642667294 648012042
726.1 648012042 652709246 656439841 659678340 662895918 665878892 667914450 668749750 668899834 668695986
744.5 668695986 667732716 665505886 662049115 658072710 654324710 650839567 647301197 643841743 641226649
762.8 641226649 640353680 641492903 644170582 647971630 653070688 659780145 667718053 675566554 682106435
781.2 682106435 687351227 692077219 696647167 700698197 703802466 706347942 709271491 713076532
797.5 713076532 717256665 720762551 723324835 725647092 728252470 730692565 732119918 732560396 732924521
815.8 732924521 733722329 734503329 734405398 733094573 731078565 728929222 726431787 722818971 718033135
834.2 718033135 713069201 708795846 705191255 701748490 698109746 694515169 691516757 689020932
850.5 689020932 686158061 682260990 677675426 673764825 672317147 674499989 679943204 687455654
866.8 687455654 696477771 706575274 716290951 723799765 728352547 730427086 730613410 728872120
883.2 728872120 724988401 719451547 713443875 707957327 703139663 698502004 693661034 688853383
899.5 688853383 684473336 680204034 675128698 668644965 660996437 652842104 644507766 635920286
915.8 635920286 627353668 619824529 614388049 611295819 609893918 609314919 609315395 610316455 612653434
934.1 612653434 615964472 619581163 623273194 626913846 629601538 629648447 625685930 617780924 607156873
952.5 607156873 594994247 581757009 567458808 552175105 536163628 519723713 502947450
966.8 502947450 485681802 467915297 450065285 432757735 416546375 401873708 389116913
981.1 389116913 378675938 370869398 365661919 362606674 361121118 360764414 361294419 362520367 364126086
999.4 364126086 365688264 366899401 367637068 367868692 367669165 367244840 366882890 366896808 367603630 369163483
1019.8 369163483 371453851 374239415 377430230 380992711 384734839 388339400 391422987 393684298
1036.1 393684298 395163804 396193057 397046328 397863001 398769855 400079548 402300984 405806154 410621673
1054.5 410621673 416530848 423413128 431409061 440632761 450365126 458381116 461473495 457721680
1070.8 457721680 448733300 438688010 431043118 426859438 425692409 426860452 429758668 433762610
1087.1 433762610 438447833 443661004 449227929 454680711 459277838 462445289 464116275 464818865
1103.4 464818865 465510994 467020541 469512910 472665131 476156354 479705513 482926637 485439450
1119.8 485439450 487161666 488517046 490300894 493117064 496962875 501191378 504728675 506519437
1136.1 506519437 505845726 502465606 496779531 489763081 482486576 475722432 469874859 465145171
1152.4 465145171 461658448 459492117 458712727 459308863 461231679 464588493 469656885 476611257 485321999
1170.7 485321999 495342433 506122768 517320573 528869450 540670455 552279770 563120961
1185 563120961 572862387 581438422 588751674 594543457 598647594 601338446 603328228 605246365 607246578
1203.4 607246578 609244764 611384809 614142597 617888987 622418702 627078414 631279469 634801090
1219.7 634801090 637628376 639629960 640519738 640219331 639152348 637930930 636809111 635622501 634255469
1238.1 634255469 632943749 632115781 632045388 632667363 633729219 635058701 636639416 638420820 640129805
1256.4 640129805 641387999 642123103 642736614 643742025 645298064 647138536 648910940 650412858 651584446
1274.8 651584446 652346313 652500391 652025402 651273847 650631845 650141120 649566650 648692727 647503138
1293.1 647503138 646180511 644847214 643410206 641817451 640198290 638696313 637368917 636230230
1309.4 636230230 635230541 634287953 633440554 632719755 631894588 630529702 628246009 624962926 620942950
1327.8 620942950 616553664 612125456 608003736 604575336 602161765 600868702 600462198 600503564 600691557
1346.2 600691557 600876689 600924432 600725293 600187838 599305630 598279417 597332418 596473575 595675647 594986558
1366.6 594986558 594495416 594403744 594813645 595555067 596276104 596882284 597503781 598539531 600691855
1384.9 600691855 604338109 608422458 611603677 613873482 615265608 615602553 615083098 614155591 613092661
1403.3 613092661 611802697 610267878 608595908 606894314 605368078 604158878 603132308 602193415
1419.6 602193415 601650417 601619422 601975918 602623284 603475869 604418397 605479002 606944144 608637035
1437.9 608637035 609970868 611134529 612183392 612932265 613144636 612672269 611695588 610499680 608859777
1456.3 608859777 606890738 605986714 606232643 607665956 610267043 613667727 618544757 626112342 634450138
1474.7 634450138 641576052 647988856 654159009 660117686 665503144 670670211 676037312 681064904
1491 681064904 684929788 688431978 692346752 695948541 698847115 701348186 704162121 707679868 710123003
1509.3 710123003 711817145 713654041 715622604 717603624 719418585 721309185 723025203 724349201
1525.6 724349201 725587130 726712108 727895379 729201198 730277538 731225014 732347488 732986271 733192325
1544 733192325 733405411 733591259 733747602 733933389 734267652 734739423 734949827 734270692 733714998 733473957
1564.4 733473957 733296394 732956648 732337534 731805921 731429815 730806768 729909241 728992403 728012204 727006376
1584.8 727006376 725913107 724577725 722894609 721007407 719066501 717061102 714866877 712365627
1601.1 712365627 709680557 706995606 704257727 701191425 697849154 694548011 690954149 686750412
1617.4 686750412 683291554 680309892 676783800 673281252 670069039 667025983 664639890 662854612
1633.7 662854612 661154985 659837365 659151793 658911049 659101605 659886122 661166906 662393808 664231241
1652.1 664231241 667044938 669083834 671071649 673782825 677196324 680654347 683658659 687167168
1668.4 687167168 691493571 695315361 699109256 703193784 706869185 710469663 714706242 719853699
1684.7 719853699 723819911 726940393 730326533 733466804 736638546 739790976 742509663 745309472
1701.1 745309472 747418463 748966336 750406384 751678169 753058493 754649699 756338418 757997036
1717.4 757997036 759288251 760429621 761831224 763458312 765054524 766719639 768552601 770794570
1733.7 770794570 772931933 774466097 776110470 778058171 780125022 782250822 784308910 786342740
1750 786342740 788382828 790268362 792132616 793906987 795394301 796882212 798379183 799778640 801071584
1768.4 801071584 802184165 803228080 804249585 805192232 806049526 806769907 807401121 808162689 809117436
1786.7 809117436 810033500 810755908 811345756 811956704 812723041 813522995 814119101 814552009 815088212 815876901
1807.1 815876901 816733599 817321599 817622423 818007946 818681717 819450617 820013463 820353866 820705771 821235299
1827.5 821235299 821875632 822337866 822531164 822694659 823064625 823593616 824015915 824160933 824154854 824338198
1847.9 824338198 824759483 825122833 825200200 825145423 825269997 825670481 826081038 826240718 826223910 826313794
1868.3 826313794 826639771 826990485 827140868 827110350 827192247 827551007 828036249 828375161 828466356 828548551
1888.7 828548551 828882873 829341173 829599738 829573810 829529643 829716861 830048561 830267489 830238640 830107450
1909.1 830107450 830178738 830515504 830832064 830852330 830683768 830686927 830983877 831281185 831292272 831146300
1929.5 831146300 831143618 831392407 831679881 831741869 831625164 831604660 831842363 832162380 832269669 832167804
1949.9 832167804 832168698 832451046 832819045 832985997 832912982 832837820 833009362 833366156 833596826 833551288 833452761
1972.3 833452761 833565116 833859384 834077477 834056973 833934724 833930671 834104538 834299266 834299624 834126770 834039450
1994.8 834039450 834174037 834369540 834362030 834131360 833933115 833913028 833933353 833790839 833475649 833139360
2015.2 833139360 832904160 832699716 832321286 831689179 831062496 830875993 831047535 831067562 830754638 830323040
2035.6 830323040 830010176 829837680 829665005 829379797 829029799 828779280 828716159 828720987 828621745 828438759
2056 828438759 828353643 828447521 828591228 828635037 828561783 828476191 828517377 828695118 828809798 828739524 828643262
2078.4 828643262 828706801 828902543 829057574 829056740 828988910 829055667 829286873 829499006 829551935 829523802 829581857
2100.8 829581857 829806685 830086708 830215216 830205977 830234230 830398798 830621660 830720723 830651164 830568135 830620527
2123.3 830620527 830765605 830845237 830798268 830722630 830758154 830926180 831060171 831030548 830933630 830941677 831095099
2145.7 831095099 831268311 831318736 831260562 831263065 831435382 831698179 831897616 832008064 832154810 832426548
2166.1 832426548 832767308 833100855 833399296 833667696 834021270 834516525 834995568 835311949 835543573 835863471
2186.5 835863471 836288869 836694419 836970031 837147355 837400079 837812662 838236928 838520348 838710964 838967085
2206.9 838967085 839352667 839767277 840069592 840245843 840452135 840803504 841212630 841506839 841646791 841783643
2227.3 841783643 842062473 842439771 842739701 842841327 842850983 842987895 843283772 843578875 843702316 843689919
2247.7 843689919 843773246 844023824 844276607 844405532 844436169 844497979 844729125 845053673 845238864 845245838
2268.1 845245838 845295906 845520735 845798671 846007884 846134663 846259058 846497476 846780419 846881092 846750438
2288.5 846750438 846597075 846618235 846803546 846939325 846873999 846736431 846685708 846682847 846618295 846426427 846174896
2310.9 846174896 846052647 846078634 846023142 845702291 845227242 844919622 844894648 844887257 844644904 844206870
2331.3 844206870 843806922 843628705 843621492 843516469 843187273 843033910 843471467 844012439 843977153 843338728
2351.7 843338728 842528939 841966450 841676533 841464579 841267228 841262639 841526389 841948867 842401147 842732072
2372.1 842732072 842964351 843302667 843819797 844336271 844623208 844671488 844659150 844711423 844725966 844553232
2392.5 844553232 844272792 844060302 843981206 843936145 843760014 843441427 843147516 842973530 842796385 842501521
2412.9 842501521 842136443 841774285 841476142 841233969 840908170 840451002 839985371 839625359 839345217 839021623
2433.3 839021623 838579834 838046789 837546766 837175906 836843729 836418390 835932732 835483313 835076928 834658563
2453.7 834658563 834203422 833752930 833347261 832967222 832602322 832252741 831851661 831400394 831039011 830763757
2474.1 830763757 830412209 829973042 829551816 829193771 828877032 828563452 828246057 827940345 827697456 827507794
2494.5 827507794 827260911 826961458 826696277 826463223 826250255 826061606 825865388 825635791 825383961 825127840
2514.9 825127840 824871421 824606299 824289322 823921978 823588014 823290884 822937191 822489083 821999192 821552575
2535.3 821552575 821150720 820696950 820182323 819662392 819133937 818618894 818129539 817651868 817213476 816782236
2555.6 816782236 816309035 815840721 815377057 814875305 814384162 813952148 813531339 813062191 812591553 812188387
2576 812188387 811809301 811389744 810937762 810481906 810057282 809696078 809370041 809040308 808724225 808435857
2596.4 808435857 808145046 807829440 807503164 807163835 806783915 806348324 805850089 805308044 804742932 804160714
2616.8 804160714 803580344 802956939 802236974 801471174 800712049 799933791 799087822 798165381 797216058 796303034
2637.2 796303034 795438468 794593632 793726027 792794406 791854322 790997863 790160298 789254487 788348675 787507653
2657.6 787507653 786683917 785841703 785014689 784211576 783406317 782613873 781864583 781146407 780418277 779691577
2678 779691577 778999567 778308332 777591109 776877701 776177466 775479972 774780333 774050593 773261666 772442937
2698.4 772442937 771642029 770856977 770049691 769174159 768250287 767365813 766546249 765718400 764830410 763951898
2718.8 763951898 763178885 762482703 761780262 761060834 760355175 759708107 759122729 758514643 757861435 757224083
2739.2 757224083 756622851 756077468 755568206 754997015 754362643 753768802 753255248 752773464 752260268 751707613
2759.6 751707613 751183927 750731885 750313938 749870241 749352276 748763025 748158276 747566879 746937931 746203780
2780 746203780 745365739 744504392 743706286 742919922 742003262 740933716 739809334 738698840 737557411
2798.4 737557411 736308992 734980226 733613551 732214987 730795681 729298770 727668822 725958228
2814.7 725958228 724262953 722609282 720894694 719023943 717049360 715085626 713139772 711115301
2831 711115301 708955944 706661820 704256952 701747179 699065268 696141601 693004131 689773679 686591327
2849.3 686591327 683620811 680957735 678546369 676303744 674119115 671784163 669070363 665851653
2865.7 665851653 662183523 658262908 654228985 650036693 645655274 641317010 637377739 634033203
2882 634033203 631282330 629042566 627287447 626042843 625241935 624698937 624178171 623512268 622715414
2900.3 622715414 621861994 620916367 619761348 618281722 616406441 614126444 611438155 608343065 604998887
2918.7 604998887 601725161 598806798 596410930 594629228 593487978 593056858 593562305 595201492 597898841
2937 597898841 601345003 605259359 609546125 614130139 618802011 623397648 627885878 632262111 636654198
2955.4 636654198 641192138 645711362 649988592 653993428 657810509 661497712 665001571 668291330
2971.7 668291330 671437383 674520791 677581608 680497646 683028221 685172975 687154889 689073384
2988 689073384 690862298 692346573 693421006 694264770 695007503 695529163 695715249 695555806 695193350
3006.4 695193350 694839060 694468081 693801224 692671120 691240132 689770043 688308358 686754167 685006917
3024.7 685006917 683058441 681126714 679371774 677632868 675615788 673329055 671145976 669182658
3041.1 669182658 667165160 664868474 662371039 659961641 657718420 655445695 653033018 650510788
3057.4 650510788 648004949 645676196 643496335 641297936 638902247 636302888 633770406 631502390
3073.7 631502390 629416823 627262890 624884605 622428477 620046377 617660522 615234017 612784028
3090 612784028 610264778 607769549 605447471 603234708 600930572 598501086 596170545 594056606 591936290
3108.4 591936290 589610040 587317467 585318983 583387434 581235647 578796685 576183438 573727071
3124.7 573727071 571594119 569600821 567472279 565174580 563000917 561132371 559287012 557092845
3141 557092845 554694355 552498281 550602973 548893094 547165751 545169592 542945445 540803730 538846254
3159.4 538846254 536956251 535088181 533241332 531401336 529613256 527860403 526045322 524201691
3175.7 524201691 522452950 520830333 519227445 517569363 515888333 514241636 512653172 511071384
3192 511071384 509459913 507841766 506264389 504776299 503348112 501907349 500454247 499020338 497631043
3210.3 497631043 496323675 495047063 493718952 492378056 491079062 489808381 488537878 487246037
3226.7 487246037 486002654 484958291 484023333 482880563 481523573 480206490 479051918 478087395 477247745
3245 477247745 476304293 475131273 473956883 473053187 472328782 471458107 470412999 469445348 468647480
3263.4 468647480 467941403 467268288 466614842 465877354 465022594 464163691 463303268 462423146 461587518 460833073
3283.8 460833073 460135877 459481627 458909422 458353311 457669675 456844896 455916822 454989523 454279333 453792363
3304.2 453792363 453180671 452207148 450987250 449740589 448634446 447660953 446703643 445716023 444749653
3322.5 444749653 443810284 442759126 441598535 440476030 439375579 438333690 437474549 436607450 435517162
3340.9 435517162 434280783 432980210 431772083 430802107 429752588 428335249 426834464 425591141
3357.2 425591141 424553156 423460633 422302604 421333492 420503259 419427097 417980075 416528761 415364116
3375.5 415364116 414365709 413384050 412367433 411398351 410615921 410092056 409784436 409334779 408512533
3393.9 408512533 407681614 407262206 407053143 406467706 405492663 404700637 404281199 403999060 403653264 403122455
3414.3 403122455 402503729 402042747 401755005 401527822 401418656 401500285 401662469 401759624 401934803 402273089
3434.7 402273089 402403146 402140617 401884496 402000666 402413368 402873069 403251350 403616458 404081464 404674798
3455.1 404674798 405402154 406208217 406877100 407516092 408521086 409701616 410465717 410785437 411140084
3473.4 411140084 411778122 412722379 413728416 414466113 415157616 416076481 416970044 417721391 418590128
3491.8 418590128 419667006 420820236 421851993 422783881 423741877 424570054 425267279 426145583 427298963
3510.2 427298963 428574502 429707468 430608988 431560546 432769626 434175283 435434252 436363608 437275767
3528.5 437275767 438414574 439725041 441160798 442554444 443749815 445037872 446592152 448131144
3544.8 448131144 449395269 450582385 451910734 453368306 454938024 456625581 458468139 460340828
3561.1 460340828 462006122 463625222 465766102 468256563 470464289 472529113 474799156 477263302
3577.5 477263302 479898095 482687414 485430986 488017678 490666240 493560731 496419430 499296039
3593.8 499296039 502456844 505782366 509037077 512221098 515291750 518242478 521421611 524843574
3610.1 524843574 528284252 531768680 535075963 538437784 542270303 545867026 548846960 551512361
3626.4 551512361 554722488 558757007 562397838 565686643 568935812 572163761 575426400 578613758
3642.7 578613758 581577182 584528983 588158131 592096329 595199883 598018885 601458132 604889214
3659 604889214 607656777 610195637 612823188 615314960 617771626 620477080 622952878 625479758 628306627
3677.4 628306627 630806386 633141100 635521054 637852013 640137374 642278850 644224942 646143854
3693.7 646143854 648031414 649770558 651336432 652975321 654737473 656321168 657702088 659058988
3710 659058988 660604835 662259996 663704991 664953411 666177869 667454422 668659329 669860721 671156287
3728.4 671156287 672282755 673309624 674611747 676148415 677411497 678061962 678289890 679069459 680531085
3746.7 680531085 681528866 682207406 683191419 684278131 685242653 686275184 687383950 688199043 688828826
3765.1 688828826 689560711 690391183 691300690 692138016 692895651 693718553 694516242 695178270 695770383 696416140
3785.5 696416140 697152913 697977483 698788226 699363768 699873507 700576544 701191068 701787531 702457011 702921510
3805.9 702921510 703552485 704409063 705133915 705598295 705997407 706471443 706872523 707588255 708399296 708969057
3826.3 708969057 709493756 710005760 710630178 711292386 711594224 711721182 712172449 712850571 713519514 714041591
3846.7 714041591 714357138 714416027 714482546 715190351 715993583 716428995 716684103 717007577 717536211 717947066
3867.1 717947066 718148589 718556821 719099045 719634533 719976187 720064402 720437407 721045434 721483767 721775830
3887.5 721775830 721982479 722283900 722717285 723021448 723144352 723265827 723498881 723852813 724327266 724710882
3907.9 724710882 724964797 725257218 725541532 725726426 725901306 726106584 726244152 726375580 726625502 726836205
3928.3 726836205 726953626 727231979 727638185 727857351 727898240 727983534 728188336 728421628 728632390 728902698
3948.7 728902698 729254186 729515254 729621947 729739785 729940593 730138958 730307102 730471075 730641842 730791509
3969.1 730791509 730910182 731035113 731199265 731417120 731660783 731911182 732109368 732183099 732189059 732240498
3989.5 732240498 732418537 732703388 732963562 733110547
3997.6 733110547
##END=$$ End of the data block
