##TITLE=$$ Begin of the data block
##JCAMP-DX=5.00 $$ ACD/SpecManager v 10.08
##SPECTROMETER/DATA SYSTEM=Alpha
##DATE=23 Dec 2014 09:14:34
##DATA TYPE=INFRARED SPECTRUM
##DATA CLASS=XYDATA
##ORIGIN=
##OWNER=
##NPOINTS=1765
##FIRSTX=399.76428223
##LASTX=3997.64306641
##MAXX=3997.64306641
##MINX=399.76428223
##MAXY=0.81257755
##MINY=0.23159635
##XFACTOR=1.0000000000
##YFACTOR=1.000000000000000e-9
##FIRSTY=0.54790086
##DELTAX=2.03961372
##XUNITS=1/CM
##YUNITS=ARBITRARY UNITS
##XYDATA=(X++(Y..Y))
$$ plain form
399.8 547900856 542574942 538645446 535279930 532833040 532443166 534741342 538543701 541511178 541657507
418.1 541657507 538895190 536711156 535754979 534038067 530248284 525235713 520982623 518270373 516752601
436.5 516752601 516547322 518018126 521343112 526281178 531932712 536954224 539917052 540392935 539678454
454.8 539678454 539375603 539226294 537916958 535069287 531401694 528076231 525639534 523292780 519708455
473.2 519708455 515592456 512726545 511487901 511144936 510822177 510037959 509125531 508712471 508739889
491.5 508739889 508362472 506852567 504388869 501751423 499527723 497705430 495541751 492214680 487930208
509.9 487930208 483574331 479651451 475825012 471429914 466578215 462215155 459342659 458124787
526.2 458124787 457816005 457824677 458235115 459711909 463137537 468610853 474994957 480574638 484135866
$$ packed form
399.8E47900856n325914l929496l365516k446890l89874K298176L802359K967477J46329
418.1E41657507k762317k184034r56177j716912l789783n012571m253090k712250j517772
436.5E16752601k05279J470804L324986M938066N651534N021512K962828M75883p14481
454.8E39678454l02851j49309j309336k847671l667593l325463k436697k346754l584325
473.2E19708455m115999k865911j238644l42965l22759p84218r12428m13060K7418
491.5E08739889l77417j509905k463698k637446k223700j822293k163679l327071m284472
509.9D87930208m355877l922880l826439m395098m851699m363060k872496j217872
526.2D58124787l08782Q672M10438J476794L425628N473316O384104N579681L561228
$$ plain form
544.6 484135866 485780627 486385524 486329824 485298693 483019263 479707211 475790471 471446157 466445178
562.9 466445178 460395813 452995479 444942147 438161284 434129834 433065593 434577733 438292593
579.3 438292593 443998069 451334983 459363222 466691107 472200155 475514084 477110654 478036106 478696525
597.6 478696525 478798747 478194952 477203339 476614445 476987004 478067935 479200810 480176061 481608540
616 481608540 484280139 488112628 492265612 496055484 499339074 502360106 505403936 508504987 511148036
634.3 511148036 512771428 513643920 514638186 516153276 517768681 518927217 519509137 519956350 520944417
652.7 520944417 522582293 524194777 525175869 525600135 525996268 526629925 527840614 529921651 531367123
671 531367123 532212615 533536434 535585046 537819207 539602220 540642560 541187644 541848838 542856216
$$ packed form
544.6D84135866J644761O04897n5700j031131k279430l312052l916740m344314n000979
562.9D66445178o049365p400334q053332o780863m031450j064241J512140L714860
579.3D38292593N705476P336914Q028239P327885N509048L313929J596570R25452O60419
597.6D78696525J02222o03795r91613n88894L72559J080931J132875R75251J432479
616D81608540K671599L832489M152984L789872L283590L021032L043830L101051K643049
634.3E11148036J623392Q72492R94266J515090J615405J158536N81920M47213R88067
652.7E20944417J637876J612484R81092M24266L96133O33657J210689K081037J445472
671E31367123Q45492J323819K048612K234161J783013J040340N45084O61194J007378
$$ plain form
689.4 542856216 543607414 543241262 541468501 538807809 536062062 533468902 530747652 527917683 525673270
707.7 525673270 524963856 526351392 529507935 533445656 537567377 542228043 547978044 554663241 561440408
726.1 561440408 567307293 571910322 575772583 579621553 583562732 586781740 588404477 588474989 587796330
744.5 587796330 586812556 585043550 581813216 577100813 571659207 566549003 562315345 558774889 555631995
762.8 555631995 553244054 552724242 555065334 560301483 567481339 575497091 583858669 592611194 601603448
781.2 601603448 610038638 617009699 622251034 626393437 630425334 634897053 639551759 643803895
797.5 643803895 647625268 651489615 655613363 659653008 662863016 664704740 665555000 666335106 667549789
815.8 667549789 668803453 669322610 668785036 667447507 665680468 663491368 660443425 656143188 650829792
$$ packed form
689.4E42856216P51198l66152j772761k660692k745747k593160k721250k829969k244413
707.7E25673270p09414J387536L156543L937721M121721M660666N750001O685197O777167
726.1E61440408N866885M603029L862261L848970L941179L219008J622737P0512o78659
744.5E87796330r83774j769006l230334m712403n441606n110204m233658l540456l142894
762.8E55631995k387941n19812K341092N236149P179856Q015752Q361578Q752525Q992254
781.2F01603448Q435190O971061N241335M142403M031897M471719M654706M252136
797.5F43803895L821373L864347M123748M039645L210008J841724Q50260P80106J214683
815.8F67549789J253664N19157n37574j337529j767039k189100l047943m300237n313396
$$ plain form
834.2 650829792 645281911 640191555 635614574 631214976 626743376 622196794 617787004 613582671
850.5 613582671 609283745 604312062 598361433 592412770 588960290 590530872 597527623 608088434
866.8 608088434 620309830 633263290 645953000 656937897 665042520 669684827 670763373 668782353
883.2 668782353 664787650 659751594 654102564 647986352 641742647 635894656 630732536 626046002
899.5 626046002 621227741 615596950 608808100 600995600 592388332 582850873 572171867 560681283
915.8 560681283 549412191 539763808 532759190 528464079 526116848 524937570 524899065 526435792 529573441
934.1 529573441 533784211 538577735 543960989 549937963 555391967 558077753 556210995 549632430
950.5 549632430 539379776 526738226 512587845 497196376 480546504 462767214 444158703
$$ packed form
834.2F50829792n547881n090356m576981m399598m471600m546582m409790m204333
850.5F13582671m298926m971683n950629n948663l452480J570582O996751J0560811
866.8F08088434J2221396J2953460J2689710J0984897Q104623M642307J078546j981020
883.2F68782353l994703n036056n649030o116212o243705n847991n162120m686534
899.5F26046002m818261n630791o788850p812500q607268r537459j0679006j1490584
915.8E60681283j1269092r648383p004618m295111k347231j179278l8505J536727L137649
934.1E29573441M210770M793524N383254N976974N454004K685786j866758o578565
950.5E49632430j0252654j2641550j4150381j5391469j6649872j7779290j8608511
$$ plain form
964.7 444158703 424906254 404958457 384245336 362927407 341508865 320733428 301280916
979 301280916 283759713 268723756 256445795 246945515 240109831 235649481 233056992 231824577
995.3 231824577 231596351 232087389 233006626 233988792 234621808 234629124 234017074 233120248 232462078 232467100
1015.7 232467100 233328491 234997392 237391174 240515605 244367197 248747066 253245264 257496536
1032 257496536 261142075 263810158 265381932 266120732 266470104 266833603 267508030 268823653 271296203
1050.4 271296203 275438040 281383753 288853854 297565103 307473898 318594247 330094159 339309365
1066.7 339309365 342368364 337072074 325545549 313042551 303864688 299105406 297924340 299385607
1083 299385607 302847743 307801127 313875198 320740074 327921093 334709466 340299696 344138622 346145570
$$ packed form
964.7D44158703j9252449j9947797k0713121k1317929k1418542k0775437j9452512
979C01280916j7521203j5035957j2277961r500280o835684m460350k592489j232415
995.3B31824577k28226M91038R19237R82166O33016P316o12050q96826o58170N022
1015.7B32467100Q61391J668901K393782L124431L851592M379869M498198M251272
1032B57496536L645539K668083J571774P38800L49372L63499O74427J315623K472550
1050.4B71296203M141837N945713P470101Q711249R908795J1120349J1499912R215206
1066.7C39309365L058999n296290j1526525j2502998r177863m759282j181066J461267
1083B99385607L462136M953384O074071O864876P181019O788373N590230L838926K006948
$$ plain form
1101.4 346145570 346871495 347482800 349222809 352554142 356997371 361777633 366213500 369830728 372571290
1119.8 372571290 374681711 376489013 378551126 381587118 385933816 391004205 395331234 397226065
1136.1 397226065 395616502 390550256 383006424 374279380 365411669 357108891 349927187 344323516
1152.4 344323516 340560555 338672996 338560641 340141863 343546361 349150211 357320338 368053555
1168.7 368053555 380881667 395051122 409872860 424925297 439980239 454759330 468829334
1183 468829334 481763154 493202329 502883255 510672390 516528904 520552039 523142040 524940610
1199.3 524940610 526531041 528248966 530285954 532868922 536255479 540612757 545811415 551333785
1215.6 551333785 556476057 560626924 563416421 564763367 564824462 563866615 562169373 560017288 557697475
$$ packed form
1101.4C46145570P25925O11305J740009L331333M443229M780262M435867L617228K740562
1119.8C72571290K110421J807302K062113L035992M346698N070389M327029J894831
1136.1C97226065j609563n066246p543832q727044q867711q302778p181704n603671
1152.4C44323516l762961j887559j12355J581222L404498N603850Q170127J0733217
1168.7C68053555J2828112J4169455J4821738J5052437J5054942J4779091J4070004
1183D68829334J2933820J1439175R680926P789135N856514M023135K590001J798570
1199.3E24940610J590431J717925K036988K582968L386557M357278N198658N522370
1215.6E51333785N142272M150867K789497J346946O1095r57847j697242k152085k319813
$$ plain form
1234 557697475 555445731 553419471 551747501 550616562 550260603 550839305 552259922 554233551 556435168
1252.3 556435168 558514237 560205996 561424315 562270403 563028753 564094543 565744519 567920625 570261776
1270.7 570261776 572263479 573503017 573849142 573480844 572682679 571713150 570783794 569927096 568992078
1289 568992078 567812204 566275060 564346850 562100708 559671879 557212293 554815233 552463770 550173163
1307.4 550173163 548141718 546552479 545303762 544123352 542856872 541415215 539464593 536480725
1323.7 536480725 532132864 526594818 520502865 514605820 509464920 505406857 502625167 501114428
1340 501114428 500618994 500822186 501414597 502000988 502262294 502145529 501717687 501022696 500157773 499337554
1360.4 499337554 498680830 498129457 497673541 497439176 497607797 498388678 499669492 500845850 501770377
$$ packed form
1234E57697475k251744k026260j671970j130939l55959N78702J420617J973629K201617
1252.3E56435168K079069J691759J218319Q46088P58350J065790J649976K176106K341151
1270.7E70261776K001703J239538L46125l68298p98165r69529r29356q56698r35018
1289E68992078j179874j537144j928210k246142k428829k459586k397060k351463k290607
1307.4E50173163k031445j589239j248717j180410j266480j441657j950622k983868
1323.7E36480725m347861n538046o091953n897045n140900m058063k781690j510739
1340E01114428m95434K03192N92411N86391K61306j16765m27842o94991q64923q20219
1360.4D99337554o56724n51373m55916k34365J68621P80881J280814J176358R24527
$$ plain form
1378.8 501770377 502720177 504163742 506909549 511483908 516478419 520098329 522538722 524001479
1395.1 524001479 524206877 523358822 521893382 520137966 518130481 515899837 513560593 511181593 508966088
1413.5 508966088 507205725 505999088 505230486 504809976 504898190 505476534 506498277 508045435 509749591
1431.8 509749591 511398852 513598859 516052186 517827988 519449651 520973742 522032261 522334635
1448.1 522334635 521685421 520408809 519000113 517484128 515850663 515065849 515716553 518381417 522605062
1466.5 522605062 527400076 534060419 544512391 555786073 565028787 573102951 580750763 588093400
1482.8 588093400 594755054 601351678 608435392 614821970 619277596 623367012 628403664 633082747
1499.1 633082747 636524141 639301777 642839968 647801340 650886655 652637362 654558539 656740606
$$ packed form
1378.8E01770377R49800J443565K745807M574359M994511L619910K440393J462757
1395.1E24001479K05398q48055j465440j755416k007485k230644k339244k379000k215505
1413.5E08966088j760363j206637p68602m20510Q8214N78344J021743J547158J704156
1431.8E09749591J649261K200007K453327J775802J621663J524091J058519L02374
1448.1E22334635o49214j276612j408696j515985j633465p84814O50704K664864M223645
1466.5E22605062M795014O660343J0451972J1273682R242714Q074164P647812P342637
1482.8E88093400O661654O596624P083714O386578M455626M089416N036652M679083
1499.1F33082747L441394K777636L538191M961372L085315J750707J921177K182067
$$ plain form
1515.4 656740606 659103572 661470354 664132118 666259229 667638123 668923736 670032024 671429098
1531.8 671429098 673141539 674227834 675181389 676936388 677866518 677655101 677370965 677119970 676860213
1550.1 676860213 676492572 676117778 675936759 675814629 674160361 671872258 669912994 668232381 666646421
1568.5 666646421 664670348 662552297 660590231 658322155 655862391 653674304 651564181 649391174
1584.8 649391174 647183955 645062685 643015862 640966475 638782859 636450112 634110451 631811678
1601.1 631811678 629469693 626975775 624303102 621352375 618264318 615355790 612405777 608856082
1617.4 608856082 605472982 602542520 599514186 596481860 593505561 590581357 588211477 586721539
1633.7 586721539 585829020 584839225 583897710 583421588 583593726 584846735 586621881 587760150 589990735
$$ packed form
1515.4F56740606K362966K366782K661764K127111J378894J285613J108288J397074
1531.8F71429098J712441J086295R53555J754999R30130k11417k84136k50995k59757
1550.1F76860213l67641l74794j81019j22130j654268k288103j959264j680613j585960
1568.5F66646421j976073k118051j962066k268076k459764k188087k110123k173007
1584.8F49391174k207219k121270k046823k049387k183616k332747k339661k298773
1601.1F31811678k341985k493918k672673k950727l088057k908528k950013l549695
1617.4F08856082l383100k930462l028334l032326k976299k924204k369880j489938
1633.7E86721539q92519r89795r41515m76122J72138J253009J775146J138269K230585
$$ plain form
1652.1 589990735 593944132 596089303 597873747 600790143 604860961 608956099 612331152 616510868
1668.4 616510868 621801555 626276374 630912364 636053741 640360475 644418061 649726272 656869888
1684.7 656869888 662016094 665566027 669346690 672882020 677021146 681579769 685368121 688876331
1701.1 688876331 691171944 693090737 695248783 696948469 698419094 700032413 702094615 704699218
1717.4 704699218 706545174 707525551 708687067 710245967 712034643 714092791 716248035 718761802
1733.7 718761802 720758200 721950352 723645985 725754917 727766931 729881942 732345700 735387266
1750 735387266 738527417 741141498 743744135 746395588 748838961 751435757 753659308 755456448 757290602
1768.4 757290602 759179950 761135161 762616932 763588011 764632046 765798986 766849339 767872453
$$ packed form
1652.1E89990735L953397K145171J784444K916396M070818M095138L375053M179716
1668.4F16510868N290687M474819M635990N141377M306734M057586N308211P143616
1684.7F56869888N146206L549933L780663L535330M139126M558623L788352L508210
1701.1F88876331K295613J918793K158046J699686J470625J613319K062202K604603
1717.4G04699218J845956R80377J161516J558900J788676K058148K155244K513767
1733.7G18761802J996398J192152J695633K108932K012014K115011K463758L041566
1750G35387266L140151K614081K602637K651453K443373K596796K223551J797140J834154
1768.4G57290602J889348J955211J481771R71079J044035J166940J050353J023114
$$ plain form
1784.7 767872453 768897414 769865870 771037638 772353709 773218632 773858488 774720907 775718451 776504517
1803 776504517 777116477 777849317 778751254 779622138 780248284 780785859 781435013 782136440 782800138 783510864
1823.4 783510864 784239054 784837782 785428941 785870850 786126971 786475062 786882341 787187815 787541866 788115323
1843.8 788115323 788549721 788653314 788710296 788827956 788981974 789185047 789421737 789647341 789844334 790063024
1864.2 790063024 790407658 790871263 791146159 791167796 791232765 791440845 791726887 792033911 792359471 792698443
1884.6 792698443 793045223 793443859 793795645 794044197 794306099 794516087 794621110 794743598 794905365 795045674
1905 795045674 795159757 795289457 795390069 795427978 795531988 795769751 795955658 796032310 796153724 796269774
1925.4 796269774 796350658 796437085 796503305 796558797 796626031 796719849 796860099 797085285 797270775 797317207 797371209
$$ packed form
1784.7G67872453J024961R68456J171768J316071Q64923O39856Q62419R97544P86066
1803G76504517O11960P32840R01937Q70884O26146N37575O49154P01427O63698P10726
1823.4G83510864P28190N98728N91159M41909K56121L48091M07279L05474L54051N73457
1843.8G88115323M34398J03593N6982J17660J54018K03073K36690K25604J96993K18690
1864.2G90063024L44634M63605K74896K1637O4969K08080K86042L07024L25560L38972
1884.6G92698443L46780L98636L51786K48552K61902K09988J05023J22488J61767J40309
1905G95045674J14083J29700J00612L7909J04010K37763J85907P6652J21414J16050
1925.4G96269774Q0884Q6427O6220N5492O7234R3818J40250K25186J85490M6432N4002
$$ plain form
1947.9 797371209 797522247 797720134 797908366 798066556 798207641 798361301 798520267 798702836 798918545 799085081
1968.3 799085081 799174368 799271107 799404085 799545944 799681544 799781978 799840629 799851954 799858093 799936533 800082147
1990.7 800082147 800171435 800108373 799999714 799970567 799995184 799976408 799862206 799674571 799454272 799211681
2011.1 799211681 798952878 798664987 798310041 797844887 797296286 796729863 796227217 795916915 795705557 795419931
2031.5 795419931 795093298 794764876 794394016 793980420 793596089 793297291 793053210 792800963 792546153 792333245
2051.9 792333245 792201221 792151749 792142153 792131543 792097151 792072713 792102635 792181671 792284787 792346239 792292416
2074.3 792292416 792198598 792204976 792324007 792433858 792436242 792392790 792425752 792591929 792806745 792951047 793007851
2096.8 793007851 793041408 793163896 793403149 793629467 793745577 793781996 793801308 793905437 794108152 794250727
$$ packed form
1947.9G97371209J51038J97887J88232J58190J41085J53660J58966J82569K15709J66536
1968.3G99085081Q9287R6739J32978J41859J35600J00434N8651J1325O139P8440J45614
1990.7H00082147Q9288o3062j08659k9147K4617j8776j14202j87635k20299k42591
2011.1G99211681k58803k87891l54946m65154n48601n66423n02646l10302k11358k85626
2031.5G95419931l26633l28422l70860m13596l84331k98798k44081k52247k54810k12908
2051.9G92333245j32024m9472r596j0610l4392k4438K9922P9036J03116O1452n3823
2074.3G92292416r3818O378J19031J09851K384m3452L2962J66177K14816J44302N6804
2096.8G93007851L3557J22488K39253K26318J16110L6419J9312J04129K02715J42575
$$ plain form
2117.1 794250727 794237971 794146955 794084489 794110954 794208169 794259429 794189155 794074178 794060290 794172704 794293106
2139.6 794293106 794336498 794330359 794331849 794376493 794469893 794555783 794587553 794606805 794709265 794958115 795307755
2162 795307755 795621395 795817375 795984030 796322763 796885610 797482252 797941923 798271179 798600554 799048424
2182.4 799048424 799600780 800118446 800491095 800754368 801040828 801440537 801900744 802294791 802557230 802782416
2202.8 802782416 803125143 803610981 804116607 804503083 804772019 805041075 805397451 805824101 806222439 806506872
2223.2 806506872 806705475 806915879 807215810 807577491 807857156 808001876 808120549 808311403 808579683 808867157
2243.6 808867157 809077382 809169650 809241891 809402168 809624732 809825361 809963644 810054958 810174823 810381174
2264 810381174 810642898 810890138 811066866 811160862 811260343 811466932 811745048 811980724 812098324 812120140
$$ packed form
2117.1G94250727j2756r1016o2466K6465R7215N1260p0274j14977j3888J12414J20402
2139.6G94293106M3392o139J490M4644R3400Q5890L1770J9252J02460K48850L49640
2162G95307755L13640J95980J66655L38733N62847N96642M59671L29256L29375M47870
2182.4G99048424N52356N17666L72649K63273K86460L99709M60207L94047K62439K25186
2202.8H02782416L42727M85838N05626L86476K68936K69056L56376M26650L98338K84433
2223.2H06506872J98603K10404K99931L61681K79665J44720J18673J90854K68280K87474
2243.6H08867157K10225R2268P2241J60277K22564K00629J38283R1314J19865K06351
2264H10381174K61724K47240J76728R3996R9481K06589K78116K35676J17600K1816
$$ plain form
2284.4 812120140 812163651 812314212 812499583 812577546 812498629 812355936 812294781 812333941 812352836 812212825 811919153
2306.8 811919153 811664462 811574161 811552465 811428189 811111152 810668409 810296476 810137212 810081780 809871554
2327.2 809871554 809493661 809194386 809026361 808804512 808493435 808211029 808008492 808052540 808493555 808730483
2347.6 808730483 808261454 807363808 806467652 805774927 805441499 805452585 805523276 805522561 805605054 805909932 806407273
2370.1 806407273 806920648 807267010 807432115 807576537 807832062 808118165 808280408 808244824 808027089 807728708
2390.4 807728708 807514369 807425201 807297349 807018101 806647599 806295276 806016684 805783093 805471718 805005968
2410.8 805005968 804484487 804050505 803707838 803330243 802839518 802250862 801615536 801035106 800573707 800150275
2431.2 800150275 799626410 798956156 798235714 797599971 797057688 796515167 795905173 795224488 794537961 793949425
$$ packed form
2284.4H12120140M3511J50561J85371P7963p8917j42693o1155L9160J8895j40011k93672
2306.8H11919153k54691r0301k1696j24276l17037m42743l71933j59264n5432k10226
2327.2H09871554l77893k99275j68025k21849l11077k82406k02537M4048M41015K36928
2347.6H08730483m69029q97646q96156o92725l33428J1086P0691p15Q2493L04878M97341
2370.1H06407273N13375L46362J65105J44422K55525K86103J62243l5584k17735k98381
2390.4H07728708k14339q9168j27852k79248l70502l52323k78592k33591l11375m65750
2410.8H05005968n21481m33982l42667l77595m90725n88656o35326n80430m61399m23432
2431.2H00150275n23865o70254p20442o35743n42283n42521o09994o80685o86527n88536
$$ plain form
2451.6 793949425 793467522 792961836 792330980 791628659 790965021 790424526 789996147 789535463 788966537 788341045
2472 788341045 787750125 787264764 786835730 786353827 785761535 785127759 784635127 784332931 784041822 783592522
2492.4 783592522 783022344 782524586 782220185 782037437 781807423 781417131 780919731 780492902 780237854 780053139
2512.8 780053139 779759943 779282272 778714061 778228998 777881622 777553797 777081549 776408553 775670707 775057554
2533.2 775057554 774588943 774094939 773404241 772551835 771732211 771103680 770624042 770066619 769302428 768457770
2553.6 768457770 767742693 767215908 766730130 766096294 765305877 764544904 763951778 763481140 762993336 762348831
2574 762348831 761563420 760831952 760260999 759776473 759269297 758669615 758004844 757418752 757007182 756704867
2594.4 756704867 756345332 755821168 755224645 754721403 754340112 753954589 753390074 752619147 751805663 751068354
$$ packed form
2451.6G93949425m81903n05686o30856p02321o63638n40495m28379m60684n68926o25492
2472G88341045n90920m85361m29034m81903n92292o33776m92632l02196k91109m49300
2492.4G83592522n70178m97758l04401j82748k30014l90292m97400m26829k55048j84715
2512.8G80053139k93196m77671n68211m85063l47376l27825m72248o72996p37846o13153
2533.2G75057554m68611m94004o90698q52406q19624o28531m79638n57423p64191q44658
2553.6G68457770p15077n26785m85778o33836p90417p60973n93126m70638m87804o44505
2574G62348831p85411p31468n70953m84526n07176n99682o64771n86092m11570l02315
2594.4G56704867l59535n24164n96523n03242l81291l85523n64515p70927q13484p37309
$$ plain form
2614.8 751068354 750379860 749630988 748708725 747639894 746583045 745624006 744678795 743624747 742430627
2633.2 742430627 741160214 739929020 738819182 737767279 736596465 735262215 733943641 732796729
2649.5 732796729 731768906 730716109 729556680 728299916 727047443 725931346 724977791 724042237 722963631
2667.8 722963631 721786439 720698833 719786584 718979418 718135417 717143238 716056526 715048850 714227319
2686.2 714227319 713498235 712650716 711611986 710509658 709484041 708542347 707604468 706553161 705328941
2704.5 705328941 704047561 702865839 701807976 700780272 699684739 698501229 697334111 696335316
2720.9 696335316 695509851 694663048 693655729 692628622 691760182 691037774 690361500 689613700 688723624
2739.2 688723624 687813342 687072039 686466038 685827732 685065269 684200644 683378160 682740271 682260573 681781590
$$ packed form
2614.8G51068354o88494p48872r22263j068831j056849r59039r45211j054048j194120
2633.2G42430627j270413j231194j109838j051903j170814j334250j318574j146912
2649.5G32796729j027823j052797j159429j256764j252473j116097r53555r35554j078606
2667.8G22963631j177192j087606r12249q07166q44001r92179j086712j007676q21531
2686.2G14227319p29084q47519j038730j102328j025617r41694r37879j051307j224220
2704.5G05328941j281380j181722j057863j027704j095533j183510j167118r98795
2720.9F96335316q25465q46803j007319j027107q68440p22408o76274p47800q90076
2739.2F88723624r10282p41303o06001o38306p62463q64625q22484o37889m79698m78983
$$ plain form
2759.6 681781590 681169033 680433691 679730952 679160357 678626180 677951455 677103221 676213264 675378263 674583554
2780 674583554 673731863 672713041 671539366 670332432 669170320 668025315 666773558 665307343 663675964
2798.4 663675964 662011623 660403490 658806920 657076418 655151546 653126359 651138663 649228156
2814.7 649228156 647269666 645119965 642792165 640387893 637998462 635644376 633240342 630679846
2831 630679846 627950430 625155210 622353196 619415462 616190076 612706125 609059393 605292916 601502359
2849.3 601502359 597885311 594602406 591678262 589046359 586529195 583829761 580681324 576949537
2865.7 576949537 572631359 567889869 562920511 557724595 552312553 546927810 541911244 537553430
2882 537553430 533991694 531220317 529165328 527697146 526683748 526000559 525473356 524903297 524151266
$$ packed form
2759.6F81781590o12557p35342p02739n70595n34177o74725q48234q89957q35001p94709
2780F74583554q51691j018822j173675j206934j162112j145005j251757j466215j631379
2798.4F63675964j664341j608133j596570j730502j924872k025187j987696j910507
2814.7F49228156j958490k149701k327800k404272k389431k354086k404034k560496
2831F30679846k729416k795220k802014k937734l225386l483951l646732l766477l790557
2849.3F01502359l617048l282905k924144k631903k517164k699434l148437l731787
2865.7E76949537m318178m741490m969358n195916n412042n384743n016566m357814
2882E37553430l561736k771377k054989j468182j013398o83189n27203n70059p52031
$$ plain form
2900.3 524151266 523146689 521879077 520391464 518670022 516552746 513859093 510550022 506752193
2916.6 506752193 502720177 498733938 495017320 491730958 489060134 487253577 486519545 487024784 488863498
2935 488863498 491940558 496028900 500903189 506342411 512081444 517889857 523693562 529489696 535258234
2953.4 535258234 541018665 546761990 552370846 557669699 562532663 566983759 571120322 574989736
2969.7 574989736 578614652 582028985 585299194 588530183 591699243 594596267 597087204 599250674
2986 599250674 601248503 603145599 604822934 606142342 607106090 607758343 608151257 608364880 608363926 608047783
3006.4 608047783 607450962 606668830 605694473 604452312 602916181 601124942 599153638 597112536 595041394
3024.7 595041394 592895567 590692163 588446856 586114883 583634138 581053913 578558922 576112270
$$ packed form
2900.3E24151266j004577j267612j487613j721442k117276k693653l309071l797829
2916.6E06752193m032016l986239l716618l286362k670824j806557p34032N05239J838714
2935D88863498L077060M088342M874289N439222N739033N808413N803705N796134N768538
2953.4E35258234N760431N743325N608856N298853M862964M451096M136563L869414
2969.7E74989736L624916L414333L270209L230989L169060K897024K490937K163470
2986E99250674J997829J897096J677335J319408R63748O52253L92914K13623r54l16143
3006.4F08047783n96821p82132r74357j242161j536131j791239j971304k041102k071142
3024.7E95041394k145827k203404k245307k331973k480745k580225k494991k446652
$$ plain form
3041.1 576112270 573491991 570682108 567850769 565121233 562438250 559666634 556803226 553907573
3057.4 553907573 551015794 548214257 545545220 542912900 540123880 537124217 534136176 531342685
3073.7 531342685 528725982 526152134 523452342 520588875 517660320 514760852 511937976 509127200
3090 509127200 506221831 503307283 500540078 497905344 495222449 492384344 489574969 486981273 484466642
3108.4 484466642 481819302 479179889 476741105 474336982 471773535 469024271 466171771 463383228
3124.7 463383228 460762799 458282590 455815166 453294158 450818270 448481470 446171075 443690985
3141 443690985 441118151 438659281 436328381 434141219 432069987 429875404 427489817 425110728 422821820
3159.4 422821820 420595437 418438047 416340917 414250255 412149847 410081059 408059001 406107903
$$ packed form
3041.1E76112270k620279k809883k831339k729536k682983k771616k863408k895653
3057.4E53907573k891779k801537k669037k632320k789020k999663k988041k793491
3073.7E31342685k616703k573848k699792k863467k928555k899468k822876k810776
3090E09127200k905369k914548k767205k634734k682895k838105k809375k593696k514631
3108.4D84466642k647340k639413k438784k404123k563447k749264k852500k788543
3124.7D63383228k620429k480209k467424k521008k475888k336800k310395k480090
3141D43690985k572834k458870k330900k187162k071232k194583k385587k379089k288908
3159.4D22821820k226383k157390k097130k090662k100408k068788k022058j951098
$$ plain form
3175.7 406107903 404228359 402373105 400516361 398647785 396771312 394922405 393140793 391422898
3192 391422898 389715791 387976319 386222422 384523362 382946730 381440341 379894137 378312856 376779079
3210.3 376779079 375326604 373921841 372534871 371164888 369802356 368409812 366996795 365644127
3226.7 365644127 364421129 363368183 362366855 361135274 359721690 358441591 357331604 356290996
3243 356290996 355315387 354349017 353297532 352220595 351227850 350299448 349359512 348410815 347509861 346647143
3263.4 346647143 345797211 345056117 344468832 343842804 343045861 342140645 341233015 340394944 339616746 338886887
3283.8 338886887 338214427 337625086 337136447 336615443 335909843 335076809 334229410 333466411 332893074 332437128
3304.2 332437128 331883490 331098408 330120444 329114348 328196436 327341795 326548278 325853467 325211555
$$ packed form
3175.7D06107903j879544j855254j856744j868576j876473j848907j781612j717895
3192C91422898j707107j739472j753897j699060j576632j506389j546204j581281j533777
3210.3C76779079j452475j404763j386970j369983j362532j392544j413017j352668
3226.7C65644127j222998j052946j001328j231581j413584j280099j109987j040608
3243C56290996r75609r66370j051485j076937r92745r28402r39936r48697r00954q62718
3263.4C46647143q49932p41094n87285o26028p96943r05216r07630q38071p78198p29859
3283.8C38886887o72460n89341m88639n21004p05600q33034q47399p62999n73337m55946
3304.2C32437128n53638p85082r77964j006096r17912q54641p93517o94811o41912
$$ plain form
3322.5 325211555 324517399 323667675 322704345 321810693 321053922 320393056 319798559 319139004 318320066 317426950
3342.9 317426950 316539526 315768719 315155417 314429730 313439995 312439144 311638594 310979784 310301006
3361.3 310301006 309629917 309159726 308763415 308082312 307056814 306040555 305333704 304807216 304226965
3379.6 304226965 303567797 302957922 302499145 302282274 302312255 302249193 301780015 301212788 301049799 301115006
3400 301115006 300823867 300183713 299707323 299518317 299427092 299314857 299076706 298780620 298623353 298584074
3420.4 298584074 298546255 298585594 298808873 299131125 299384922 299652934 300039172 300289750 300224543 300116569
3440.8 300116569 300242662 300599158 301065415 301473826 301831484 302239925 302726656 303358525 304120928 304805905
3461.2 304805905 305448741 306334853 307346821 308028609 308314323 308643460 309323937 310292989 311221778
$$ packed form
3322.5C25211555o94156q49724r63330q93652p56771o60866n94497o59555q18938q93116
3342.9C17426950q87424p70807o13302p25687r89735j000851q00550o58810o78778
3361.3C10301006o71089m70191l96311o81103j025498j016259p06851n26488n80251
3379.6C04226965o59168o09875m58777k16871K9981o3062m69178n67227j62989O5207
3400C01115006k91139o40154m76390j89006r1225j12235k38151k96086j57267l9279
3420.4B98584074l7819L9339K23279L22252K53797K68012L86238K50578o5207j07974
3440.8C00116569J26093L56496M66257M08411L57658M08441M86731O31869P62403O84977
3461.2C04805905O42836Q86112J011968O81788K85714L29137O80477R69052R28789
$$ plain form
3479.6 311221778 311891586 312542289 313391477 314247459 315016538 315883100 316889018 317949742 318932950
3497.9 318932950 319861680 320852458 321709096 322368771 323184669 324303418 325555354 326657176 327496201
3516.3 327496201 328330278 329423875 330777138 332013518 332945645 333863616 334933221 336162597 337572455
3534.6 337572455 338927448 340046585 341249973 342727304 344279975 345649868 346886426 348273218
3551 348273218 349857926 351455688 353151113 355161697 357278705 359181374 361206681 363912821 366639704
3569.3 366639704 368827403 371002942 373515338 376265883 379177183 382161111 385095567 388129592
3585.6 388129592 391486645 394771129 397702187 400796860 404260129 407818407 411420226 415053606
3601.9 415053606 418448210 421694756 425330549 429209322 433067650 436999112 440704077 444626391
$$ packed form
3479.6C11221778O69808O50703Q49188Q55982P69079Q66562J005918J060724R83208
3497.9C18932950R28730R90778Q56638O59675Q15898J118749J251936J101822Q39025
3516.3C27496201Q34077J093597J353263J236380R32127R17971J069605J229376J409858
3534.6C37572455J354993J119137J203388J477331J552671J369893J236558J386792
3551C48273218J584708J597762J695425K010584K117008J902669K025307K706140K726883
3569.3C66639704K187699K175539K512396K750545K911300K983928K934456L034025
3585.6C88129592L357053L284484K931058L094673L463269L558278L601819L633380
3601.9D15053606L394604L246546L635793L878773L858328L931462L704965L922314
$$ plain form
3618.3 444626391 449051082 452819884 455776930 458803147 463218212 468267471 472104132 475677043
3634.6 475677043 479427546 483135372 486880481 490467310 493752748 497413665 502454996 507475674
3650.9 507475674 510716021 513680935 517654955 521539986 524766266 527835131 530800998 533681870
3667.2 533681870 537151337 540844619 543710470 547016680 550498426 552977979 555323422 557787836
3683.5 557787836 560280979 563263237 566520095 568985760 570858359 572693646 574486613 576313674
3699.8 576313674 578458607 580498338 582080185 583669424 585713029 588120759 590049982 591345251
3716.2 591345251 592569411 593962014 595471740 597014427 598544657 599852264 600969493 602463126
3732.5 602463126 604572535 606637478 607794642 608107686 608582973 610163867 611622214 612462699 613991678
$$ packed form
3618.3D44626391M424691L768802K957046L026217M415065N049259L836661L572911
3634.6D75677043L750503L707826L745109L586829L285438L660917N041331N020678
3650.9E07475674L240347K964914L974020L885031L226280L068865K965867K880872
3667.2E33681870L469467L693282K865851L306210L481746K479553K345443K464414
3683.5E57787836K493143K982258L256858K465665J872599J835287J792967J827061
3699.8E76313674K144933K039731J581847J589239K043605K407730J929223J295269
3716.2E91345251J224160J392603J509726J542687J530230J307607J117229J493633
3732.5F02463126K109409K064943J157164L13044M75287J580894J458347Q40485J528979
$$ plain form
3750.8 613991678 615557969 616247833 616790771 617841303 619002342 619821846 620747924 621853232 622968674
3769.2 622968674 624019921 624778986 625470638 626462519 627691209 628591955 629188836 630008340 630946875
3787.5 630946875 631786883 632504225 633127689 633943379 634788394 635570645 636788487 637644291 638079882
3805.9 638079882 638927519 639591157 639840245 640262187 641242623 642144740 643008769 644209504 644734144
3824.3 644734144 644936800 645360589 645871401 646597445 647422135 648183703 648966193 649584413 650052071 650526822
3844.6 650526822 650772989 650669873 650604963 651705205 653567553 654104233 653977096 654086947 654610038
3863 654610038 655238390 655500829 655916750 656753182 657363355 657790065 657949448 658176720 658837438 659410477
3883.4 659410477 659971595 660291910 660341620 660820842 661316574 661332071 661446512 662026286 662752211 663369954
$$ packed form
3750.8F13991678J566291O89864N42938J050532J161039Q19504R26078J105308J115442
3769.2F22968674J051247P59065O91652R91881J228690R00746N96881Q19504R38535
3787.5F30946875Q40008P17342O23464Q15690Q45015P82251J217842Q55804M35591
3805.9F38079882Q47637O63638K49088M21942R80436R02117Q64029J200735N24640
3824.3F44734144K02656M23789N10812P26044Q24690P61568P82490O18220M67658M74751
3844.6F50526822K46167j03116o4910J100242J862348N36680j27137J09851N23091
3863F54610038O28352K62439M15921Q36432O10173M26710J59383K27272O60718N73039
3883.4F59410477N61118L20315M9710M79222M95732J5497J14441N79774P25925O17743
$$ plain form
3903.8 663369954 663689435 663649321 663637221 663800359 664002419 664355457 664853871 665157795 665253162 665480018
3924.2 665480018 665763438 665873885 666099548 666575015 666896284 666953981 667004347 667157650 667425692 667682648
3944.6 667682648 667899728 668232322 668563783 668780208 668969631 669120073 669234872 669444144 669693232 669804990
3965 669804990 669879854 670030951 670189023 670393050 670697451 670989692 671155095 671285331 671486437 671677172
3985.4 671677172 671805561 671906114 672002912 672140837 672360301 672595561
3997.6 672595561
$$ packed form
3903.8F63369954L19481m0114j2100J63138K02060L53038M98414L03924R5367K26856
3924.2F65480018K83420J10447K25663M75467L21269N7697N0366J53303K68042K56956
3944.6F67682648K17080L32594L31461K16425J89423J50442J14799K09272K49088J11758
3965F69804990P4864J51097J58072K04027L04401K92241J65403J30236K01106J90735
3985.4F71677172J28389J00553R6798J37925K19464K35260
3997.6F72595561
##END=$$ End of the data block
