##TITLE=$$ Begin of the data block
##JCAMP-DX=5.00 $$ ACD/SpecManager v 10.08
##SPECTROMETER/DATA SYSTEM=Alpha
##DATE=23 Dec 2014 09:14:34
##DATA TYPE=INFRARED SPECTRUM
##DATA CLASS=XYDATA
##ORIGIN=
##OWNER=
##NPOINTS=1765
##FIRSTX=399.76428223
##LASTX=3997.64306641
##MAXX=3997.64306641
##MINX=399.76428223
##MAXY=0.81390142
##MINY=0.23150492
##XFACTOR=1.0000000000
##YFACTOR=1.000000000000000e-9
##FIRSTY=0.54691786
##DELTAX=2.03961372
##XUNITS=1/CM
##YUNITS=ARBITRARY UNITS
##XYDATA=(X++(Y..Y))
399.8 546917856 542541921 538726568 535035670 532307863 531566322 533379912 536967516 540277600 540824473
418.1 540824473 537964642 535399735 534025967 532157362 528607905 523890734 519756615 517331064
434.4 517331064 516417861 516589105 517916739 520961046 525961876 531738162 536452472 538889170 539252639
452.8 539252639 538930058 538930535 538824677 537533283 534710348 531055212 527642727 524985373 522439361
471.2 522439361 519015729 515159130 512153983 510784924 510646641 510652125 510112047 509153485 508509219
489.5 508509219 508382976 508016109 506636381 504219770 501492202 499246746 497465283 495224088 491759330
507.9 491759330 487465769 483236194 479378581 475477278 471013069 466209233 462055385 459393799
524.2 459393799 458181888 457864225 457843691 457993150 459212303 462670535 468361020 474879771 480491579
542.5 480491579 484058082 485698253 486328036 486251593 485148132 482824117 479471415 475532323 471278012
560.9 471278012 466384977 460238099 452624232 444473833 437698871 433727831 432770193 434252769 437782824
579.3 437782824 443464130 450974047 459148407 466508299 471939147 475236535 476911306 477821857 478438765
597.6 478438765 478597790 478037179 476984233 476320267 476644039 477717668 478922993 480002493 481491715
616 481491715 484188914 488066554 492270291 496117622 499418944 502462924 505578339 508663714 511233091
634.3 511233091 512834847 513704479 514677227 516164780 517779589 518962145 519559264 520043910 521067142
652.7 521067142 522660196 524203777 525140285 525569022 526059628 526774764 527974427 530099213 531697929
671 531697929 532591701 533747315 535578847 537731051 539507210 540588975 541256905 542072833 543203652
689.4 543203652 544014990 543619514 541741252 538956583 536117673 533537030 530928016 528136373 525826037
707.7 525826037 525094748 526522040 529739439 533762753 537945569 542573392 548215389 554832995 561666787
726.1 561666787 567644119 572285116 576104343 579863727 583692849 586840689 588462174 588579059 587953329
744.5 587953329 586983144 585184276 581886053 577126443 571705282 566634834 562419832 558851063 555701017
762.8 555701017 553354681 552818418 555093110 560331643 567606747 575726271 584163845 592892647 601764083
781.2 601764083 610198736 617250025 622426987 626470089 630558491 635148883 639845431 644114435
797.5 644114435 647963285 651800334 655890226 659917355 663068712 664844096 665681183 666468084 667667270
815.8 667667270 668934524 669547737 669083774 667738259 665952325 663705051 660570502 656251132 650942624
834.2 650942624 645352185 640204668 635632515 631261349 626758933 622158051 617727339 613548756
850.5 613548756 609280169 604290307 598298669 592349350 588974297 590664983 597716987 608279824
866.8 608279824 620522082 633425295 646001279 656967998 665089250 669659674 670651913 668639481
883.2 668639481 664641678 659606636 653968215 647857547 641567290 635646999 630473912 625825882
899.5 625825882 621013761 615355492 608544767 600697517 592048109 582545578 571966529 560528159
915.8 560528159 549237430 539546430 532531798 528259873 525914133 524738371 524755895 526338279 529474080
934.1 529474080 533657968 538407266 543764472 549752295 555225492 557915151 556002855 549325883
950.5 549325883 539009094 526345849 512150347 496738523 480135918 462413967 443828106
964.7 443828106 424560994 404571384 383850485 362603605 341234505 320405304 300934643
979 300934643 283506989 268518865 256217688 246749490 239987403 235539317 232914105 231692672
995.3 231692672 231504917 232016653 232924804 233891129 234545141 234590352 234023288 233169213 232518882 232513875
1015.7 232513875 233343080 234948367 237310559 240454331 244294286 248633981 253136694 257398486
1032 257398486 261034071 263710707 265308172 266075671 266430408 266762704 267428637 268787891 271296829
1050.4 271296829 275448263 281402707 288871974 297558635 307427585 318489224 329920352 339115590
1066.7 339115590 342230558 337020218 325556159 313077599 303886443 299092770 297901928 299390644
1083 299390644 302884817 307829648 313864678 320737213 327956736 334738523 340303451 344132423 346129477
1101.4 346129477 346850276 347477138 349243402 352598011 357070386 361830622 366191149 369805485 372599185
1119.8 372599185 374698997 376468629 378533095 381573856 385908127 390969455 395289809 397187233
1136.1 397187233 395589709 390532434 382972866 374214321 365362585 357106805 349933773 344324380
1152.4 344324380 340587884 338731557 338616759 340174079 343585998 349256545 357493937 368222266
1168.7 368222266 380981654 395093828 409931362 425045282 440127999 454908997 469011217
1183 469011217 481965423 493395299 503081024 510873079 516721129 520745337 523340762 525129199
1199.3 525129199 526709080 528439403 530486226 533070683 536479831 540865481 546042144 551506519
1215.6 551506519 556616902 560750186 563527465 564911008 565023661 564065635 562347829 560184479 557856023
1234 557856023 555622399 553635478 551971674 550814331 550436437 550996363 552417696 554411113 556604743
1252.3 556604743 558677077 560394466 561633885 562488139 563261807 564329982 565950394 568094730 570443571
1270.7 570443571 572480202 573742747 574107230 573740244 572907805 571911454 570979595 570120990 569186330
1289 569186330 568011224 566481113 564571440 562344551 559920669 557458401 555066049 552723050 550421238
1307.4 550421238 548366547 546756446 545482397 544297338 543051243 541608334 539626181 536611557
1323.7 536611557 532262802 526754498 520693064 514800906 509646952 505582511 502791405 501271844
1340 501271844 500790834 501017630 501622677 502193213 502428293 502301097 501886249 501227260 500377357 499518812
1360.4 499518812 498810619 498257697 497851402 497680753 497869998 498608738 499863952 501075864 502031147
1378.8 502031147 502969742 504381299 507068872 511586547 516613424 520288348 522717297 524147809
1395.1 524147809 524319768 523426235 521968365 520261526 518280447 516062498 513747633 511401951 509206295
1413.5 509206295 507410765 506129742 505349338 504963696 505061030 505647957 506667554 508210301 509948373
1431.8 509948373 511614084 513799727 516284585 518094182 519721210 521259487 522306323 522562861
1448.1 522562861 521902561 520639658 519199312 517604589 515977263 515243292 515892088 518558443 522822738
1466.5 522822738 527622163 534207761 544594646 555912733 565204859 573290467 580945611 588296771
1482.8 588296771 594969034 601562619 608614266 615023673 619553745 623651087 628644049 633354127
1499.1 633354127 636864603 639622688 642993450 647811711 651011884 652891338 654841006 656982422
1515.4 656982422 659274399 661543071 664181292 666458249 667986095 669326246 670421958 671748936
1531.8 671748936 673429430 674556792 675444484 677031577 678007007 677950084 677768230 677573502 677309513
1550.1 677309513 676908016 676497698 676175952 675790489 674214065 672172070 670312822 668623090 666976213
1568.5 666976213 664983809 662897289 660906374 658602118 656205058 654087484 652005494 649820864
1584.8 649820864 647578716 645430624 643364131 641301692 639133394 636839747 634534597 632232845
1601.1 632232845 629853249 627317429 624615192 621665955 618598282 615674734 612646699 609040797
1617.4 609040797 605714262 602851272 599809587 596726418 593741596 590839624 588466465 586899817
1633.7 586899817 585934460 585047305 584252119 583843708 583984971 585133553 586877942 588054180 590252936
1652.1 590252936 594246387 596559942 598437130 601367116 605441511 609564781 612954259 617111802
1668.4 617111802 622394979 626868904 631494164 636706531 641101778 645146847 650349438 657432199
1684.7 657432199 662665725 666309595 670129478 673640847 677683175 682139516 685894489 689456820
1701.1 689456820 691832006 693771541 695944071 697696984 699197650 700758100 702708721 705274880
1717.4 705274880 707207203 708272994 709478796 711056769 712829113 714817584 716846943 719260573
1733.7 719260573 721330345 722617984 724319577 726399481 728395581 730504692 732953429 735991001
1750 735991001 739177227 741845846 744484961 747175455 749648273 752253711 754473329 756239891 758018017
1768.4 758018017 759862781 761836827 763393283 764416099 765458107 766620576 767719150 768807828
1784.7 768807828 769872189 770820260 771894574 773121715 773991525 774671197 775545657 776548803 777393281
1803 777393281 778066576 778787076 779638886 780508459 781169295 781702459 782318175 783018231 783706963 784418046
1823.4 784418046 785119534 785705328 786323130 786819577 787105918 787449300 787854373 788154781 788465738 789009929
1843.8 789009929 789476693 789612710 789692640 789842546 790035188 790257394 790479660 790705025 790920138 791113138
1864.2 791113138 791377962 791788161 792101324 792187631 792285383 792494655 792755246 793029487 793347001 793697953
1884.6 793697953 794046104 794441581 794810832 795064747 795302510 795509160 795642495 795802176 795981824 796107113
1905 796107113 796215415 796341538 796414554 796437860 796550035 796797395 796995163 797086716 797199905 797287941 797357857
1927.5 797357857 797453165 797534168 797602594 797687531 797808290 797940433 798098445 798238814 798314512 798401892 798543513
1949.9 798543513 798723578 798914015 799094796 799262822 799430668 799586177 799744010 799943328 800133824 800256670
1970.3 800256670 800368428 800494015 800592363 800689101 800811648 800923109 800965071 800960541 800990045 801073194 801138282
1992.7 801138282 801126540 801096141 801094174 801088870 801036656 800906658 800708592 800481021 800256014 800044119 799784958
2015.2 799784958 799417555 798952162 798440993 797888815 797354996 797024012 796822369 796544492 796224654 795905948
2035.6 795905948 795519233 795084596 794691861 794374049 794113576 793859541 793619454 793439269 793308616 793228626
2056 793228626 793213606 793224096 793221653 793229461 793275654 793345034 793406188 793424010 793362916 793285549 793300629 793409228
2080.4 793409228 793516040 793539345 793509781 793537557 793690920 793900371 794041812 794087470 794130802 794264555
2100.8 794264555 794488788 794721127 794877052 794949710 794988036 795075953 795223773 795335233 795352161 795305848
2121.2 795305848 795258284 795268357 795337319 795379758 795341551 795282602 795303285 795403779 795484900 795482457 795435548
2143.7 795435548 795425653 795485079 795584619 795668960 795714676 795755208 795867264 796119213 796473980 796788156 796997547
2166.1 796997547 797196746 797546923 798106790 798711538 799165845 799476206 799790859 800226748 800774097 801296175
2186.5 801296175 801693320 801986635 802273035 802663505 803125679 803527355 803819358 804084659 804436624 804896116
2206.9 804896116 805378377 805751562 805993140 806235492 806592822 807052970 807498991 807806551 807981730 808154702
2227.3 808154702 808449388 808830976 809129000 809276879 809387624 809579968 809850872 810127556 810331285 810438037
2247.7 810438037 810531139 810708761 810961723 811195076 811332405 811390936 811474562 811655939 811911225 812164545
2268.1 812164545 812345862 812448919 812562287 812775314 813064098 813312888 813438892 813471377 813510358 813630104
2288.5 813630104 813800514 813901424 813841224 813695848 813618600 813641191 813668072 813563287 813324988 813106477
2308.9 813106477 813002706 812978923 812910676 812660813 812245548 811854243 811661601 811584234 811336339 810901642
2329.3 810901642 810561359 810387373 810201466 809958696 809718072 809493899 809511423 809967101 810250819 809823751
2349.7 809823751 808909357 807935953 807180941 806829095 806820333 806861103 806886435 807039320 807371557 807845473
2370.1 807845473 808328569 808653653 808810413 808965266 809231341 809525788 809688151 809622467 809368253 809055865
2390.4 809055865 808842301 808768570 808675885 808413029 808020651 807657361 807395279 807169795 806851745 806381226
2410.8 806381226 805863619 805435359 805082023 804678202 804159522 803558052 802942514 802393794 801933348 801461160
2431.2 801461160 800891697 800251484 799587548 798960388 798423946 797903657 797289670 796591341 795895755 795301735
2451.6 795301735 794818163 794304967 793651283 792936087 792281985 791754723 791336179 790858030 790235698 789587259
2472 789587259 789031744 788592398 788196564 787712514 787098229 786466599 785975158 785674572 785385966 784904242
2492.4 784904242 784316003 783854544 783579648 783376515 783105493 782702327 782234073 781836569 781580925 781381607
2512.8 781381607 781079531 780604601 780036926 779541969 779191554 778879821 778403342 777685225 776932538 776359797
2533.2 776359797 775909424 775392294 774688244 773847640 773072779 772482157 771976173 771379888 770615578 769787431
2553.6 769787431 769086361 768559873 768065929 767442644 766670585 765908003 765314996 764844954 764312804 763616204
2574 763616204 762829483 762135983 761626482 761176288 760635912 760011613 759365737 758787096 758372366 758064032
2594.4 758064032 757677376 757122874 756527126 756070733 755730331 755314767 754695415 753904700 753081918 752345562
2614.8 752345562 751679480 750958443 750035584 748901844 747784317 746840715 745936990 744887888 743669212
2633.2 743669212 742381096 741154134 740050793 738995910 737835169 736508965 735177219 734024942
2649.5 734024942 733010292 731962264 730777919 729499459 728268206 727189660 726238370 725278199 724172771
2667.8 724172771 722947776 721812725 720911086 720154643 719344378 718367577 717303634 716321468 715488732
2686.2 715488732 714720011 713856399 712820947 711713135 710672915 709718585 708757997 707670510 706423819
2704.5 706423819 705150604 704004884 702979684 701958477 700839639 699636221 698504627 697546482
2720.9 697546482 696696937 695812166 694812953 693807185 692949831 692237318 691551387 690775514 689871490
2739.2 689871490 688974798 688255548 687665701 687029719 686243653 685355961 684541523 683921874 683440864 682926536
2759.6 682926536 682260036 681500196 680826306 680305898 679795623 679119885 678266704 677361548 676516771 675730884
2780 675730884 674864709 673813820 672630727 671414018 670246601 669107854 667836249 666344285 664723277
2798.4 664723277 663097501 661535680 659973562 658233702 656277359 654249549 652266741 650333107
2814.7 650333107 648357511 646214604 643886268 641474783 639069796 636677802 634237051 631654203
2831 631654203 628897250 626076579 623262167 620325387 617136002 613683641 610008717 606199801 602398396
2849.3 602398396 598785520 595499992 592568159 589920580 587363899 584616423 581441343 577716410
2865.7 577716410 573432446 568715751 563740313 558529139 553072691 547617972 542572975 538224638
2882 538224638 534678280 531919301 529846013 528333426 527306437 526658416 526143670 525532603 524738431
2900.3 524738431 523719072 522485673 521054447 519312978 517131984 514432192 511140645 507342756
2916.6 507342756 503311098 499308199 495549381 492226303 489557743 487781137 487053394 487553418 489427656
2935 489427656 492567986 496688753 501564026 507007003 512725770 518508852 524357498 530236423 536045253
2953.4 536045253 541811824 547553003 553163826 558496296 563394487 567836940 571942627 575791061
2969.7 575791061 579408586 582841575 586152792 589405537 592597723 595571458 598149359 600355029
2986 600355029 602339804 604203284 605890512 607234418 608184278 608828247 609266639 609539628 609555185
3004.4 609555185 609220207 608621836 607873499 606912494 605642140 604103684 602373481 600455284 598407626
3022.7 598407626 596320689 594168663 591925442 589630842 587277234 584783673 582208037 579714835
3039 579714835 577247918 574600101 571749985 568911076 566207051 563506544 560701370 557839453 554943085
3057.4 554943085 552033126 549208879 546525359 543890953 541109979 538141251 535181224 532386541
3073.7 532386541 529748738 527127206 524347544 521438539 518539608 515683949 512872934 510046780
3090 510046780 507108271 504150033 501380086 498814434 496213168 493381113 490490168 487825811 485297948
3108.4 485297948 482658476 480007380 477516443 475071341 472512186 469766319 466888875 464095563
3124.7 464095563 461511493 459018320 456482202 453936607 451480180 449169546 446861804 444345295
3141 444345295 441757023 439298451 436941653 434720635 432614237 430391401 427981704 425586522 423312396
3159.4 423312396 421090513 418904126 416787982 414730519 412708044 410689354 408635765 406597316
3175.7 406597316 404648423 402786940 400951475 399083167 397199124 395368159 393599778 391849816
3192 391849816 390106440 388368100 386660904 385007590 383401155 381834388 380257905 378660530 377130806
3210.3 377130806 375712156 374317259 372898698 371491075 370068789 368633538 367262959 365988284
3226.7 365988284 364796460 363698184 362622857 361386508 360019147 358736813 357587039 356539696
3243 356539696 355580926 354601502 353514820 352398515 351374358 350441486 349507004 348539889 347581834
3261.3 347581834 346683741 345874369 345165849 344534427 343864501 343095243 342248410 341342509 340455830 339651078
3281.7 339651078 338912517 338216633 337599188 337112427 336639494 335989624 335179210 334336162 333559871 332972944
3302.1 332972944 332534879 331971169 331140250 330123574 329074711 328124553 327273220 326487333 325769126
3320.5 325769126 325102955 324404150 323539048 322568953 321705520 320991248 320373833 319777787 319040984 318156868
3340.9 318156868 317274719 316419363 315657407 315054655 314342022 313354105 312359482 311577380 310916454 310189813
3361.3 310189813 309450805 308938891 308536589 307868779 306890011 305932045 305209816 304593056 303973049 303376406
3381.7 303376406 302836388 302374184 302105546 302092940 302013934 301558226 301005721 300800472 300792992 300498486
3402.1 300498486 299910456 299456984 299274653 299209982 299105585 298801988 298438817 298298985 298258632 298156798
3422.5 298156798 298196852 298478425 298793405 298978567 299204081 299579144 299839199 299833834 299800068 299957246
3442.9 299957246 300293237 300710887 301109552 301530451 302017987 302537709 303154051 303887576 304553092 305188566
3463.2 305188566 306065500 307070851 307774812 308089554 308430791 309086800 310000211 310897857 311589390
3481.6 311589390 312302768 313195378 314043880 314807713 315687120 316678792 317703843 318664819 319587976
3500 319587976 320603490 321514249 322195143 322979242 324072897 325324595 326444000 327335536 328233123
3518.3 328233123 329333007 330642283 331859946 332793653 333712369 334799170 336031944 337409317 338755369
3536.7 338755369 339931786 341230333 342805892 344408333 345744818 346942335 348345757 349970460
3553 349970460 351632446 353386968 355386138 357458830 359330773 361333191 364060104 366857529 369088948
3571.3 369088948 371268094 373783231 376562834 379556030 382649899 385610998 388531327 391770363
3587.7 391770363 395089358 398112833 401272804 404805660 408439994 412084013 415720671 419141024
3604 419141024 422459066 426174343 430121511 434025764 437957019 441613466 445461422 449840546 453684032
3622.3 453684032 456785679 459868670 464241534 469307482 473205239 476792812 480572939 484368384
3638.7 484368384 488163590 491719365 494933903 498553813 503602803 508611262 511864185 514887571
3655 514887571 518929482 522876978 526146472 529226780 532176852 534992754 538339317 541936398 544762492
3673.3 544762492 548095644 551737249 554392338 556814551 559284985 561732650 564613998 567864537
3689.6 567864537 570462227 572426498 574297845 576106846 577900648 579989851 582042694 583692372
3706 583692372 585293829 587249339 589596272 591579378 592966676 594286203 595742285 597219467 598678052
3724.3 598678052 600180089 601530552 602698386 604145050 606083870 608057916 609241486 609547675
3740.6 609547675 609986961 611595213 613079727 613804579 615238428 616962850 617851377 618459880 619475186
3759 619475186 620601952 621412933 622312844 623388410 624526799 625672579 626519024 627251565 628251612
3777.3 628251612 629462302 630399048 631065965 631879926 632780194 633615613 634305954 634842217 635601461
3795.7 635601461 636472344 637222052 638315976 639172912 639752328 640739739 641454577 641675889 642040610
3814.1 642040610 642974913 643832505 644630432 645816982 646398067 646652400 647121370 647663951 648368835
3832.4 648368835 649140477 649891615 650681913 651297033 651803970 652316093 652587771 652526915 652410746 653326273
3852.8 653326273 655193388 655891001 655817032 655873775 656339109 656962156 657239616 657677889 658590496 659270883
3873.2 659270883 659707904 659890532 660144746 660787702 661300898 661826432 662180781 662204862 662632227 663177311
3893.6 663177311 663249910 663338542 663826585 664467990 665073037 665475011 665519655 665512085 665659189 665885687
3914 665885687 666268766 666773617 667123497 667300165 667505324 667698205 667805851 668054104 668506920 668853879
3934.4 668853879 668987513 669050336 669166148 669446290 669731557 669933140 670232832 670539439 670723736 670872688
3954.8 670872688 671044350 671263039 671538532 671808302 671991408 672109902 672229528 672380090 672598243 672861159
3975.2 672861159 673069656 673159361 673241675 673440456 673640370 673745453 673866749 674067020 674263000 674445271
3995.6 674445271 674653411
3997.6 674653411
##END=$$ End of the data block
