##TITLE=$$ Begin of the data block
##JCAMP-DX=5.00 $$ ACD/SpecManager v 10.08
##SPECTROMETER/DATA SYSTEM=Alpha
##DATE=23 Dec 2014 09:14:34
##DATA TYPE=INFRARED SPECTRUM
##DATA CLASS=XYDATA
##ORIGIN=
##OWNER=
##NPOINTS=1765
##FIRSTX=399.76428223
##LASTX=3997.64306641
##MAXX=3997.64306641
##MINX=399.76428223
##MAXY=0.81621754
##MINY=0.23146760
##XFACTOR=1.0000000000
##YFACTOR=1.000000000000000e-9
##FIRSTY=0.54628748
##DELTAX=2.03961372
##XUNITS=1/CM
##YUNITS=ARBITRARY UNITS
##XYDATA=(X++(Y..Y))
399.8E46287477m802704m075765l276587j862586q9943J684487K966702K572000M351
$$ 546287477 541484773 537409008 534132421 532269835 532179892 533864379 536831081 539403081 539407432
418.1E39407432k618253j909197r04083j487314l083349m450559m509390l247380j317620
$$ 539407432 536789179 534879982 533975899 532488585 529405236 524954677 520445287 517197907 515880287
436.5E15880287L31759J559556L172218M978240N741894M869640K733648M87566m78864
$$ 515880287 516212046 517771602 520943820 525922060 531663954 536533594 539267242 539754808 539275944
454.8E39275944m7147l5763j524150l165484l721118l120243k264738k415479l623187
$$ 539275944 539228797 539193034 537668884 534503400 530782282 527662039 525397301 522981822 519358635
473.2E19358635m107416l120839j417697j73211p3969n31018q24928o90103k73883
$$ 519358635 515251219 512130380 510712683 510539472 510465503 509934485 509109557 508419454 508145571
491.5E08145571l57747j276851k266884k620935k387137j983851k172053l299146m252792
$$ 508145571 507787824 506510973 504244089 501623154 499236017 497252166 495080113 491780967 487528175
509.9D87528175m219383l832281l786891m290492m829376m446865l003060j305134
$$ 487528175 483308792 479476511 475689620 471399128 466569752 462122887 459119827 457814693
526.2D57814693k60710R5010M31388J482457L528863N581528O332129N458594L591269
$$ 457814693 457553983 457648993 458080381 459562838 463091701 468673229 475005358 480463952 484055221
544.6D84055221J762390O31809j56641j240909k364277l212542l852278m320651m993081
$$ 484055221 485817611 486449420 486292779 485051870 482687593 479475051 475622773 471302122 466309041
562.9D66309041o112337p454902q018047o680488l905088j011372J449585L617883
$$ 466309041 460196704 452741802 444723755 438043267 434138179 433126807 434576392 438194275
579.3D38194275N611628P248104P994860P337451N467981L346950J728296R39817O30468
$$ 438194275 443805903 451054007 459048867 466386318 471854299 475201249 476929545 477869362 478499830
597.6D78499830J74910m94510r64195o81847L10153J166433J219451R99719J463801
$$ 478499830 478674740 478180230 477216035 476534188 476844341 478010774 479230225 480229944 481693745
616D81693745K643287L772646M220516L962636L390192L050328L090143L118932K596677
$$ 481693745 484337032 488109678 492330194 496292830 499683022 502733350 505823493 508942425 511539102
634.3E11539102J566410Q49664J001358J497269J605689J199305O62804O18636J113356
$$ 511539102 513105512 513955176 514956534 516453803 518059492 519258797 519921601 520540237 521653593
652.7E21653593J526832J412451R25184N14209N10395P36713J291931K114057J478255
$$ 521653593 523180425 524592876 525518060 526032269 526542664 527279377 528571308 530685365 532163620
671E32163620Q25107J225412K006054K270162J785457J017451N71430P34270J044631
$$ 532163620 532988727 534214139 536220193 538490355 540275812 541293263 541864693 542598963 543643594
689.4E43643594O97732m50433j811683k671718k755106k539635k635836k834261k302348
$$ 543643594 544341326 543890893 542079210 539407492 536652386 534112751 531476915 528642654 526340306
707.7E26340306p23124J384974L166854M030585M210055M650772N719960O712019O861329
$$ 526340306 525617182 527002156 530169010 534199595 538409650 543060422 548780382 555492401 562353730
726.1E62353730N948723M578769L759146L751039L835857L143370J609922P6055o66976
$$ 562353730 568302453 572881222 576640368 580391407 584227264 587370634 588980556 589056611 588389635
744.5E88389635r18150j636922l176391m810036n565643n183875m267574l588140l209710
$$ 588389635 587471485 585834563 582658172 577848136 572282493 567098618 562831044 559242904 556033194
762.8E56033194k406716m93110K394856N316615P273733Q110106Q441627Q768618Q943439
$$ 556033194 553626478 553133368 555528224 560844839 568118572 576228678 584670305 593438923 602382362
781.2F02382362Q432150O977677N154252M031718M001915M523397M691958M267633
$$ 602382362 610814512 617792189 622946441 626978159 630980074 635503471 640195429 644463062
797.5F44463062L893614L952205M128456L962934L151894J819849Q28981P78437J204312
$$ 644463062 648356676 652308881 656437337 660400271 663552165 665372014 666200995 666979432 668183744
815.8F68183744J274526O31273m72844j405418j882016k328515l178239m320145n280197
$$ 668183744 669458270 670089543 669616699 668211281 666329265 664000750 660822511 656502366 651222169
834.2F51222169n608201n195260m593193m365683m487574m606664m442990m220247
$$ 651222169 645613968 640418708 635825515 631459832 626972258 622365594 617922604 613702357
850.5F13702357m352629n005658n919874n864382l309726J699924P010937J0509431
$$ 613702357 609349728 604344070 598424196 592559814 589250088 590950012 597960949 608470380
866.8F08470380J2188077J2853980J2553811J0976315Q133292M555464R46522k049804
$$ 608470380 620658457 633512437 646066248 657042563 665175855 669731319 670677841 668628037
883.2F68628037m016280n072952n687475o124913o262660n907834n212665m690945
$$ 668628037 664611757 659538805 653851330 647726417 641463757 635555923 630343258 625652313
899.5F25652313m825651n680561o831885p830500q642614r538353j0618448j1450768
$$ 625652313 620826662 615146101 608314216 600483716 591841102 582302749 571684301 560233533
915.8E60233533j1257410r618640o968915m285336k332270j105189O0499J584947L113091
$$ 560233533 548976123 539357483 532388568 528103232 525770962 524665773 524726272 526311219 529424310
934.1E29424310M135668M709125N339264N973161N435228K650142j906395o661713
$$ 529424310 533559978 538269103 543608367 549581528 555016756 557666898 555760503 549098790
950.5E49098790j0350228j2682140j4155983j5396864j6646981j7784774j8648267
$$ 549098790 538748562 526066422 511910439 496513575 479866594 462081820 443433553
964.7D43433553j9295961j9948631k0677805k1258414k1369576k0746291j9365341
$$ 443433553 424137592 404188961 383511156 362252742 340883166 320136875 300771534
979C00771534j7408281j5000999j2252361r399563o758719m473761k612993j208425
$$ 300771534 283363253 268362254 256109893 246710330 239951611 235477850 232864857 231656432
995.3B31656432j88827N03629Q92609R73627O68258L6195n98222q78379o31034Q866
$$ 231656432 231467605 231971234 232863843 233837470 234505728 234541923 233943701 233065322 232434288 232443154
1015.7B32443154Q22455J651078K404064L094256L780350M341900M524544M265756
$$ 232443154 233265609 234916687 237320751 240415007 244195357 248537257 253061801 257327557
1032B57327557L616482K652496J572817P51496L94702M07576O75351J285970K465635
$$ 257327557 260944039 263596535 265169352 265920848 266315550 266723126 267398477 268684447 271150082
1050.4B71150082M195601O029815P511824Q687645R863317J1051595J1375219R111553
$$ 271150082 275345683 281375498 288887322 297574967 307438284 318489879 329865098 338976651
1066.7C38976651L064484n207032j1381775j2355954r122580m776269j201093J457601
$$ 338976651 342041135 336834103 325452328 313096374 303973794 299197525 297996432 299454033
1083B99454033L484667M971146O042540O782085P074833O737947N654395L933072K021432
$$ 299454033 302938700 307909846 313952386 320734471 327809304 334547251 340201646 344134718 346156150
1101.4C46156150P10428O23673J728177L314465M476667M787713M388660L626854K791881
$$ 346156150 346866578 347490251 349218428 352532893 357009560 361797273 366185933 369812787 372604668
1119.8C72604668K098948J778245K089500L073693M338711N030573M278123J853079
$$ 372604668 374703616 376481861 378571361 381645054 385983765 391014338 395292461 397145540
1136.1C97145540j616270n034208p504374q705318q859455q286387p158280n581677
$$ 397145540 395529270 390495062 382990688 374285370 365425915 357139528 349981248 344399571
1152.4C44399571l716111j825630r9063J552045L403395N636394Q192569J0714829
$$ 344399571 340683460 338857830 338758767 340310812 343714207 349350601 357543170 368257999
1168.7C68257999J2774945J4129191J4825642J5091688J5100330J4829099J4129222
$$ 368257999 381032944 395162135 409987777 425079465 440179795 455008894 469138116
1183D69138116J2981534J1481940R718091P800042N840123L988087K565086J813829
$$ 469138116 482119650 493601590 503319681 511119723 516959846 520947933 523513019 525326848
1199.3E25326848J625955J733959K028644K578378L397941M357755N170823N493164
$$ 525326848 526952803 528686762 530715406 533293784 536691725 541049480 546220303 551713467
1215.6E51713467N146205M163683K768158J332045P5996r48370j688778k149701k322495
$$ 551713467 556859672 561023355 563791513 565123558 565199554 564251184 562562406 560412705 558090210
1234E58090210k240121k007664j641273j107216l65377N63741J428426J980066K203524
$$ 558090210 555850089 553842425 552201152 551093936 550728559 551292300 552720726 554700792 556904316
1252.3E56904316K096057J694679J224220Q92341P99000J052499J601458K148032K347171
$$ 556904316 559000373 560695052 561919272 562811613 563610613 564663112 566264570 568412602 570759773
1270.7E70759773K010048J263022L91007l60310q20637r68993r16660q61585r46760
$$ 570759773 572769821 574032843 574423850 574063540 573242903 572273910 571357250 570495665 569548905
1289E69548905j166523j512527j924157k238751k398014k442896k404094k354979k297640
$$ 569548905 568382382 566869855 564945698 562706947 560308933 557866037 555461943 553106964 550809324
1307.4E50809324k038539j600742j281321j198113j257896j459241j998842l013551
$$ 550809324 548770785 547170043 545888722 544690609 543432713 541973472 539974630 536961079
1323.7E36961079m342556n510211o059170n879104n135179m054606k798259j519322
$$ 536961079 532618523 527108312 521049142 515170038 510034859 505980253 503181994 501662672
1340E01662672m66764K20060N95510N85139K33292j65641m63545o84738q50320q60483
$$ 501662672 501195908 501415968 502011478 502596617 502829909 502664268 502200723 501515985 500665665 499805182
1360.4D99805182p02530n44190m31091k13742J62691P33494J259864J224994R83418
$$ 499805182 499102652 498558462 498127371 497913629 498076320 498809814 500069678 501294672 502278090
1378.8E02278090R74059J426696K674580M486024M987121L666341K438486J412511
$$ 502278090 503252149 504678845 507353425 511839449 516826570 520492911 522931397 524343908
1395.1E24343908J50025q92520j456142j721024j974464k163231k265811k348363k233804
$$ 524343908 524493933 523601413 522145271 520424247 518449783 516286552 514020741 511672378 509438574
1413.5E09438574j825928j281917p43986l36587J36375O17922J022875J509488J716911
$$ 509438574 507612646 506330729 505586743 505250156 505386531 506004453 507027328 508536816 510253727
1431.8E10253727J678765K181232K466381J843870J667022J516164R97722K42591o54698
$$ 510253727 511932492 514113724 516580105 518423975 520090997 521607161 522604883 522847474 522192776
1450.2E22192776j276433j478672j654685j604438o12259P10667K630949M246473M833937
$$ 522192776 520916343 519437671 517782986 516178548 515566289 516276956 518907905 523154378 527988315
1468.5E27988315O574034J0308445J1281729R341836Q153200P697224P374704O662548
$$ 527988315 534562349 544870794 556152523 565494359 573647559 581344783 588719487 595382035
1484.9E95382035O548822P061124O506264M596054M087746M975260M740655L517986
$$ 595382035 601930857 608991981 615498245 620094299 624182045 629157305 633897960 637415946
1501.2F37415946K686917L223420M758179L351271K013564J985669K100229K265990
$$ 637415946 640102863 643326283 648084462 651435733 653449297 655434966 657535195 659801185
1517.5F59801185K269328K592444K245307J552940J417458J181662J347244J649379
$$ 659801185 662070513 664662957 666908264 668461204 669878662 671060324 672407568 674056947
1533.8F74056947J078725P39575J360774J041770K05397k6166j64867k64168m15325
$$ 674056947 675135672 675875247 677236021 678277791 678483188 678457022 678292155 678027987 677612662
1552.2F77612662m75168m31478n08726j521468j917302j790762j652062j653075k003611
$$ 677612662 677137494 676706016 676197290 674675822 672758520 670967758 669315696 667662621 665659010
1570.5F65659010k097547k053201k298951k279341k069652k127290k222061k225340
$$ 665659010 663561463 661508262 659209311 656929970 654860318 652733028 650510967 648285627
1586.8F48285627k130031k056718Tk184391k316833k326309k314568k377748k515674
$$ 648285627 646155596 644098878 642042160 639857769 637540936 635214627 632900059 630522311 628006637
1605.2F28006637k674580k925276l058434k953350l078997l585518l267825k879560
$$ 628006637 625332057 622406781 619348347 616394997 613316000 609730482 606462657 603583097
1621.5F03583097l065347l033877k929568k861559k362430j639903j056015q28326
$$ 603583097 600517750 597483873 594554305 591692746 589330316 587690413 586634398 585806072
1637.8E85806072o91533l49105J50383J110136J729071J165331K127886M047095K489269
$$ 585806072 585114539 584765434 584915817 586025953 587755024 588920355 591048241 595095336 597584605
1656.2E97584605J964271K925992M077316M198253L415584M097462N263388M536927
$$ 597584605 599548876 602474868 606552184 610750437 614166021 618263483 623526871 628063798
1672.5F28063798M669070N195856M376352M021347N103945P014215N327106L730714
$$ 628063798 632732868 637928724 642305076 646326423 651430368 658444583 663771689 667502403
1688.8F67502403L866971L513157L951788M337907L695488L578663K409935J954078
$$ 667502403 671369374 674882531 678834319 683172226 686867714 690446377 692856312 694810390
1705.1F94810390K220929J802027J511932J533747J848578K473474K039194J218855
$$ 694810390 697031319 698833346 700345278 701879025 703727603 706201077 708240271 709459126
1721.5G09459126J266956J599491J780033J940727J946390K366960K084017J292169
$$ 709459126 710726082 712325573 714105606 716046333 717992723 720359683 722443700 723735869
1737.8G23735869J722932K140641K012789K077103K416968L042102L235042K699018
$$ 723735869 725458801 727599442 729612231 731689334 734106302 737148404 740383446 743082464
1754.1G43082464K633154K676785K450466K611876K295136J839459J783610J769662
$$ 743082464 745715618 748392403 750842869 753454745 755749881 757589340 759372950 761142612
1770.4G61142612J903116J603365J101196J074374J167535J090765J073897J068116
$$ 761142612 763045728 764649093 765750289 766824663 767992198 769082963 770156860 771224976
1786.7G71224976R50276J036108J205146R16660P40469R06705J010061Q50081O72460
$$ 771224976 772175252 773211360 774416506 775333166 776073635 776980340 777990401 778840482 779512942
1805.1G79512942P05421Q43704Q96334P04587N67198O34372O76870O42300O95288P09534
$$ 779512942 780218363 781062067 781958401 782662988 783230186 783864558 784541428 785183728 785879016 786588550
1825.5G86588550N47468N37813M91738L42906L71754M10438L08632L05653N10812M61757
$$ 786588550 787136018 787673831 788165569 788508475 788880229 789290667 789599299 789904952 790415764 790877521
1845.9G90877521J79648J30415J80483J84536J85669J77860J99497K25186K02060K36392
$$ 790877521 791057169 791187584 791368067 791552603 791738272 791916132 792115629 792340815 792542875 792779267
1866.3G92779267L90112L61562J43409J13487K13802K82526L09527L35574L41535L27408
$$ 792779267 793169379 793530941 793674350 793787837 794001639 794284165 794593692 794929266 795270801 795598209
1886.7G95598209L69966L64780K80619K63333K16127J29342J39654J50024R9004Q2195
$$ 795598209 795968175 796332955 796613574 796876907 797093034 797222376 797362030 797512054 797611058 797693253
1907.1G97693253J23977J24991P7725J10447K16365J94669J13070J36614J13785P8738
$$ 797693253 797817230 797942221 798019946 798130393 798346758 798541427 798654497 798791111 798904896 798983634
1927.5G98983634Q4877Q5473Q6367P3552Q2075J19150J85609J66535Q4341J09374J77265
$$ 798983634 799068511 799153984 799240351 799313903 799395978 799515128 799700737 799867272 799951613 800060987 800238252
1949.9H00238252J93953J84179J66535J54257J74343J63496J42097J83225J94252J22070
$$ 800238252 800432205 800616384 800782919 800937176 801111519 801275015 801417112 801600337 801794589 801916659
1970.3H01916659R5487J24514J35541J35481J21891R0778M3691K3007L5524P0811P8618
$$ 801916659 802012146 802136660 802272201 802407682 802529573 802620351 802664042 802687049 802722573 802793384 802872002
1992.7H02872002L040m7922k6167p569l2068j01864j84178k20657k17497k24114k79665
$$ 802872002 802875042 802827120 802800953 802793384 802761316 802659452 802475274 802254617 802037120 801813006 801533341
2015.2H01533341l63051m59075n35787n73575n17190k93076j74224k56479l02791l30151
$$ 801533341 801170290 800711215 800175428 799601853 799084663 798791587 798617363 798360884 798058093 797727942
2035.6G97727942m00483m35174l99053l18825k48373k44200k73227k54453j40309j550
$$ 797727942 797327459 796892285 796493232 796174407 795926034 795681834 795408607 795154154 795013845 795012295
2056G95012295L8803n245l2902j133N1022Q9049Q9527L4034n5015o8844L2664J23977
$$ 795012295 795051098 795045853 795012951 795011818 795062840 795151889 795241416 795275450 795220435 795151591 795184255 795308232
2080.4G95308232R4831j192k5213N7996J74045J99676J18971M1961N0247J39952K32279
$$ 795308232 795403063 795401871 795376658 795434654 795608699 795808375 795927346 795969307 796019554 796159506 796391785
2102.9G96391785K30312J35720M7863K6881J05024J95384J50084J2815p6472n2989
$$ 796391785 796622097 796757817 796805680 796832561 796937585 797132969 797283053 797295868 797219396 797166407
2123.3G97166407N9545J22011M0948q9884j13248K3961J49429J10268K027m8876l0458
$$ 797166407 797225952 797347963 797388911 797299027 797185779 797209740 797359169 797469437 797471464 797422588 797392130
2145.7G97392130M6313J24275R6858J1444J3888J29640K80559L68297L14951K09034
$$ 797392130 797438443 797562718 797659576 797671020 797684908 797814548 798095107 798463404 798778355 798987389
2166.1G98987389K16305L62337N29825N77748M84705L46184L20673M51147N65768N22613
$$ 798987389 799203694 799566031 800095856 800673604 801158309 801504493 801825166 802276313 802842081 803364694
2186.5H03364694L88861K87115L03984M15742M59195L69906K49267K56180L72231M69089
$$ 803364694 803753555 804040670 804344654 804760396 805219591 805589497 805838764 806094944 806467175 806936264
2206.9H06936264M94897M05014K67446K38419L40998M49478M40479L06487J86026J98960
$$ 806936264 807431161 807836175 808103621 808342040 808683038 809132516 809572995 809879482 810065508 810264468
2227.3H10264468L21627L80814K76208J56939J32918J89901K74360K96593K19762J15216
$$ 810264468 810586095 810966909 811243117 811400056 811532974 811722875 811997235 812293828 812513590 812628806
2247.7H12628806R5307J77980K65360K41875J19389L9219P6652J78158K68936K73169
$$ 812628806 812724113 812902093 813167453 813409328 813528717 813567936 813644588 813822746 814091682 814364851
2268.1H14364851J96933J24514J09196J86265K77578K46525J16050L8982Q7678J68562
$$ 814364851 814561784 814686298 814795494 814981759 815259337 815505862 815621912 815660894 815748572 815917134
2288.5H15917134J82927J17481l2902j39177n0843P7427M9114r4175k18571k19762
$$ 815917134 816100061 816217542 816184640 816045463 815994620 816072047 816121161 816026986 815808415 815588653
2308.9H15588653q4817L5166j8298k27392m14789l73125j35481L517j44482l60966
$$ 815588653 815503836 815539002 815520704 815293312 814878523 814505398 814369917 814373434 814228952 813867986
2329.3H13867986l80516k88248k15411k11418k79069k44260M6790M18782K37823m19498
$$ 813867986 813487470 813199222 812983811 812772393 812493324 812249064 812295854 812714636 812952459 812532961
2349.7H12532961q79228r15885o74188k69949Q8632J54853N6624Q1897K35319L83556
$$ 812532961 811653733 810737848 810063660 809793711 809882343 810037196 810093820 810175717 810411036 810794592
2370.1H10794592L94642K61307J35720R2625J33515J82390J07765j11460l00110l05831
$$ 810794592 811189234 811450541 811586261 811678886 811812401 811994791 812102556 811991096 811690986 811385155
2390.4H11385155k02835j18434j21832k35081l43323l39329k75254k52664l43442m92096
$$ 811385155 811182320 811063886 810942054 810706973 810363650 810024321 809749067 809496403 809152961 808660865
2410.8H08660865n46396m60267l53217l40939m26888n53310o36935o00815m91679m59909
$$ 808660865 808114469 807654202 807300985 806960046 806533158 805979848 805342913 804742098 804250419 803790510
2431.2H03790510n45383o61135o95347o21796n32865n24819o20187p21454o99699n69523
$$ 803790510 803245127 802583992 801888645 801266849 800733984 800209165 799588978 798867524 798167825 797598302
2451.6G97598302m84943n32925o39260o78837o23405n11050m35532m94182n93662o12378
$$ 797598302 797113359 796580434 795941174 795262337 794638932 794127882 793692350 793198168 792604506 791992128
2472G91992128n45263m61579m49061n22971o20067o15716m81785l35991l03507m25220
$$ 791992128 791446865 790985286 790536225 790013254 789393187 788777471 788295686 787959695 787656188 787230968
2492.4G87230968n46574n00202l34800j99377k19107l73483m85241m40001k77698j67489
$$ 787230968 786684394 786184192 785849392 785650015 785430908 785057425 784572184 784132183 783854485 783686996
2512.8G83686996k49923m54306n81205n08547l53336l40403n11169p09891p35700n68986
$$ 783686996 783437073 782982767 782401562 781893015 781539679 781199276 780688107 779978216 779242516 778673530
2533.2G78673530m24683m88759p16149q66473p97868o24120n11587n60939p24077q09729
$$ 778673530 778248847 777760088 777043939 776177466 775379598 774755478 774243891 773682952 772958875 772149146
2553.6G72149146p13349n30600m71831o14106p87080p68721n83529m68850n25773o87659
$$ 772149146 771435797 770905197 770433366 769819260 769032180 768263459 767679930 767211080 766685307 765997648
2574G65997648q05616p21455n17666m36246n21541o46174p05719n90086l75509k79606
$$ 765997648 765192032 764470577 763952911 763516665 762995124 762348950 761643231 761053145 760677636 760398030
2594.4G60398030l60846n37038o14286n00440l69728m08888o04033p78616q14855p53402
$$ 760398030 760037184 759500146 758885860 758385420 758015692 757606804 757002771 756224155 755409300 754655898
2614.8G54655898o78838o96301q87394j105964j119674r67264r10520j062989j239718
$$ 754655898 753977060 753280759 752393365 751287401 750167727 749200463 748289943 747226954 745987236
2633.2G45987236j273393j201213j110792j089871j185238j316965j315891j154244
$$ 745987236 744713843 743512630 742401838 741311967 740126729 738809764 737493873 736339629
2649.5G36339629j019717j032173j150191j289368j293957j111150r45031r53973j083910
$$ 736339629 735319912 734287739 733137548 731848180 730554223 729443073 728498042 727544069 726460159
2667.8G26460159j171053j085102r06825q18074q72910r92417j057506r79841q20636
$$ 726460159 725289106 724204004 723297179 722479105 721606195 720613778 719556272 718576431 717755795
2686.2G17755795p60198q82626j073122j114845r93013r07660r52601j102269j247287
$$ 717755795 716995597 716112971 715039849 713925004 712931991 712024331 711071730 709969461 708722174
2704.5G08722174j264512j157642j035392j025975j130760j205742j125872r50992
$$ 708722174 707457662 706300020 705264628 704238653 703107893 701902151 700776279 699825287
2720.9F99825287q48115r01818j039386j044213q53181o74248o55890p64906q90195
$$ 699825287 698977172 698075354 697035968 695991755 695138574 694464326 693808436 693043530 692153335
2739.2F92153335q88884p52330o33002o37412p83145r31263q60393o15358m44532m79162
$$ 692153335 691264451 690512121 689879119 689241707 688458562 687527299 686666906 686051548 685607016 685127854
2759.6F85127854o43849p50959o91295n56349n17667o53863q57114r31561q46744p64728
$$ 685127854 684484005 683733046 683041751 682485402 681967735 681313872 680456758 679525197 678678453 677913725
2780F77913725q26835j017034j210332j264870j182139j122535j220405j465857j668095
$$ 677913725 677086890 676069856 674859524 673594654 672412515 671289980 670069575 668603718 666935623
2798.4F66935623j671374j564145j562357j735509j945197k045453k000987j924813
$$ 666935623 665264249 663700104 662137747 660402238 658457041 656411588 654410601 652485788
2814.7F52485788j972854k162934k353549k419352k381623k358615k444744k628744
$$ 652485788 650512934 648350000 645996451 643577099 641195476 638836861 636392117 633763373
2831F33763373k795458k821326k794504k932907l227591l522992l747523l856182l812373
$$ 633763373 630967915 628146589 625352085 622419178 619191587 615668595 611921072 608064890 604252517
2849.3F04252517l609597l295064k964318k683342k564430k746582l196597l767669
$$ 604252517 600642920 597347856 594383538 591700196 589135766 586389184 583192587 579424918
2865.7E79424918m341126m763186n006671n246162n456686n424440n069614m430294
$$ 579424918 575083792 570320606 565313935 560067773 554611087 549186647 544117033 539686739
2882E39686739l598749k748609k044141j509368j065314p04766n48422n95450p32303
$$ 539686739 536087990 533339381 531295240 529785872 528720558 528015792 527467370 526871920 526139617
2900.3E26139617r58085j224935j462639j778125k238632k759754l305853l785848
$$ 526139617 525181532 523956597 522493958 520715833 518477201 515717447 512411594 508625746
2916.6E08625746m017174l983379l744662l317684k679079j786828p06584N07713J835078
$$ 508625746 504608572 500625193 496880531 493562847 490883768 489096940 488390356 488898069 490733147
2935D90733147L098219M115612M898071N477428N768776N816818N850195N899787N859852
$$ 490733147 493831366 497946978 502845049 508322477 514091253 519908071 525758266 531658053 537517905
2953.4E37517905N797029N774021N666494N357862M925906M518927M196643L928841
$$ 537517905 543314934 549088955 554755449 560113311 565039217 569558144 573754787 577683628
2969.7E77683628L670513L444493L331959L310502L214955K954185K590478K259373
$$ 577683628 581354141 584798634 588130593 591441095 594656050 597610235 600200713 602460086
2986F02460086K038777J890779J695692J360059R75549O84798M94957L06606J8359
$$ 602460086 604498863 606389642 608085334 609445393 610420942 611105740 611600697 611907303 611925662
3004.4F11925662l19303n83529p84993j002431j259327j532853j783013j963079k032757
$$ 611925662 611606359 611022830 610237837 609235406 607976079 606443226 604660213 602697134 600664377
3022.7F00664377k062022k139628k211631k268791k369463k502025k557993k493262
$$ 600664377 598602355 596462727 594251096 591982305 589612842 587110817 584552824 582059562
3039E82059562k505362k694428k866149k848506k719938k704204k806902k867043k902507
$$ 582059562 579554200 576859772 573993623 571145117 568425179 565720975 562914073 560047030 557144523
3057.4E57144523k912402k814055k703905k701104k824604k983928k992272k826393
$$ 557144523 554232121 551418066 548714161 546013057 543188453 540204525 537212253 534385860
3073.7E34385860k646923k610445k748370k903223k942443k901614k845108k853632
$$ 534385860 531738937 529128492 526380122 523476899 520534456 517632842 514787734 511934102
3090E11934102k932549k924919k771318k620459k678722k873927k867758k654583k554297
$$ 511934102 509001553 506076634 503305316 500684857 498006135 495132208 492264450 489609867 487055570
3108.4D87055570k662867k668411k495974k458245k601743k806663k930522k828360
$$ 487055570 484392703 481724292 479228318 476770073 474168330 471361667 468431145 465602785
3124.7D65602785k595961k463191k498925k546728k484143k370655k397120k565891
$$ 465602785 463006824 460543633 458044708 455497980 453013837 450643182 448246062 445680171
3141D45680171k584636k442986k335369k192915k106368k277255k448678k375961k280980
$$ 445680171 443095535 440652549 438317180 436124265 434017897 431740642 429291964 426916003 424635023
3159.4D24635023k272874k190501k091586k094329k098024k070218k059221k013564
$$ 424635023 422362149 420171648 418080062 415985733 413887709 411817491 409758270 407744706
3175.7D07744706j921088j865566j880526j908928j912624j875162j811057j762778
$$ 407744706 405823618 403958052 402077526 400168598 398255974 396380812 394569755 392806977
3192C92806977j731247j739114j777977j733303j605898j560122j613676j619220j511336
$$ 392806977 391075730 389336616 387558639 385825336 384219438 382659316 381045640 379426420 377915084
3210.3C77915084j416474j419366j415550j395941j409471j413077j378864j303286
$$ 377915084 376498610 375079244 373663694 372267753 370858282 369445205 368066341 366763055
3226.7C66763055j200229j088976j077474j270651j394511j264929j169861j138121
$$ 366763055 365562826 364473850 363396376 362125725 360731214 359466285 358296424 357158303
3243C57158303j002639r55701j056135j073003r87947r34332r61662r71406r15140
$$ 357158303 356155664 355199963 354143828 353070825 352082878 351148546 350186884 349215478 348300338
3261.3C48300338q66890q24511p29531o17177o68168q43763r32038r27865q52526p59810
$$ 348300338 347433448 346608937 345879406 345262229 344594061 343750298 342818260 341890395 341037869 340278059
3281.7C40278059p37220p29680o39349n09143n31346o82473p82221q15302p49737n85646
$$ 340278059 339540839 338811159 338171810 337662667 337131321 336448848 335666627 334851325 334101588 333515942
3302.1C33515942m70221n64337q33571j035928j034797q98182p89583p78287p75963
$$ 333515942 333045721 332481384 331647813 330611885 329577088 328678906 327889323 327111036 326335073
3320.5C26335073p06614o62267q22335j008451r30757p52836o51300o12855p07537
$$ 326335073 325628459 324966192 324143857 323135406 322204649 321451813 320800513 320187658 319480121
3338.8C19480121q60721r16332r12279p93755o17772p27356r98526r88126p44343o47426
$$ 319480121 318619400 317703068 316790789 315997034 315379262 314651906 313653380 312665254 311920911 311273485
3359.2C11273485p42644p08282m79042m38750p50899j063228j007110p01248n47827
$$ 311273485 310530841 309822559 309343517 308904767 308153868 307090640 306083530 305382282 304834455
3377.6C04834455o10918o82920o05970m12196j71185J4514j38044n09680n25564j29729
$$ 304834455 304223537 303540617 302934647 302522451 302351266 302365780 302227736 301718056 301192492 301062763
3398C01062763L2663l42369o58959m64916j57267n7996j25348k85268l28481j64509
$$ 301062763 301095426 300753057 300094098 299629182 299471915 299413919 299288571 299003303 298674822 298510313
3418.4B98510313l7312l4661M9800K31266L09914K19733K46376L71635K05457j12534
$$ 298510313 298473001 298438340 298488140 298719406 299029320 299249053 299495429 299867064 300072521 299959987
3438.8B99959987j13427J77443M22656M99308M16428L60906M29929N08785O19441P44969
$$ 299959987 299846560 300024003 300446659 300945967 301362395 301723301 302153230 302662015 303281456 304026425
3459.2C04026425O96599O71626R04262J014500O89149L14623L62576O71327R32425
$$ 304026425 304723024 305394650 306298912 307313412 308002561 308317184 308679760 309351087 310283512
3477.5C10283512R23335P07210P07119Q95024Q71628P58350Q58277R82046J021296
$$ 310283512 311206847 311914057 312621176 313516200 314387828 315146178 316004455 316986501 318007797
3495.9C18007797J003087R81837J014918R03845P02828P70331J043915J227409J145303
$$ 318007797 319010884 319992721 321007639 321911484 322614312 323384643 324428558 325655967 326801270
3514.2C26801270R25303Q97884J124114J401812J288593R02891Q75979J126737J306265
$$ 326801270 327726573 328624457 329748571 331150383 332438976 333341867 334217846 335344583 336650848
3532.6C36650848J432419J368880J158029J259715J554817J622706J395792J244724
$$ 336650848 338083267 339452147 340610176 341869891 343424708 345047414 346443206 347687930
3548.9C47687930J398206J616150J693934J805186K013028K063155J889408K024084
$$ 347687930 349086136 350702286 352396220 354201406 356214434 358277589 360166997 362191081
3565.2C62191081K762854K865672K309442K258897K565980K784162K972156L079117
$$ 362191081 364953935 367819607 370129049 372387946 374953926 377738088 380710244 383789361
3581.5C83789361K983450K970100L278285L346026L080249L248960L576010L637284
$$ 383789361 386772811 389742911 393021196 396367222 399447471 402696431 406272441 409909725
3597.9D09909725L688544L703237L456205L302753L672242L957748L966004L987581
$$ 409909725 413598269 417301506 420757711 424060464 427732706 431690454 435656458 439644039
3614.2D39644039L718793L918618M447252L875106L082752L083021M424393N131990
$$ 439644039 443362832 447281450 451728702 455603808 458686560 461769581 466193974 471325964
3630.5D71325964L955781L632188L790259L780425L807306L590673L204555L506988
$$ 471325964 475281745 478913933 482704192 486484617 490291923 493882596 497087151 500594139
3646.8E00594139M960835N179703L458083L039420L998100M005433L306627L051936
$$ 500594139 505554974 510734677 514192760 517232180 521230280 525235713 528542340 531594276
3663.1E31594276K949536K832413L387868L704846K868891L251612L618419K706051
$$ 531594276 534543812 537376225 540764093 544468939 547337830 550589442 554207861 556913912
3679.4E56913912K439618K451480K434075K922833L284990K564371J949847J888275
$$ 556913912 559353530 561805010 564239085 567161918 570446908 573011279 574961126 576849401
3695.8E76849401J820683J783669K091647K124428J702607J549184J866520K333701
$$ 576849401 578670084 580453753 582545400 584669828 586372435 587921619 589788139 592121840
3712.1E92121840K044022J439631J317679J418889J463831J455366J475930J338184
$$ 592121840 594165862 595605493 596923172 598342061 599805892 601261258 602737188 604075372
3728.4F04075372J168072J425088J903117K011776J307070L98993L77238J416147J417816
$$ 604075372 605243444 606668532 608571649 610583425 611890495 612289488 612666726 614082873 615500689
3746.7F15500689P96318J528322J813531R59873O33002R98974J138687Q51810R14216
$$ 615500689 616297007 617825329 619638860 620598733 621231735 622230709 623369396 624221206 625135422
3765.1F25135422J077592J150370J170099R02891P75158R67622J139045Q91387O54042
$$ 625135422 626213014 627363384 628533483 629436374 630211532 631179154 632318199 633209586 633863628
3783.5F33863628Q59618R43840Q10504P05540N99086P07567P20620O80804J147449
$$ 633863628 634723246 635667086 636477590 637183130 637782216 638489783 639210403 639891207 641038656
3801.8F41038656R42827O20782R97782P20620K21669L82781R81033Q78156P15732J131117
$$ 641038656 641981483 642602265 643600047 644320667 644542336 644925117 645906150 646784306 647500038 648631155
3822.2F48631155O88911L61145M46617M48883O56128P64548P22707P80284O58393N55813
$$ 648631155 649320066 649681211 650127828 650576711 651232839 651997387 652720094 653500378 654158771 654714584
3842.6F54714584N65470L44038l2723k25425O69956J812101Q93712J19686J55031M04418
$$ 654714584 655280054 655624092 655591369 655365944 656035900 657848001 658741713 658861399 659016430 659420848
3863F59420848M94957K71201M64082Q56578O82891N02824J80006K00808O09517N17846
$$ 659420848 659915805 660187006 660651088 661507666 662190557 662693381 662873387 663074195 663683712 664201558
3883.4F64201558N71489M30107P3552M17948N21481M7088K6226M16100O09100O15954
$$ 664201558 664773047 665203154 665276706 665694654 666216135 666263223 666289449 666705549 667314649 667930603
3903.8F67930603M86016J95623J23560J83344J50323K97964N52117M34101J44959J47461
$$ 667930603 668416619 668612242 668735802 668919146 669069469 669367433 669919550 670353651 670498610 670646071
3924.2F70646071J96755R6143K22623M96984M16338J46568O3002J15156K35379K36749
$$ 670646071 670842826 670938969 671161592 671658576 672074914 672221482 672284484 672399640 672635019 672871768
3944.6F72871768J85133L09824L21508J88947J65999J90377K01642K48909K66016J52230
$$ 672871768 673056901 673366725 673688233 673877180 674043179 674233556 674435198 674684107 674950123 675102353
3965F75102353M0233P4268K06411L34203L54886K25067M7028N6803K05755K17796J45435
$$ 675102353 675142586 675216854 675423265 675757468 676112354 676337421 676384449 676441252 676647007 676864803 677010238
3987.4F77010238J44243J59145J39355J87397K59936
$$ 677010238 677154481 677313626 677452981 677640378 677900314
3997.6F77900314
$$ 677900314
##END=$$ End of the data block
