##TITLE=$$ Begin of the data block
##JCAMP-DX=5.00 $$ ACD/SpecManager v 10.08
##SPECTROMETER/DATA SYSTEM=Alpha
##DATE=23 Dec 2014 09:14:34
##DATA TYPE=INFRARED SPECTRUM
##DATA CLASS=XYDATA
##ORIGIN=
##OWNER=
##NPOINTS=1765
##FIRSTX=399.76428223
##LASTX=3997.64306641
##MAXX=3997.64306641
##MINX=399.76428223
##MAXY=0.84436679
##MINY=0.31139892
##XFACTOR=1.0000000000
##YFACTOR=1.000000000000000e-9
##FIRSTY=0.60878438
##DELTAX=2.03961372
##XUNITS=1/CM
##YUNITS=ARBITRARY UNITS
##XYDATA=(X++(Y..Y))
399.8F08784378m135609k774239j599610j123964l21806R91643J485765Q12113j13308
418.1F02005363o38247j037836j653910k182424k809822l282249k864480k379597k221405
436.5E82935393r05156J634299L853024M233002L227532K718926K630472J885652L18468
454.8F02531612r90808j020849q35061j722693k666116k729297k478599l023506l775060
473.2E83289623k880990j378656r94265j388788j328528k71439O79373J96159j057744
491.5E74864745j364708q36849j079440k196014k748847k150536j757502k477050l468335
509.9E56785464l708660l445328l827810m687071m508078l159165j879215j334072
526.2E30236065r35793J22428J533568K478600L158510M255056N367219N168021L282726
$$ y = [608784378, 604648769, 601874530, 600274920, 599150956, 598829150, 599820793, 601306558, 602118671, 602005363, 601367116, 600329280, 598675370, 596492946, 593683124, 590400875, 587536395, 585156798, 582935393, 582030237, 583664536, 587517560, 591750562, 594978094, 597697020, 600327492, 602213144, 602531612, 601540804, 600519955, 599684894, 597962201, 595296085, 592566788, 590088189, 587064683, 583289623, 580408633, 579029977, 578035712, 576646924, 575318396, 575046957, 575726330, 575922489, 574864745, 573500037, 572663188, 571583748, 569387734, 566638887, 564488351, 562730849, 560253799, 556785464, 553076804, 549631476, 545803666, 541116595, 536608517, 533449352, 531570137, 530236065, 529300272, 529422700, 530956268, 533434868, 536593378, 540848434, 546215653, 551383674, 554666400]
544.6E54666400J159251P2181l52085j207411k552211l372252l348768l511548m813671
562.9E36739886o331265o738424o217778n381823m004955j519203J598954M001558
579.3E12146950N325138O222606O871462O699979N164981K922773J396537R70722O92546
597.6E48413694m1604n65589k11894L88741L99411K09332P15732J802385K515793K617538
618E56243539K862334L734946M516960M064083K851367K452075K848148K620221J493632
636.4E83687305P46131J076401J579880J182259L33189M18008J327991J573086Q74519
654.7E92798769M03047Q61943J459122J248002M26054J31368J506627K091348J180828
673.1F02107108Q58783J488686K072811J699984R16541Q43942J190603Q73208j16945
$$ y = [554666400, 555825651, 555897832, 555545747, 554338336, 551786125, 548413873, 545065105, 541553557, 536739886, 530408621, 523670197, 517452419, 512070596, 508065641, 506546438, 508145392, 512146950, 517472088, 523694694, 530566156, 537266135, 542431116, 545353889, 546750426, 547721148, 548413694, 548372090, 547806501, 547594607, 547983348, 548382759, 548592091, 549307823, 551110208, 553626001, 556243539, 559105873, 562840819, 567357779, 571421862, 574273229, 576725304, 579573452, 582193673, 583687305, 584433436, 585509837, 587089717, 588271976, 588605165, 589023173, 590351164, 591924250, 592798769, 593201816, 594063759, 595522881, 596770883, 597196937, 597328305, 598834932, 600926280, 602107108, 602965891, 604454577, 606527388, 608227372, 609143913, 609987855, 611178458, 612051666, 611934721]
691.4F11934721q99612j096786j425743k358675l116726k846063j860261r84966k94626
709.8E97051263Q32975K496719L850639M315317M502117N134404N865037N851984M978121
728.1F34878576M140913L938020L783106L002108J854896J046121N31554l55959j769006
746.5F51050329l031611l600419l817022m231870m587650m304290l345251k163589
762.8F21968627r88722N65052K724409M963517O561220P415593P897556Q024573P462025
781.2F66593850O269931N017102M248560L962397L667772L279388L256619L767371
797.5G00062990M265189M140914L472686K901852K699196K419710J807094J202702
813.8G22972333J036764R74714M30167m23372j064121j458049k137184l312648m376292
$$ y = [611934721, 611035109, 609938323, 608512580, 606153905, 603037179, 600191116, 598330855, 597345889, 597051263, 597884238, 600380957, 604231596, 608546913, 613049030, 618183434, 624048471, 629900455, 634878576, 639019489, 642957509, 646740615, 649742723, 651597619, 652643740, 653175294, 652819335, 651050329, 648018718, 644418299, 640601277, 636369407, 631781757, 627477467, 624132216, 621968627, 620979905, 621544957, 624269366, 629232883, 635794103, 643209696, 651107252, 659131825, 666593850, 672863781, 677880883, 682129443, 686091840, 689759612, 693039000, 696295619, 700062990, 704328179, 708469093, 711941779, 714843631, 717542827, 719962537, 721769631, 722972333, 724009097, 724983811, 725413978, 724990606, 723926485, 722468436, 720331252, 717018604, 712642312]
832.2G12642312m745543m638910m567027m569948m242480l500461k930761l004193
848.5F80442989l285766l248393l243864l644645l682673j898468J924754N968451
864.8F69332385Q507013R763658J0492087J0310471Q520603N533278K608836K53558
881.1G25321889j954138m097462n586267n950570n567670n197584n044341m747272
897.4F87176585m227578m155577m877209n757332o395340p160187q271873r301722
913.7F37029767r607494q993447p727563o047726m127502k259016p82907K32339J123666
932.1E98840117K193630L342867M256666M744470M632592L461123P53760l122807p032871
950.5F12069547j0172248j2360453j3871789j5138328j6249180j7158509j7981946
$$ y = [712642312, 707896769, 703257859, 698690832, 694120884, 689878404, 686377943, 683447182, 680442989, 677157223, 673908830, 670664966, 667020321, 663337648, 661439180, 663363934, 669332385, 677839398, 687603056, 698095143, 708405614, 716926217, 722459495, 725068331, 725321889, 723367751, 719270289, 713684022, 707733452, 702165782, 696968198, 691923857, 687176585, 682949007, 678793430, 673916221, 668158889, 661763549, 654603362, 646331489, 637029767, 627422273, 618428826, 610701263, 604653537, 600526035, 598267019, 597484112, 597716451, 598840117, 601033747, 604376614, 608633280, 613377750, 618010342, 621471465, 622225225, 619102418, 612069547, 601897299, 589536846, 575665057, 560526729, 544277549, 527119040, 509137094]
964.7E09137094j8795580j9542217k0142436k0459980k0362109j9795209j8573731
979C71465832j6469657j3698817j0785460q014113n500197l367752j712561n18352
995.3C11398923L24190Q61466J060814R17196M46826k24054q15123j078963q91835
1013.7C11999440l18020M95553J387298K223074K958894L574818M015714M222453M138261
1032C34697485L684759K868682J934082J270473J005858J041382J289040J836121K837211
1050.4C52465093M187614N614847O941646Q236021R631753J0964900J1388838R357542
1066.7D18788254L705621m264474j0607153j2141585r347320n043030j331448J302272
1083C81061137L157735M522144N561233O300926O554216O172449N155503L631145J995504
$$ y = [509137094, 490341514, 470799297, 450656861, 430196881, 409834772, 390039563, 371465832, 354996175, 341297358, 330511898, 322497785, 316997588, 313629836, 311917275, 311398923, 311723113, 312584579, 313645393, 314562589, 315009415, 314785361, 313970238, 312891275, 311999440, 311681420, 312176973, 313564271, 315787345, 318746239, 322321057, 326336771, 330559224, 334697485, 338382244, 341250926, 343185008, 344455481, 345461339, 346502721, 347791761, 349627882, 352465093, 356652707, 362267554, 369209200, 377445221, 387076974, 398041874, 409430712, 418788254, 422493875, 418229401, 407622248, 395480663, 386133343, 381090313, 379758865, 381061137, 384218872, 388741016, 394302249, 400603175, 407157391, 413329840, 418485343, 422116488, 424111992]
1101.4D24111992R36628R60886J944929L195793M085153M464448M400044L897578L054350
1119.8D51051801K264977J982570K422005L390848M365474M682034L791422J558066
1136.1D75509197j639307m952520p433981q624762q740425q162827p053792n468637
1152.4D23432946l630519j885682l27617J285940L172011N236148P259399R157896
1168.7D43700522J0962188J2535602J3543248J3820619J3719886J3624549J3337136
1183E35243750J2469589J1023820R373545P741154N977392M071951K539575J865268
1199.3E90306044J812577J789927J800061K373099L477991M398763M690408M617572
1215.6F15266442M507542M063189K879560J294315Q5771m92096r29058j552522j934945
$$ y = [424111992, 425048620, 426009506, 427954435, 431150228, 435235381, 439699829, 444099873, 447997451, 451051801, 453316778, 455299348, 457721353, 461112201, 465477675, 470159709, 473951131, 475509197, 473869890, 468917370, 461483389, 452858627, 444118202, 435955375, 428901583, 423432946, 419802427, 417916745, 417589128, 418875068, 422047079, 427283227, 434542626, 443700522, 454662710, 467198312, 480741560, 494562179, 508282065, 521906614, 535243750, 547713339, 558737159, 568110704, 575851858, 581829250, 585901201, 588440776, 590306044, 592118621, 593908548, 595708609, 598081708, 601559699, 605958462, 610648870, 615266442, 619773984, 623837173, 626716733, 628011048, 628096819, 627604723, 626675665, 625123143, 623188198]
1234F23188198j688362j182675r64224q90851l10123Q25286J694381J825929J718103
1252.3F24215662J880885J992702J563728R10640P75873J285017J826405J908482J729548
1270.7F38088942J625955J348495N61536l88980q47876p12097n79953q98719j302242
1289F36895061j306892j201391j482189k004385k197802j874447j544893j650333j848757
1307.4F21783972j604021j102030r09448j142025j408994j408398j562893k463758
1323.7F10182405l809274m777193n020797m839242m525125l941357k826273j245082
1340E79198062j5676K86460K61009L11494J42395l59356q48472r82046j012743j350105
1360.4E75631022j589894j075685n24402l68893k65062j61051L90231J085103J019120
$$ y = [623188198, 621499836, 620317161, 619352937, 618462086, 618151963, 618977249, 620671630, 622497559, 624215662, 626096547, 628089249, 629652977, 630563617, 631339490, 632624507, 634450912, 636359394, 638088942, 639714897, 641063392, 641624928, 641235948, 640388072, 639675975, 639096022, 638197303, 636895061, 635588169, 634386778, 632904589, 630900204, 628702402, 626827955, 625283062, 623632729, 621783972, 620179951, 619077921, 618168473, 617026448, 615617454, 614209056, 612646163, 610182405, 606373131, 601595938, 596575141, 591735899, 587210774, 583269417, 580443144, 579198062, 579182386, 579468846, 579729855, 580041349, 580183744, 579824388, 578975916, 577993870, 576981127, 575631022, 574041128, 572965443, 572441041, 572072148, 571807086, 571646035, 572036266, 573121369, 574140489]
1378.8E74140489N75662P08520J876652L703654M428864L158033J600504P36177K17437
1397.1E91145992m59432r24349j221657j389801j410485j744151j903236j498997j274645
1415.5E79319239j518786j065672J93239Q54253J018942Q56340R17315J477540J561999
1433.9E83614409J423538J971364K271592K096892J547932N82636r6917j92047n83589
1452.2E92635810j607537k955973j891673R08435J459121J828492L255963M317940
1468.5E97950578N229652P636904R233714Q746206Q000434P251978O486773N387485
1484.9F55923724M713237N123079N730272M590630L331423L577828M126788L445863
1501.2F90562844J993954P86484J922667L755748K977431J915455J313746J360178
$$ y = [574140489, 574716151, 575424671, 577301323, 581004977, 585433841, 588591874, 590192378, 590928555, 591145992, 590686560, 589762211, 588540554, 587150753, 585740268, 583996117, 582092881, 580593884, 579319239, 577800453, 576734781, 576928020, 577782273, 578801215, 579657555, 580574870, 582052410, 583614409, 585037947, 587009311, 589280903, 591377795, 592925727, 593508363, 593411446, 593219399, 592635810, 591028273, 588072300, 586180627, 587089062, 588548183, 590376675, 593632638, 597950578, 603180230, 610817134, 620050848, 628797054, 636797488, 644049466, 650536239, 655923724, 660636961, 665760040, 671490312, 676080942, 679412365, 682990193, 687116981, 690562844, 692556798, 693343282, 695265949, 699021697, 701999128, 703914583, 705228329, 706588507]
1517.5G06588507J191377J122415J823187J985669J804054J243055L91364L83973P23243
1535.8G17256844m54545j781464k06768J426697J249194K13861o44386p60495r08375
1554.2G15390563j660585k645851n38349J197934J87219p80285j299917q61884j69277
1572.6G08819568q46982j306593k44141P4923m06802q57770j228034j382471j400768
1590.9G01220930j555741j846731k004027k088487k302528k600729k962768l281176
1607.2F82578743l374279l309429l616690m652441m812896k998710k885580l885627
1623.5F53043091l533482k976656k684772k403260k887666l024697q27730L07441n9187
1641.9F34953082n50330m54605J181066J731158J138866L089308M381180L467620K904832
$$ y = [706588507, 707779884, 708902299, 710725486, 712711155, 714515209, 715758264, 716149628, 716533601, 717256844, 716802299, 715020835, 714814067, 716240764, 717489958, 717703819, 717059433, 716298938, 715390563, 713729978, 711084127, 710545778, 711743712, 711930931, 711150646, 709850729, 708988845, 708819568, 707972586, 706665993, 706421852, 706496775, 706089973, 705232203, 704004169, 702621698, 701220930, 699665189, 697818458, 695814431, 693725944, 691423416, 688822687, 685859919, 682578743, 679204464, 675895035, 672278345, 667625904, 662813008, 659814298, 656928718, 653043091, 649509609, 646532953, 643848181, 641444921, 638557255, 635532558, 634704828, 635012269, 634953082, 634402752, 633948147, 635129213, 636860371, 637999237, 641088545, 645469725, 648937345, 651842177]
1660.3F51842177L317475M200995L711403L256976M209340M581332M773915N275369
1676.6F85168982M444658L277123L217101N592943O138384M656672M341662L608883
1692.9G20446408K877950K844394L145337M368067M012882K986133L070176K985835
1709.2G46737182K414525J595258Q76785J494765K826691K531230J824498J621366
1725.5G61922300J382172J114368P85053R41754K027332J975656J608968J683771J595378
1743.9G75036752J399100J431465K115905K968908K585172J928926J844347J611232
1760.2G90921807J545966J679897J254499P09176L62873O66142J630783J741350J175940
1778.6H01688433Q00848Q10086R56059J021922N29289j57535L34978J296341J129389
$$ y = [651842177, 655159652, 659360647, 663072050, 666329026, 670538366, 675119698, 679893613, 685168982, 689613640, 692890763, 696107864, 701700807, 707839191, 712495863, 716837525, 720446408, 723324358, 726168752, 729314089, 733682156, 737695038, 740681171, 743751347, 746737182, 749151707, 750746965, 751623750, 753118515, 755945206, 758476436, 760300934, 761922300, 763304472, 764418840, 765203893, 766145647, 768172979, 770148635, 771757603, 773441374, 775036752, 776435852, 777867317, 779983222, 782952130, 785537302, 787466228, 789310575, 790921807, 792467773, 794147670, 795402169, 796111345, 796474218, 797140360, 798771143, 800512493, 801688433, 802489281, 803299367, 804255426, 805277348, 805806637, 805649102, 805984080, 807280421, 808409810]
1796.9H08409810N18799M79519J007617J137912P01189K83837M58956R09388Q81076
1815.3H14788103N67436M26352L34144K12431K71261J85847J81436Q60870J054824
1833.6H18882704N07891K21252K16425n4777k41697K86937O95646O76215N27203K26795
1854H21944594P749P3314K99751K99752q4400n50866l12209O92427R59039M61757J95324
1876.5H23986232K89679L40044K13325J06931Q4221J08421K92182L13103K03610L44574
1896.9H26282322L77596J50144L099M2022O2763L0816R8348J58190J8776j08242K0683
1919.3H27136517O4194J54257M21464L66807J15275K3604R5665J69874O3538k22564
1939.7H28388631k96235J32025M43398K94984J40428J63854K26795K06530J16647R5307
$$ y = [808409810, 808928609, 809408128, 810415745, 811553657, 812254846, 812538683, 812997639, 813907027, 814788103, 815355539, 815781891, 816116035, 816328466, 816599727, 816785574, 816967010, 817827880, 818882704, 819390595, 819611847, 819828272, 819773495, 819531798, 819818735, 820514381, 821190596, 821717799, 821944594, 821952343, 822025657, 822325408, 822625160, 822540760, 821989894, 821677685, 822370112, 823329151, 823790908, 823986232, 824275911, 824615955, 824829280, 824936211, 825020432, 825128853, 825421035, 825734138, 825937748, 826282322, 826659918, 826810062, 826813161, 826855183, 826917946, 826948762, 827047110, 827205300, 827224076, 827115834, 827136517, 827200711, 827354968, 827776432, 828143239, 828258514, 828282118, 828377783, 828547657, 828611195, 828388631, 828092396, 828224421, 828667819, 828962803, 829103231, 829267085, 829493880, 829700410, 829817057, 829912364]
1960.1H29912364J53602J06632k8908M4048K46406K82049J62363J5795p510R7215J56879
1982.5H31140935M9174j19805j50919m5121R6500J27375K9862M7803J22190k0564k52366
2005H31025064k83480r4533o795k25782m72248m06265k10404l36051o98090o69002
2025.4H27622414r8586J92463j35481m26352l40343j92046k81990m10974l02195j09375
2045.8H25517535q2552k14398k75612r0480J26243N5074j52170j55330N7340K04265
2066.2H24989915O4790r2745M1724K10821J19627p8023n7757J47879J79053N901n5969
2088.6H25475216J05858K51591J58906j6153K6047K13206K58804J06871j2160Q5831
2109H26654017K07067J37925r120p629J18494J55985L9935q1360l4690J05500Q8215
$$ y = [829912364, 830065966, 830172598, 830143690, 830187738, 830434144, 830716193, 830878556, 830894351, 830886841, 830984056, 831140935, 831190109, 831070304, 830919385, 830874264, 830970764, 831098139, 831128001, 831175804, 831297994, 831277430, 831025064, 830741584, 830647051, 830640256, 830414474, 829942226, 829535961, 829325557, 828989506, 828291416, 827622414, 827523828, 827716291, 827580810, 827154458, 826814115, 826622069, 826340079, 825929105, 825626910, 825517535, 825434983, 825220585, 824944973, 824854493, 824980736, 825035810, 824883640, 824728310, 824785650, 824989915, 825054705, 824961960, 825003684, 825214505, 825334132, 825256109, 825198352, 825346231, 825525284, 825531185, 825475216, 825581074, 825832665, 825991571, 825975418, 826001465, 826214671, 826473475, 826580346, 826568186, 826654017, 826861084, 826999009, 826989889, 826982260, 827100754, 827256739, 827296674, 827215314, 827180624, 827286124, 827374339]
2131.4H27374339p8022j04189O2048J75297Q1778r0718p2360J31547K07186N2094m6432
2153.9H27692568J02580L00109K74718J16885J30117K85685L50892L21269L09170L82602
2174.3H30266595M95672M51148K76386K56658M23312N08070L80337K17319K50936M31537
2194.6H33957970M45008K46048J74284L58701M89414L47853J74999K54452M58956M60505
2215H37368190K37644J27077L07977M86613L49581J01387J19686L42668L76165J58071
2235.4H39975059N4479K14815L63588K32697k1041N007K65420L13222P9155l9280J49668
2257.9H41592789L47674K49803J4484J5556K50757L80218K15471L1114J57713L44635
2278.3H43600214K57313P3015P3433J97411J65403p7248k00391j5735J43289j4722
$$ y = [827374339, 827296317, 827192128, 827254176, 827429473, 827511251, 827420533, 827348173, 827479720, 827686906, 827739000, 827692568, 827795148, 828095257, 828369975, 828486860, 828616977, 828902662, 829253554, 829574823, 829883993, 830266595, 830762267, 831213415, 831489801, 831746459, 832169771, 832677841, 833058178, 833275497, 833526433, 833957970, 834402978, 834649026, 834823310, 835182011, 835671425, 836019278, 836194277, 836448729, 836907685, 837368190, 837605834, 837732911, 838040888, 838527501, 838877082, 838978469, 839098155, 839440823, 839816988, 839975059, 840029538, 840244353, 840607941, 840840638, 840819597, 840824604, 841090024, 841403246, 841482401, 841443121, 841592789, 841940463, 842190266, 842204750, 842220306, 842471063, 842851281, 843066752, 843097866, 843255579, 843600214, 843857527, 843930542, 844003975, 844201386, 844366789, 844289541, 844089150, 844073415, 844216704, 844201982]
2298.7H44201982k62916k77042j13547q7977l17156m86851l04699q2254k51174n93066
2319.1H41425300o58810m13776k25902l82244n59092l54945r4176j89662m01377m12405
2339.5H37732911k24233J53244P00593P68006L0875q65698j303911j229644r54509
2357.8H34807634m70280J17242M01855M54485O15835Q22783Q96811Q54373Q13246Q56042
2378.2H40170026Q78691P03633M19855K08736Q5771q881j15454k16127k14457j14024
2398.6H41797769r2804k06471k85625k35379j80006k41160l52026l56495k62320k59519
2419H39325964l88324m75287m16518l20672l62516m82976m76897l78549l60072m50253
2439.4H35213900n28753m72486l55780l77655n18918n44727m19259l65675m78089n56826
$$ y = [844201982, 843939066, 843662024, 843548477, 843460500, 843143344, 842656493, 842351794, 842269540, 842018366, 841425300, 840766490, 840352714, 840126812, 839744568, 839185476, 838830531, 838736355, 838546693, 838145316, 837732911, 837508678, 837661922, 838362515, 839130521, 839161396, 838295698, 836991787, 835762143, 834807634, 834337354, 834454596, 834856451, 835310936, 835926771, 836749554, 837646365, 838500738, 839313984, 840170026, 841048717, 841752350, 842172205, 842380941, 842466712, 842457831, 842342377, 842126250, 841911793, 841797769, 841704965, 841498494, 841212869, 840977490, 840797484, 840556324, 840204298, 839847803, 839585483, 839325964, 838937640, 838462353, 838045835, 837725163, 837362647, 836879671, 836402774, 836024225, 835664153, 835213900, 834685147, 834212661, 833856881, 833479226, 832960308, 832415581, 831996322, 831630647, 831152558, 830595732]
2459.8H30595732m62115l39031l41058m19438m33445l45826k89381l78668m79400m30346
2480.2H26677024l13043l02851l94762m01795k70247j81377k57969l44992k84970j88112
2500.6H23736906j99497k66909k65360j85907j53422k37406l28839l25441k67386k57731
2521H21249008l26931l94285l81291l57747m20094n01275n00559m42803m37975n13494
2541.4H16972554n72622n28991m50850m64916n27561n18143m51803m57585n47648n91695
2561.8H11860740n26607m40478m27246m57466m70400m50492m37438m72129n07712m72605
2582.2H07198167l83556l19839l43263m02450l60847k66254k87592l75569l74615l00229
2602.6H03783953k84314l78668m85719n19990n28753n78106o64293p08521o91235p11322
$$ y = [830595732, 830133617, 829794586, 829453528, 829034090, 828600645, 828254819, 827965438, 827586770, 827107370, 826677024, 826363981, 826061130, 825666368, 825264573, 824994326, 824812949, 824554980, 824209988, 823925018, 823736906, 823537409, 823270500, 823005140, 822819233, 822665811, 822428405, 822099566, 821774125, 821506739, 821249008, 820922077, 820527792, 820146501, 819788754, 819368660, 818867385, 818366826, 817924023, 817486048, 816972554, 816399932, 815870941, 815420091, 814955175, 814427614, 813909471, 813457668, 813000083, 812452435, 811860740, 811334133, 810893655, 810466409, 810008943, 809538543, 809088051, 808650613, 808178484, 807670772, 807198167, 806814611, 806494772, 806151509, 805749059, 805388212, 805121958, 804834366, 804458797, 804084182, 803783953, 803499639, 803120971, 802635252, 802115262, 801586509, 801008403, 800344110, 799635589, 798944354, 798233032]
2623G98233032q01921q81552q71122q12114q68439j018584j041353r38832r08018r75787
2643.4G89115310j008332r65059r36806r63211j006723j001536r03309q34107q81553
2661.7G80614674r13024q70466q53896q67963q40843p94709p39038p02738p55251q07583
2682.1G72469163p74741p33555p45475p74264p87258p58887p37548q17596r07779q97885
2702.5G64534175q69453r00328r55641r72927r30965q72194q46088q50797q33332q05378
2722.9G55697072p85649p29680o84142p02620p31528p11620o47604o05881o40869o88851
2743.3G48768628o66976o22034o10352o08504n68211n15699n15044n53489n50687n02706
2763.7G43054926m86672n14328n33640n31197n56588o27697p21097q09014q54253q60691
$$ y = [798233032, 797431111, 796549559, 795678437, 794866323, 793997884, 792979300, 791937947, 790999115, 790091097, 789115310, 788106978, 787141919, 786205113, 785241902, 784235179, 783233643, 782330334, 781496227, 780614674, 779701650, 778831184, 777977288, 777109325, 776268482, 775473773, 774734735, 774031997, 773276746, 772469163, 771694422, 770960867, 770215392, 769441128, 768653870, 767894983, 767157435, 766339839, 765432060, 764534175, 763664722, 762764394, 761808753, 760835826, 759904861, 759032667, 758186579, 757335782, 756502450, 755697072, 754911423, 754181743, 753497601, 752794981, 752063453, 751351833, 750704229, 750098348, 749457479, 748768628, 748101652, 747479618, 746869266, 746260762, 745692551, 745176852, 744661808, 744108319, 743557632, 743054926, 742568254, 742053926, 741520286, 740989089, 740432501, 739804804, 739083707, 738274693, 737420440, 736559749]
2784.1G36559749q71837q94011r17673r85324j110315j211048j258909j315534j367569
2802.4G26627529j426399j510263j533985j546144j639247j749516j820683j863063
2818.8G13538229j902520j963556k025902k061308k114594k230227k343535k408326
2835.1F96488261k473831k633452k908469l145575l258526l336013l416240l331840
2851.4F71984315k968013k557278k355933k412856k654433k991974l429950l932535
2867.7F48681343m333139m543722m723370m923462m878700m487753l911317l288447
2884F13591433k697707k115845j532853j058578p66993o77586p18653p72476r03964
2902.4F02346778j157403j444638j748621k118707k583981l085076l488005l675341
$$ y = [736559749, 735687912, 734793901, 733876228, 732890904, 731780589, 730569541, 729310632, 727995098, 726627529, 725201130, 723690867, 722156882, 720610738, 718971491, 717221975, 715401292, 713538229, 711635709, 709672153, 707646251, 705584943, 703470349, 701240122, 698896587, 696488261, 694014430, 691380978, 688472509, 685326934, 682068408, 678732395, 675316155, 671984315, 669016302, 666459024, 664103091, 661690235, 659035802, 656043828, 652613878, 648681343, 644348204, 639804482, 635081112, 630157650, 625278950, 620791197, 616879880, 613591433, 610893726, 608777881, 607245028, 606186450, 605419457, 604741871, 604023218, 603250742, 602346778, 601189375, 599744737, 597996116, 595877409, 593293428, 590208352, 586720347, 583045006]
2918.7E83045006l618896l332257k823711k073288j175582l21329N74768J670241K801895
2937E74746847L720403M396677M884124N155801N216659N210161N246460N208254N089998
2955.4F18875384N051494N020320M836917M513383M175782L889800L651142L512144
2971.7F53526366L409564L269196L161430L002823K697765K368927K150000K030551
2988F75616622J918554J687348J326561J042903Q27431N30303K30491m5717l10421
3006.4F82824075m45187m95076o96540j063287j380801j560748j679659j774967j862406
3024.7F71865404j962483k016902k016843j999855k111852k345323k361298k219021
3041.1F54831827k303005k584517k730190k610743k496064k556503k607286k651870
$$ y = [583045006, 579426110, 576093853, 573270142, 571196854, 570021272, 569699943, 570274711, 571944952, 574746847, 578467250, 582863927, 587748051, 592903852, 598120511, 603330672, 608577132, 613785386, 618875384, 623926878, 628947198, 633784115, 638297498, 642473280, 646363080, 650014222, 653526366, 656935930, 660205126, 663366556, 666369379, 669067144, 671436071, 673586071, 675616622, 677535176, 679222524, 680549085, 681591988, 682419419, 682949722, 683180213, 683134496, 682824075, 682378888, 681883812, 681187272, 680123985, 678743184, 677182436, 675502777, 673727810, 671865404, 669902921, 667886019, 665869176, 663869321, 661757469, 659412146, 657050848, 654831827, 652528822, 649944305, 647214115, 644603372, 642107308, 639550805, 636943519, 634291649]
3057.4F34291649k712608k650022k554297k512813k570748k721072k764523k666413
3073.7F13139153k492190k371311k503216k729357k808153k780795k678633k638221
3090E92137277k778709k857387k704859k514064k550006k694428k644420k482056k464354
3108.4E68446994k605617k590239k351761k272129k451658k716303k877415k771079
3124.7E47810793k531588k406895k462387k537668k440810k250433k225995k445937
3141E28509080k593934k484262k330244k172053k038300k179086k459109k488732k329648
3159.4E07433712k225220k204478k196431k161264k109557k081931k100676k089888
3175.7D90264267k033621j966387j914204j920282j915515j881480j911789j941413
$$ y = [634291649, 631579041, 628929019, 626374722, 623861909, 621291161, 618570089, 615805566, 613139153, 610646963, 608275652, 605772436, 603043079, 600234926, 597454131, 594775498, 592137277, 589358568, 586501181, 583796322, 581282258, 578732252, 576037824, 573393404, 570911348, 568446994, 565841377, 563251138, 560899377, 558627248, 556175590, 553459287, 550581872, 547810793, 545279205, 542872310, 540409923, 537872255, 535431445, 533181012, 530955017, 528509080, 525915146, 523430884, 521100640, 518928587, 516890287, 514711201, 512252092, 509763360, 507433712, 505208492, 503004014, 500807583, 498646319, 496536762, 494454831, 492354155, 490264267, 488230646, 486264259, 484350055, 482429773, 480514258, 478632778, 476720989, 474779576]
3192D74779576j894772j839608j792461j742184j691907j653046j679212j733660j683861
3210.3D59068865j582772j559496j534909j475871j465141j493007j499295j468063
3226.7D46990311j390040j223415j126021j346558j583636j503647j323372j188218
3243D36305404j063288j062244j230061j283109j108140r70632j023888j111031j092642
3261.3D26360369j039505r54092p67886o32555p88659j018166j045704j016766r98855
3279.7D18098181r63836r04829q30680p64131o56993o01917p16716r10819j064032
3298D10684228j047373q15153n94884o70254j019776j310766j322836j182586j087486
3316.4D01633114j014412r47863r36210r71675j140505j294017j213282j094878r98080
$$ y = [474779576, 472884804, 471045196, 469252735, 467510551, 465818644, 464165598, 462486386, 460752726, 459068865, 457486093, 455926597, 454391688, 452915817, 451450676, 449957669, 448458374, 446990311, 445600271, 444376856, 443250835, 441904277, 440320641, 438816994, 437493622, 436305404, 435242116, 434179872, 432949811, 431666702, 430558562, 429587930, 428564042, 427453011, 426360369, 425320864, 424366772, 423598886, 422966331, 422177672, 421159506, 420113802, 419097036, 418098181, 417134345, 416229516, 415398836, 414634705, 413977712, 413375795, 412659079, 411748260, 410684228, 409636855, 408821702, 408226818, 407556564, 406536788, 405226022, 403903186, 402720600, 401633114, 400618702, 399670839, 398734629, 397762954, 396622449, 395328432, 394115150, 393020272, 392022192]
3334.8C92022192q70645r93371j271188j334607j300604j157015r11117j045882j441360
3353.1C81696403j510501j291543j135677j155853j169742r54896q07851j075179j464993
3371.5C71130168j484513j181245r80317r63956j045049j031875p89643m87834k69443
3389.8C62896293l76075p97868r11236m63128j32113m79669r26375p65801m21494l29137
3410.2C57293397l44038m90933o18846m62115k75254k14547o7830J77860L17246K18064
3430.6C55533004K07096L50088J74135j68234j31041J90377L89457M24206M20988M62413
3451C57852489N48035O28143P55191Q88079P85798P33614J064241J263917Q83251L40909
3471.4C65743667L26663P40498J086444J039684P34419P69496J048624J030058R14603
$$ y = [392022192, 391151547, 390158176, 388886988, 387552381, 386251777, 385094762, 384183645, 383137763, 381696403, 380185902, 378894359, 377758682, 376602829, 375433087, 374478191, 373670340, 372595161, 371130168, 369645655, 368464410, 367484093, 366520137, 365475088, 364443213, 363653570, 363165736, 362896293, 362520218, 361722350, 360811114, 360347986, 360215873, 359736204, 358809829, 358044028, 357622534, 357293397, 356949359, 356458426, 355839580, 355377465, 355102211, 354887664, 354819834, 354997694, 355314940, 355533004, 355740100, 356090188, 356264323, 356096089, 355965048, 356155425, 356544882, 356969088, 357390076, 357852489, 358400524, 359028667, 359783858, 360671937, 361457735, 362191349, 363255590, 364519507, 365402758, 365743667, 366070330, 366810828, 367897272, 368936956, 369671375, 370440871, 371489495, 372519553, 373434156]
3489.8C73434156J016766J133740J148462J062721J030088J087695R74327Q02905Q58247
3508.1C82549107J151472J469672J365751R93431R64463J230388J443535J300693R56744
3526.5C93425256J006484J402438J628399J657843J598925J474261J481086J506776
3542.8D05181468J400679J336545J485169J643717J726359J836181J940429K019435
3559.1D18569982J985699J658022J349211K058506L159821L072351K548904K490580
3575.4D36893076K709955K962887L122628K904236K455026K639323L460765L493190
3591.7D60641086L161848L336787L678620L758967L762275L558069L065199L077179
3608.1D88040030L557861L739357L866285L716975L599406M348278M527449L601194
$$ y = [373434156, 374450922, 375584662, 376733124, 377795845, 378825933, 379913628, 380887955, 381690860, 382549107, 383700579, 385170251, 386536002, 387529433, 388493896, 389724284, 391167819, 392468512, 393425256, 394431740, 395834178, 397462577, 399120420, 400719345, 402193606, 403674692, 405181468, 406582147, 407918692, 409403861, 411047578, 412773937, 414610118, 416550547, 418569982, 420555681, 422213703, 423562914, 425621420, 428781241, 431853592, 434402496, 436893076, 439603031, 442565918, 445688546, 448592782, 451047808, 453687131, 457147896, 460641086, 463802934, 467139721, 470818341, 474577308, 478339583, 481897652, 484962851, 488040030, 491597891, 495337248, 499203533, 502920508, 506519914, 510868192, 515395641, 518996835]
3624.4E18996835K552926K797187M527926M734516M188538L936171L705323L603697
3640.7E49043119L471136K822280K078593K954602M966557M726350L659010L847063
3657E77568710M172802L589392L029882K728463K118051J837313K635717K542854K304256
3675.4F02527440L530085L872811L366292K887607K283096J767039J923383K675414
3691.7F24833167K899468K540350K024292J547039J632273K161503J939714J040757
3708F40618563N56409J502514K675056K341211J442135R38117R81212J201272J435876
3726.4F53692365J534700R83059J84775L69549J827776K437949J407445L9994Q4878
3744.7F62562490J158773O85692N38171J983404K265095J426995J086355J437127J315236
$$ y = [518996835, 521549761, 524346948, 528874874, 533609390, 537797928, 541734099, 545439422, 549043119, 552514255, 555336535, 557415128, 560369730, 565336287, 570062637, 573721647, 577568710, 581741512, 585330904, 588360786, 591089249, 593207300, 595044613, 597680330, 600223184, 602527440, 606057525, 609930336, 613296628, 616184235, 618467331, 620234370, 622157753, 624833167, 627732635, 630272985, 632297277, 633844316, 635476589, 637638092, 639577806, 640618563, 641174972, 642677486, 645352542, 647693753, 649135888, 650074005, 651055217, 652256489, 653692365, 655227065, 656210124, 656394899, 656764448, 658592224, 661030173, 662437618, 662477612, 662562490, 663721263, 664406955, 664945126, 666928530, 669193625, 670620620, 671706975, 673144102, 674459338]
3763.1F74459338Q41856O88434P59959J220942J514494J096308N79238N52952Q38221
3781.4F82551742Q09133Q33511J035392R61721P38919M07875J23143J50323r477K92539
3801.8F87894821J151145R94861J033723J385451Q82148m2021k69711K05994J87039
3820.2F93423450Q70883J516402J046062O81102M30048K61247K83062k6524m7386Q17001
3840.6F99255347J386583J389444R82940J23143j081526j530528Q76069K387941J465678
3858.9G05255091K57433k99871J67012M38511R2745M61042J028478J100719O86705
3877.3G09187865n9724N6982N26250N62429O81162L37660J32144O84679O02901k20061
3897.7G12492287n96464j83820N65409J275182J284421P58469L09527m9353k48253
$$ y = [674459338, 675301194, 675989628, 676749587, 677970529, 679485023, 680581331, 681160569, 681713521, 682551742, 683360875, 684194386, 685229778, 686191499, 686930418, 687338293, 687461436, 687611759, 687602282, 687894821, 689045966, 690040827, 691074550, 692460001, 693342149, 693300128, 693030417, 693236411, 693423450, 694294333, 695810735, 696856797, 697537899, 697967947, 698229194, 698512256, 698485732, 698438346, 699255347, 700641930, 702031374, 703014314, 703137457, 702055931, 700525403, 701401472, 703789413, 705255091, 705512524, 705212653, 705379665, 705818176, 705910921, 706371963, 707400441, 708501160, 709187865, 709128141, 709185123, 709711373, 710273802, 710954964, 711292624, 711424768, 712109447, 712712348, 712492287, 711895823, 711712003, 712277412, 713552594, 714837015, 715595484, 715905011, 715855658, 715607405]
3916G15607405J0073L49998K73228J60694L17872K95639J29938L57032O14106L95298
3936.4G18511283J21355L2962Q9288K65657K39254J86443M00364M41313K11477J25349
3956.8G20624745J63734J62780K58386L47674K38538P9989J01030K26200K53737J98305
3977.2G22655118J54435J95980K58744K09630Q9347Q2672K02834K33829J77384J43766
3997.6G24403739
$$ y = [715607405, 715617478, 715967476, 716240704, 716401398, 716719270, 717014909, 717144847, 717501879, 718115985, 718511283, 718632638, 718665600, 718754888, 719020545, 719259799, 719446242, 719846606, 720287919, 720499396, 720624745, 720788479, 720951259, 721209645, 721557319, 721795857, 721875846, 721976876, 722203076, 722456813, 722655118, 722809553, 723005533, 723264277, 723473907, 723563254, 723645926, 723848760, 724082589, 724259973, 724403739]
##END=$$ End of the data block
