##TITLE=$$ Begin of the data block
##JCAMP-DX=5.00 $$ ACD/SpecManager v 10.08
##SPECTROMETER/DATA SYSTEM=Alpha
##DATE=23 Dec 2014 09:14:34
##DATA TYPE=INFRARED SPECTRUM
##DATA CLASS=XYDATA
##ORIGIN=
##OWNER=
##NPOINTS=1765
##FIRSTX=399.76428223
##LASTX=3997.64306641
##MAXX=3997.64306641
##MINX=399.76428223
##MAXY=0.84511924
##MINY=0.31121299
##XFACTOR=1.0000000000
##YFACTOR=1.000000000000000e-9
##FIRSTY=0.60371035
##DELTAX=2.03961372
##XUNITS=1/CM
##YUNITS=ARBITRARY UNITS
##XYDATA=(X++(Y..Y))
399.8F03710353m491388l403724j743614l63291N92769J512944J774252P44760j008570
418.1E97324491j571775o46830p42435k014816l121555l086626k433121k147079k045512
436.5E79514742q81255J540303L927172M695594L670871K722323K573610J947820L24547
454.8F00035727j013875r71913p14124j741766k936006k917528k368868k914607l721833
473.2E80735207k739132j173675p42555j296758j351297j81437O96004P5400j098037
491.5E72923720j361132j006484j203537k020836k535581k062500j707554k457976
507.9E58568120l494918l762246l425002l632545m428029m386306l198206k028585
524.2E30212283j455366r44078J30295J513899K427458L163994M394769N474508N097688
$$ y = [603710353, 599218965, 595815241, 594071627, 593708336, 594301105, 595814049, 597588301, 598333061, 597324491, 595752716, 595105886, 594363451, 592348635, 589227080, 586140454, 583707333, 581560254, 579514742, 578633487, 580173790, 584100962, 588796556, 592467427, 595189750, 597763360, 599711180, 600035727, 599021852, 598049939, 597335815, 595594049, 592658043, 589740515, 587371647, 584457040, 580735207, 577996075, 576822400, 576079845, 574783087, 573431790, 573250353, 573946357, 574021757, 572923720, 571562588, 570556104, 569352567, 567331731, 564796150, 562733650, 561026096, 558568120, 555073202, 551310956, 547885954, 544253409, 539825380, 535439074, 532240868, 530212283, 528756917, 527812839, 527943134, 529457033, 531884491, 535048485, 539443254, 544917762, 550015450]
542.5E50015450L153979J132846J71840k19583j135349k476812l258109l400505l779053
560.9E40204704m926503o202638o673992o238758n289793l836930j468241J584649
577.2E07152498M013121N273044O094038O855786O816984N195856K897262J402855
593.5E45701444R96232P51138R656o27518l68178L30448M41015K01106P05421J900494
613.9E50041258K583146K607584K926887L776907M481495M160523L086984K543867
630.2E76208651K735794K535760J499474P34508J082003J599729J164854L78907M96149
648.6E88435829J336693J585782R35972M69804R44912J539767J235127L07858l3855
667E96757889J393914K114594J310468J032948J585901K003610J551330Q38578Q52287
$$ y = [550015450, 553169429, 554302275, 554474115, 554254532, 553119183, 550642371, 547384262, 543983757, 540204704, 535278201, 529075563, 522401571, 516162813, 510873020, 507036090, 505567849, 507152498, 511165619, 516438663, 522532701, 529388487, 536205471, 541401327, 544298589, 545701444, 546697676, 547448814, 547458470, 546830952, 546462774, 546793222, 547234237, 547435343, 548140764, 550041258, 552624404, 555231988, 558158875, 561935782, 566417277, 570577800, 573664784, 576208651, 578944445, 581480205, 582979679, 583714187, 584796190, 586395919, 587560773, 587939680, 588435829, 589772522, 591358304, 592294276, 592764080, 593708992, 595248759, 596483886, 596791744, 596757889, 598151803, 600266397, 601576865, 602609813, 604195714, 606199324, 607750654, 608589232, 609441519]
685.3F09441519J270771R87351j9193q36670j080990j423061k370954l216445k977133
703.7E99775195j889884q87514j34646Q92877K430260L820122M335105M496157N095840
722F17933512N817115N864620N060017M191876L933430L758907K940535J802028J074433
740.4F52376473N74887l50714j761913l029287l624439l852845m272282m603863m270374
758.7F27185643l315866k148152r61423N85199K806365N114496O610870P339061P831096
777.1F51047289P986606P396519O197929N009234M290640L943444L597974L330291
793.4F92799926L421783L892541M297197M035413L314913K839088K711535K427220
809.7G19739616J761615J159728J067161J059473N13077l88444j077592j510441k208055
$$ y = [609441519, 610712290, 611699641, 611680448, 610843778, 609762788, 608339727, 605968773, 602752328, 599775195, 597885311, 596997797, 596863151, 597756028, 600186288, 604006410, 608341515, 612837672, 617933512, 623750627, 629615247, 634675264, 638867140, 642800570, 646559477, 649500012, 651302040, 652376473, 652951360, 652600646, 650838733, 647809446, 644185007, 640332162, 636059880, 631456017, 627185643, 623869777, 621721625, 620760202, 621345401, 624151766, 629266262, 635877132, 643216193, 651047289, 659033895, 666430414, 672628343, 677637577, 681928217, 685871661, 689469635, 692799926, 696221709, 700114250, 704411447, 708446860, 711761773, 714600861, 717312396, 719739616, 721501231, 722660959, 723728120, 724787593, 725300670, 724912226, 723834634, 722324193, 720116138]
828.1G20116138l355205m389464m716397m550636m540324m644573m296183l525317
844.4F86098039k964914k975940l215969l250122l252685l579140l643453j923978
860.7F61291838J913428N987883Q512854R730578J0444343J0262131Q444488N448640
877G22036183K545893K41101j907230m085660n628466n930782n482852n186260n118668
895.4F91483259m792928m235149m120946m784882n726874o492913p263422q271098
911.7F45795047r270668r653151r038090p693351o024062m121423k206743p24256L00288
930.1E97363591J221359K216697L264665M201591M752398M644453L424645O89387l161907
948.4F18616879p071555j0188758j2346625j3901115j5160918j6221821j7156482j7997980
$$ y = [720116138, 716760933, 712371469, 707655072, 703104436, 698564112, 693919539, 689623356, 686098039, 683133125, 680157185, 676941216, 673691094, 670438409, 666859269, 663215816, 661291838, 663205266, 669193149, 677706003, 687436581, 697880924, 708143055, 716587543, 722036183, 724582076, 724823177, 722915947, 718830287, 713201821, 707271039, 701788187, 696601927, 691483259, 686690331, 682455182, 678334236, 673549354, 667822480, 661329567, 654066145, 645795047, 636524379, 626871228, 617833138, 610139787, 604115725, 599994302, 597787559, 597063303, 597363591, 598584950, 600801647, 604066312, 608267903, 613020301, 617664754, 621089399, 621778786, 618616879, 611545324, 601356566, 589009941, 575108826, 559947908, 543726087, 526569605, 508571625]
964.7E08571625j8785924j9562513k0186960k0467222k0351887j9740343j8444717
979C71032059j6362577j3672203j0774792p979720n491406l399819j704663m33892
995.3C11212987L98367Q63582J029104R08107M63456k12163q10325j062066q55445
1013.7C11935604l07054M37200J292616K148927K950608L627390M045606M198253M140854
1032C34470004L721565K872616J923889J268595R95159J039148J313895J860469K833963
1050.4C52299303M175216N603015O925315Q230299R645342J0970444J1333764R253770
1066.7D18436468L662437m196108j0515958j2085646r302974n051374j405776J262784
1083C80803853L185332M554749N558490O269485O546497O207228N172372L615707J989514
$$ y = [508571625, 489785701, 470223188, 450036228, 429569006, 409217119, 389476776, 371032059, 354669482, 340997279, 330222487, 322242767, 316751361, 313351542, 311646879, 311212987, 311611354, 312474936, 313504040, 314412147, 314875603, 314663440, 313853115, 312791049, 311935604, 311628550, 312065750, 313358366, 315507293, 318457901, 322085291, 326130897, 330329150, 334470004, 338191569, 341064185, 342988074, 344256669, 345251828, 346290976, 347604871, 349465340, 352299303, 356474519, 362077534, 369002849, 377233148, 386878490, 397848934, 409182698, 418436468, 422098905, 417902797, 407386839, 395301193, 385998219, 380946845, 379541069, 380803853, 383989185, 388543934, 394102424, 400371909, 406918406, 413125634, 418298006, 421913713, 423903227]
1101.4D23903227R53257R88930J951099L184795M099071M467786M365325L900885L104478
1119.8D50918853K279133J955747K417803L423363M385233M674107L778607J513123
1136.1D75345969j712948m967004p369220q559704q729965q196443p076144n443484
1152.4D23291057l569692j813352k76357J290560L151834N216539P244169R149611
1168.7D43684369J0950983J2516409J3526380J3821185J3738870J3663292J3386905
1183E35288393J2494863J1007368R343982P725835N954265M041672K554774J935959
1199.3E90347111J864255J776337J770914K360821L465652M366100M651666M623472
1215.6F15226328M540623M082262K898932J291573O0022m89295r32932j589298j954675
$$ y = [423903227, 424856484, 425845414, 427796513, 430981308, 435080379, 439548165, 443913490, 447814375, 450918853, 453197986, 455153733, 457571536, 460994899, 465380132, 470054239, 473832846, 475345969, 473633021, 468666017, 461296797, 452737093, 444007128, 435810685, 428734541, 423291057, 419721365, 417908013, 417631656, 418922216, 422074050, 427290589, 434534758, 443684369, 454635352, 467151761, 480678141, 494499326, 508238196, 521901488, 535288393, 547783256, 558790624, 568134606, 575860441, 581814706, 585856378, 588411152, 590347111, 592211366, 593987703, 595758617, 598119438, 601585090, 605951190, 610602856, 615226328, 619766951, 623849213, 626748145, 628039718, 628099740, 627610445, 626677513, 625088215, 623133540]
1234F23133540j692772j184404r46879q66711k90752Q42333J708687J843929J721859
1252.3F24268830J848996J963853J574695R30012P72118J274586J823008J908362J715720
1270.7F38080180J586377J332164O07967l27348q13127o95884n82576r12249j305103
1289F36970401j314521j211941j482904j997829k169370j836419j514018j629710j853347
1307.4F21960342j632631j145959r53615j167833j416684j393139j530647k452195
1323.7F10267639l827214m786789n009711m836560m525423l935277k822697j225174
1340E79298794J5676L08872K59339K84374J33038l61264q92937j033426j017987j318991
1360.4E75675488j572550j097679n30481l39091k56360j88052L78072J098871J043499
$$ y = [623133540, 621440768, 620256364, 619309485, 618442774, 618152022, 618994355, 620703042, 622546971, 624268830, 626117826, 628081679, 629656374, 630586386, 631358504, 632633090, 634456098, 636364460, 638080180, 639666557, 640998721, 641606688, 641279340, 640466213, 639770329, 639187753, 638275504, 636970401, 635655880, 634443939, 632961035, 630963206, 628793836, 626957417, 625443399, 623813689, 621960342, 620327711, 619181752, 618228137, 617060304, 615643620, 614250481, 612719834, 610267639, 606440425, 601653636, 596643925, 591807365, 587281942, 583346665, 580523968, 579298794, 579314470, 579623342, 579882681, 580167055, 580300093, 579938829, 579045892, 578012466, 576994479, 575675488, 574102938, 573005259, 572474778, 572135687, 571879327, 571691275, 572069347, 573168218, 574211717]
1378.8E74211717N98013O95288J838386L673137M412055L143250J568556P04050K14756
1397.1E91059208m33266q87513j211524j392127j393556j717627j873613j480639j299917
1415.5E79369426j608670j122534K33650R02176J060247Q74400R03309J475692J558721
1433.9E83646417J403272J998722K341867K135992J534462N61595q8751j88768o09696
1452.2E92735112j678050l062963j870334J013100J488983J838029L325879M375041
1468.5E98164797N192041P556677R230912Q775234Q013845P286489O533443N385995
1484.9F56139433M639030N022168N728364M660845L337085L530026M123926L459930
1501.2F90640807J956284O76453J864374L889024L120601J951814J247287J286864
$$ y = [574211717, 574809730, 575505018, 577343404, 581016541, 585428596, 588571846, 590140402, 590844452, 591059208, 590625942, 589738429, 588526905, 587134778, 585741222, 584023595, 582149982, 580669343, 579369426, 577760756, 576638222, 576871872, 577774048, 578834295, 579708695, 580612004, 582087696, 583646417, 585049689, 587048411, 589390278, 591526270, 593060732, 593622327, 593533576, 593344808, 592735112, 591057062, 587994099, 586123765, 587136865, 588625848, 590463877, 593789756, 598164797, 603356838, 610913515, 620144427, 628919661, 636933506, 644219995, 650753438, 656139433, 660778463, 665800631, 671528995, 676189840, 679526925, 683056951, 687180877, 690640807, 692597091, 693273544, 695137918, 699026942, 702147543, 704099357, 705346644, 706633508]
1517.5G06633508J154185J113653J860738K016067J821339J255095L84331M04119P41542
1535.8G17384577n44310j938045j86920J559019J322448K16663o35803p35044r35972
1554.2G15506613j774668k788902m38094J362622K44558p80106j326918q53897j41024
1572.6G09010184q87573j364410k10106J31547l88384q58545j222491j383603j413047
1590.9G01413572j584172j908958k045513k070307k295375k618671k943217l239453
1607.2F82707906l364861l331900l638029m654407m789293k988458k926469l929972
1623.5F53084517l534616k973735k672672k380490k906442l062844p69198L95357j8298
1641.9F35161579n55337m72545J201450J705885J027346L161132M588306L542781K894342
$$ y = [706633508, 707787693, 708901346, 710762084, 712778151, 714599490, 715854585, 716238916, 716643035, 717384577, 716840267, 714902222, 714715302, 716274321, 717596769, 717813432, 717177629, 716442585, 715506613, 713731945, 710943043, 710504949, 711867571, 712112129, 711332023, 710005105, 709151208, 709010184, 708122611, 706758201, 706548095, 706679642, 706291258, 705432713, 704210222, 702826619, 701413572, 699829400, 697920442, 695874929, 693804622, 691509247, 688890576, 685947359, 682707906, 679343045, 676011145, 672373116, 667718709, 662929416, 659940958, 657014489, 653084517, 649549901, 646576166, 643903494, 641523004, 638616562, 635553718, 634784520, 635179877, 635161579, 634606242, 634133697, 635335147, 637041032, 638068378, 641229510, 645817816, 649360597, 652254939]
1660.3F52254939L332079M265546L743589L228307M170239M561484M755437N291403
1676.6F85603023M481017L255487L116011N538345O207347M719555M376054L624439
1692.9G20921278K855301K793133L098309M370392M043161K989591L086686L011584
1709.2G47169435K418816J561880P56145J379728K920151K681553J880467J615286
1725.5G62383461J357615J072824P31945R21488K081096J997590J581371J682162J606941
1743.9G75416493J382053J414717K112090K971232K598643J931131J845837J647055
1760.2G91319251J602948J703620J239896O74784K99036O27935J692295J825750J198053
1778.6H02183568P76053P82609R20236R88543N06342j83762L32356J326501J160145
$$ y = [652254939, 655587018, 659852564, 663596153, 666824460, 670994699, 675556183, 680311620, 685603023, 690084040, 693339527, 696455538, 701993883, 708201230, 712920785, 717296839, 720921278, 723776579, 726569712, 729668021, 734038413, 738081574, 741071165, 744157851, 747169435, 749588251, 751150131, 751906276, 753286004, 756206155, 758887708, 760768175, 762383461, 763741076, 764813900, 765545845, 766467333, 768548429, 770546019, 772127390, 773809552, 775416493, 776798546, 778213263, 780325353, 783296585, 785895228, 787826359, 789672196, 791319251, 792922199, 794625819, 795865715, 796540499, 796839535, 797467470, 799159765, 800985515, 802183568, 802959621, 803742230, 804662466, 805651009, 806157351, 805973589, 806305945, 807632446, 808792591]
1796.9H08792591N25713M78625J044155J184284P13110K54631M20571R28402R46641
1815.3H15288723O13451M37676L15786J60336K11537J50800J78695Q87930J092136
1833.6H19337070N34773K29359K05636r1434k80976L00944P34150O88374N29647K44796
1854H22432339L2664Q4161K85983K72811j06275n83649l51846P12693J001656M71413
1874.4H24251950K18928L28242L34144J69456P6771N7161P3075K98202L59058K34008
1894.8H26400995L55125L89874J47044j2099M2140O5029L5465J13427J54257j3709
1915.2H27677548j33812L1828Q6487J65999M37855L83974J09791J9968J19030J64807
1935.6H29063475L2067k26616k91527J48177M86136L08216J00731J32561K36034K19644
$$ y = [808792591, 809318304, 809796929, 810841084, 812025368, 812738478, 812993109, 813413680, 814342082, 815288723, 815902174, 816339850, 816655636, 816815972, 817027509, 817178309, 817357004, 818244934, 819337070, 819871843, 820101202, 820306838, 820215404, 819934428, 820235372, 820969522, 821657896, 822187543, 822432339, 822465003, 822549164, 822835147, 823107958, 823001683, 822418034, 822066188, 822778881, 823780537, 824251950, 824470878, 824799120, 825133264, 825302720, 825379491, 825436652, 825509727, 825807929, 826166987, 826400995, 826756120, 827145994, 827293038, 827280939, 827323079, 827388108, 827423573, 827537000, 827691257, 827677548, 827543736, 827575564, 827662051, 827828050, 828265905, 828649879, 828759670, 828779638, 828898668, 829063475, 829095542, 828868926, 828577399, 828725576, 829211712, 829519928, 829620659, 829753220, 829989254, 830208898]
1956H30208898R9480N9545J29163R6500j3590J01090K79009K44498J32203K9028r179
1978.5H31356645P7009J59561O3956j12414j40905m1545J03772J55926M3272K0147
1998.8H31685424P3433m6790k24471k23815n7221k1815k70009n02229l96252j76847
2019.2H29839408l09884o74546o50823j10149J51515j63079m11153l06248j61290k56420
2039.6H26947331m02033l19004j31488r5427k10106k48492p9095J08242M5597j39415
2060H25476110j35422N6446J85251P5519q0645J6332J96039J27256o8605n4657J36912
2082.5H25930536J94907L5822p4565Q9467K78651J84775j3233P332J99199K76386J33813
2104.9H27243090j4365O4850K17080J68025k801j2159J19388J56283M8041o5326m3631
$$ y = [830208898, 830308378, 830367923, 830497086, 830593586, 830579996, 830681086, 830960095, 831204593, 831336796, 831365824, 831356645, 831433654, 831593215, 831657171, 831544757, 831403852, 831362307, 831466079, 831622005, 831665277, 831685424, 831758857, 831712067, 831487596, 831263781, 831206560, 831184745, 830914736, 830412507, 830016255, 829839408, 829529524, 828854978, 828204155, 828094006, 828245521, 828082442, 827671289, 827365041, 827203751, 826947331, 826545298, 826226294, 826094806, 825999379, 825789273, 825540781, 825461686, 825569928, 825615525, 825476110, 825340688, 825397134, 825582385, 825657904, 825577259, 825593591, 825789630, 825916886, 825848281, 825793624, 825930536, 826125443, 826161265, 826086700, 826176167, 826454818, 826639593, 826626360, 826633692, 826832891, 827109277, 827243090, 827228725, 827293575, 827510655, 827678680, 827675879, 827663720, 827783108, 827939391, 827987432, 827922106, 827878475]
2127.3H27878475O4135P4267n3167q5890O4432J66297Q4937n3942n4002Q7023J52289
2149.8H28324854M5240j5080J24336K88844K64168J24692J29164K86519L83616L50654
2170.2H30307007K80917L29911M94540M92573K95758K43366M01556M86076L70383K23577
2190.6H33925664K62678M47154M69685K75373J93417L68893M87864L32892J60337K38418
2211H37162375M41015M50969K57969J70469L24905M60088L23832J03832J29640L48985
2231.4H40174079L91960J78754N3049J90734L24607J89960k4676M5896L18169L41058
2251.8H42183590N5909o9797J68800L78669K29895k2769K3067K81215L74913J94371
2272.2H43797863M5001J82867L42727K22802L4749O8486K22624K02119o1154k22087
$$ y = [827878475, 827942610, 828016877, 827963710, 827877820, 827942252, 828108549, 828193486, 828139544, 828085542, 828172565, 828324854, 828370094, 828355014, 828479350, 828768194, 829032362, 829157054, 829286218, 829572737, 829956353, 830307007, 830587924, 830917835, 831412375, 831904948, 832200706, 832444072, 832845628, 833331704, 833702087, 833925664, 834188342, 834635496, 835105181, 835380554, 835573971, 835942864, 836430728, 836763620, 836923957, 837162375, 837603390, 838054359, 838312328, 838482797, 838807702, 839267790, 839591622, 839695454, 839825094, 840174079, 840566039, 840744793, 840797842, 840988576, 841313183, 841503143, 841478467, 841524363, 841842532, 842183590, 842239499, 842169702, 842338502, 842717171, 842947066, 842924297, 842947364, 843228579, 843603492, 843797863, 843842864, 844025731, 844368458, 844591260, 844626009, 844694495, 844917119, 845119238, 845058084, 844835997]
2292.5H44835997l3081J76966M5479k31922k82109j16944p4685l05533m59612k73227
2312.9H43281329r8408k76446n76854o24120l81410k02239l60488n31018l40164o5863
2333.3H39824319r7871l37183m60327k53916J55032O06358O61850n365q54730j272440
2353.7H37965727j177311q57174l99530K3603K09451L77655O62625Q89480R35495Q40246
2374.1H39470267P91729Q52108Q44359O53982M04716J99973M6492n9128j38104j97291
2394.5H42869103j80244j05620j13428k20656k77817k17855j85013k82943l82722l44574
2414.9H40558231k41876k46584l69966m55380m07636l32236l83377n00143m91619l58105
2435.3H36771309k99632m25160n44071m78685l65019l97742n28931n37336m08054l44097
$$ y = [844835997, 844802916, 844979882, 845025361, 844793439, 844511330, 844394386, 844319701, 844014168, 843554556, 843281329, 843182921, 842906475, 842329621, 841705501, 841324091, 841121852, 840761364, 840230346, 839890182, 839824319, 839726448, 839389265, 838928938, 838675022, 838830054, 839436412, 840098262, 840092897, 839238167, 837965727, 836788416, 835931242, 835531712, 835555315, 835764766, 836142421, 836805046, 837694526, 838630021, 839470267, 840261996, 841114104, 841958463, 842612445, 843017161, 843217134, 843263626, 843204498, 843066394, 842869103, 842688859, 842583239, 842469811, 842249155, 841971338, 841753483, 841568470, 841285527, 840902805, 840558231, 840316355, 840069771, 839699805, 839244425, 838836789, 838504553, 838121176, 837621033, 837129414, 836771309, 836471677, 836046517, 835502446, 835023761, 834658742, 834261000, 833732069, 833194733, 832786679, 832442582]
2455.7H32442582m51446n57661m68969l27468l36170m31121m43876l57806l01421l64959
2476.1H28401685m45307m19616l36766l26038m11153m04715k39849j46747k57373l66390
2496.5H25047731k88248j66118j99616l13699l07560j70410r7632j90854l13103l48032
2516.9H22652459l12269k80320l25620l86298l73662l62873m23193m95672n03957m42028
2537.3H18746567m36664n22196n61893n17368m70758m78506n14984n15461m69327m62830
2557.7H13796580n29170n60701n04732m45068m34280m61161m74751m33385m04954m40836
2578.1H09107542n03361m96686m06146l47256l56198l84331l53276k73705k74837l50773
2598.5H05360973l79205l29971l08752m06742n23866n27322m86731n40376o69897p32958
$$ y = [832442582, 831991136, 831433475, 830964506, 830637038, 830300868, 829869747, 829425871, 829068065, 828766644, 828401685, 827956378, 827536762, 827199996, 826873958, 826462805, 826058090, 825818241, 825671494, 825414121, 825047731, 824759483, 824593365, 824393749, 824080050, 823772490, 823602080, 823504448, 823313594, 823000491, 822652459, 822340190, 822059870, 821734250, 821347952, 820974290, 820611417, 820188224, 819692552, 819188595, 818746567, 818309903, 817787707, 817225814, 816708446, 816237688, 815759182, 815244198, 814728737, 814259410, 813796580, 813267410, 812706709, 812201977, 811756909, 811322629, 810861468, 810386717, 809953332, 809548378, 809107542, 808604181, 808107495, 807701349, 807354093, 806997895, 806613564, 806260288, 805986583, 805711746, 805360973, 804981768, 804651797, 804343045, 803936303, 803412437, 802885115, 802398384, 801858008, 801188111, 800455153]
2618.9H00455153p02083o77526p36833q54492r16243q98361r14812r86755r99629r26912
2639.3G91841507r04381r88007j050949j014590r37224r14275r59218r76443r24826
2657.6G83171594q77499q81434q88705q70049q62241q57234q16047p75397p58946p54177
2678G74829865p83921p79032o99163o81579p46369p72119p73489p81656p77066q33571
2698.4G67201900r00328q88109q79764r05812r36866r48012r15289q79943q67784q45969
2718.8G58234024q07762p98762q03113p72715p27295o86467o79433o94037o61671o25253
2739.2G50977516o52551o99342o91950o25372n68867n71251n64992n13852n06043n52178
2759.6G45031118n50389m87208m55082m95672n60403n73516n68747o41883p45594p94888
$$ y = [800455153, 799753070, 799075544, 798338711, 797484219, 796567976, 795669615, 794754803, 793768048, 792768419, 791841507, 790937126, 789949119, 788898170, 787883580, 786946356, 786032081, 785072863, 784096420, 783171594, 782294095, 781412661, 780523956, 779653907, 778791666, 777934432, 777118385, 776342988, 775584042, 774829865, 774045944, 773266912, 772567749, 771886170, 771139801, 770367682, 769594193, 768812537, 768035471, 767201900, 766301572, 765413463, 764533699, 763627887, 762691021, 761743009, 760827720, 759947777, 759079993, 758234024, 757426262, 756627500, 755824387, 755051672, 754324377, 753637910, 752958477, 752264440, 751602769, 750977516, 750324965, 749625623, 748933673, 748308301, 747739434, 747168183, 746603191, 746089339, 745583296, 745031118, 744480729, 743993521, 743538439, 743042767, 742482364, 741908848, 741340101, 740698218, 739952624, 739157736]
2780G39157736q03888q16106q59440r11236r36627r97782j136541j230836j242638
2798.4G30222642j307129j395882j439392j491130j518547j548588j653254j766921
2814.7G18101799j829981j831293j862765j979351k045035k060056k138972k261520
2831G02092826k353847k397835k448499k618313k920032l170490l276825l351271l426015
2849.3F76129699l313124k938390k567649k400100k443433k683342l026783l425121
2865.7F53331757l903866m332543m571974m748106m936337m901886m514397l921449
2882F17501199l279924k675712k094031j517593j056672q03232p44581p50363p60496
2900.3F03818595q98003j160264j439333j724839k088905k595782l149629l538966
$$ y = [739157736, 738353848, 737537742, 736678302, 735767066, 734830439, 733832657, 732696116, 731465280, 730222642, 728915513, 727519631, 726080239, 724589109, 723070562, 721521974, 719868720, 718101799, 716271818, 714440525, 712577760, 710598409, 708553374, 706493318, 704354346, 702092826, 699738979, 697341144, 694892645, 692274332, 689354300, 686183810, 682906985, 679555714, 676129699, 672816575, 669878185, 667310536, 664910436, 662467003, 659783661, 656756878, 653331757, 649427891, 645095348, 640523374, 635775268, 630838931, 625937045, 621422648, 617501199, 614221275, 611545563, 609451532, 607933939, 606877267, 606074035, 605329454, 604579091, 603818595, 602920592, 601760328, 600320995, 598596156, 596507251, 593911469, 590761840, 587222874]
2916.6E87222874l677130l599882l301441k784074k056956j190960l42489N58496J674115
2935E72502553K818168L713607M398108M910052N147397N177796N200684N252958N203902
2953.4F14325225N103290N088866N073786M901886M548728M179180L913224L688276
2969.7F50822461L526151L415048L249586L107488L000498K765297K442778K196490
2986F74525797K027810J892567J705527J391768J093924Q34048N09620K25425j2279
3004.4F84194207k66313m23849n02765o86646j009822j334667j564026j717150j788795
3022.7F74900174j841068j948893k020896k025306k001226k103925k347171k389312
3039F58222377k270996k328933k537846k664328k587795k490580k561331k657711k705574
$$ y = [587222874, 583545744, 579945862, 576644421, 573860347, 571803391, 570612431, 570269942, 570828438, 572502553, 575320721, 579034328, 583432436, 588342488, 593489885, 598667681, 603868365, 609121323, 614325225, 619428515, 624517381, 629591167, 634493053, 639041781, 643220961, 647134185, 650822461, 654348612, 657763660, 661013246, 664120734, 667121232, 669886529, 672329307, 674525797, 676553607, 678446174, 680151701, 681543469, 682637393, 683471441, 683981061, 684206486, 684194207, 683927894, 683504045, 683001280, 682314634, 681304812, 679970145, 678406119, 676688969, 674900174, 673059106, 671110213, 669089317, 667064011, 665062785, 662958860, 660611689, 658222377, 655951381, 653622448, 651084602, 648420274, 645832479, 643341899, 640780568, 638122857, 635417283]
3057.4F35417283k734065k673090k555907k472818k526164k713978k820194k710283
3073.7F14210784k474784k375961k552509k756476k809406k792835k681613k620935
3090E93146265k787352k865434k672553k489209k548456k707720k667844k494991k479732
3108.4E69432974k617836k584517k369881k324223k479375k702951k853394k753257
3124.7E48747540k540052k426565k461910k554298k471745k252579k229631k456247
3141E29354513k594889k503573k355755k182066k048135k199829k486586k505064k357185
3159.4E08121431k270341k186954k123952k140164k155483k131522k109647k066046
3175.7D90937322k025157k020299k010554j988918j931399j864433j880885j928389
$$ y = [635417283, 632683218, 630010128, 627454221, 624981403, 622455239, 619741261, 616921067, 614210784, 611736000, 609360039, 606807530, 604051054, 601241648, 598448813, 595767200, 593146265, 590358913, 587493479, 584820926, 582331717, 579783261, 577075541, 574407697, 571912706, 569432974, 566815138, 564230621, 561860740, 559536517, 557057142, 554354191, 551500797, 548747540, 546207488, 543780923, 541319013, 538764715, 536292970, 534040391, 531810760, 529354513, 526759624, 524256051, 521900296, 519718230, 517670095, 515470266, 512983680, 510478616, 508121431, 505851090, 503664136, 501540184, 499400020, 497244537, 495113015, 493003368, 490937322, 488912165, 486891866, 484881312, 482892394, 480960995, 479096562, 477215677, 475287288]
3192D75287288j904904j842440j798480j774192j735628j681030j667976j709551j694619
3210.3D59478468j606047j552403j524777j513064j521736j504421j483917j473189
3226.7D47298914j407832j253992j151800j316220j535475j481682j316011j201779
3243D36634123j093059j121611j289219j288682j104742r80765j030117j106203j057922
3261.3D26561803j006902r68277q01027o50257q03530j049101j088024j033127r57370
3279.7D18204188q94397q68172q48233q13842o91950o26833p67141r40293j041443
3298D10711884j010596q02607o24954p31528j058281j293242j294910j160682j066982
3316.4D01668102j046360j016468r58562r40203j116813j323729j256287j098216j004398
$$ y = [475287288, 473382384, 471539944, 469741464, 467967272, 466231644, 464550614, 462882638, 461173087, 459478468, 457872421, 456320018, 454795241, 453282177, 451760441, 450256020, 448772103, 447298914, 445891082, 444637090, 443485290, 442169070, 440633595, 439151913, 437835902, 436634123, 435541064, 434419453, 433130234, 431841552, 430736810, 429756045, 428725928, 427619725, 426561803, 425554901, 424586624, 423785597, 423135340, 422331810, 421282709, 420194685, 419161558, 418204188, 417309791, 416441619, 415593386, 414779544, 414087594, 413460761, 412693620, 411753327, 410711884, 409701288, 408898681, 408273727, 407542199, 406483918, 405190676, 403895766, 402735084, 401668102, 400621742, 399605274, 398646712, 397706509, 396589696, 395265967, 394009680, 392911464, 391907066]
3334.8C91907066q98123r76771j208842j315653j348257j222849r54985j043559j447647
3353.1C81490380j541257j259446j071722j160592j185178r39042q37445j122534j464576
3371.5C70908588j477152j209915j038164j020967j036704r71019p75516m94421k54631
3389.8C62630099m02391q30024q91805m42147j42366n22912r83566p92175l79652k50995
3410.2C56992066l26932n28484o33687m33326k27570k00570r5755J53810L20733K34782
3430.6C55255067J85430K90513J42336j83761j78814J38492M02510N01901M96685M85808
3451C57536167N02080N76317P57307Q95500P65145P24971J107723J332074Q97855L07381
3471.4C65402520L28421P52718J052886J025438P51764P75367J066029J027673Q71063
$$ y = [391907066, 391008943, 390032172, 388823330, 387507677, 386159420, 384936571, 383981586, 382938027, 381490380, 379949123, 378689677, 377617955, 376457363, 375272185, 374333143, 373495698, 372373164, 370908588, 369431436, 368221521, 367183357, 366162390, 365125686, 364154667, 363379151, 362884730, 362630099, 362227708, 361397684, 360505879, 360063732, 359921366, 359398454, 358414888, 357622713, 357243061, 356992066, 356665134, 356136650, 355502963, 355069637, 354842067, 354641497, 354545742, 354699552, 355020285, 355255067, 355440497, 355731010, 355873346, 355689585, 355510771, 355649263, 356051773, 356553674, 357050359, 357536167, 358038247, 358614564, 359371871, 360267371, 361032516, 361757487, 362865210, 364197284, 365095139, 365402520, 365730941, 366483659, 367536545, 368561983, 369313747, 370089114, 371155143, 372182816, 373053879]
3489.8C73053879R88036J119405J162171J116515J021742J010210R76383Q92610R04828
3508.1C82245779J147777J497120J430749J068145J023263J252443J421124J233339
3524.4C92319739R12994J042247J459569J658946J663655J564473J438916J547724
3540.8D03608263J629710J443624J318604J471877J604796J672327J845956J996517
3557.1D16591674K046049J980543J627475J311540K098561L251850L111542K590924
3573.4D34610158K574176K744674K949059L163487L019661K532691K600848L427834
3589.7D57622588L535300L220767L405094L721267L714085L704995L564119L121257
3606D85609472L160089L642768L808737L850698L622115L549337M384995M585921L646195
$$ y = [373053879, 374041915, 375161320, 376323491, 377440006, 378461748, 379471958, 380448341, 381340951, 382245779, 383393556, 384890676, 386321425, 387389570, 388412833, 389665276, 391086400, 392319739, 393232733, 394274980, 395734549, 397393495, 399057150, 400621623, 402060539, 403608263, 405237973, 406681597, 408000201, 409472078, 411076874, 412749201, 414595157, 416591674, 418637723, 420618266, 422245741, 423557281, 425655842, 428907692, 432019234, 434610158, 437184334, 439929008, 442878067, 446041554, 449061215, 451593906, 454194754, 457622588, 461157888, 464378655, 467783749, 471505016, 475219101, 478924096, 482488215, 485609472, 488769561, 492412329, 496221066, 500071764, 503693879, 507243216, 511628211, 516214132, 519860327]
3624.4E19860327K570868K804220M605531M833102M236997L970384L739655L582120
3640.7E50203204L430784K848446K092958K871394M927337M754484L670513L874600
3657E78673720M204452L564418L016174K762973K114773J827657K713621K567410K205610
3675.4F03650808L497064L949047L441572K886235K184988J656055J947284K830207
3691.7F26043260L036261K596378J992047J464724J575292K149462J923919R99868
3708F41781211M94659J458287K722323K442181J548410J011252R46164J125991J443089
3726.4F54973567J542091Q91983J04309M16636J854539K428055J478135N7936q0645
3744.7F63666606J035988O93322O01172K120197K384722J442313J051843J433790J324654
$$ y = [519860327, 522431195, 525235415, 529840946, 534674048, 538911045, 542881429, 546621084, 550203204, 553633988, 556482434, 558575392, 561446786, 566374123, 571128607, 574799120, 578673720, 582878172, 586442590, 589458764, 592221737, 594336510, 596164167, 598877788, 601445198, 603650808, 607147872, 611096919, 614538491, 617424726, 619609714, 621265769, 623213053, 626043260, 629079521, 631675899, 633667946, 635132670, 636707962, 638857424, 640781343, 641781211, 642275870, 643734157, 646456480, 648898661, 650447071, 651458323, 652404487, 653530478, 654973567, 656515658, 657407641, 657511950, 657928586, 659783125, 662211180, 663689315, 663747251, 663666606, 664702594, 665395916, 665997088, 668117285, 670502007, 671944320, 672996163, 674429953, 675754607]
3763.1F75754607Q13067O59525P97808J247645J489103J087844O10113O23822Q99136
3781.4F83982670P64489P30038J010716J035810Q36193M58539J09613N7399j54614
3799.8F88830853K34484J208127J060128J134217J504600Q92460j25766l27289J93358
3818.1F94605172J72972Q61764J505018J044869P26640M86434K58982K20418r6917
3836.5F99785352j29402P50244J367211J423538J108527K18391j184642j730263R06646
3854.8G02515602K531588J538813K61605l17037J85788L94880m2259M13298J117945
3873.2G08600223J228273P52151j06692J3172N71430O01053O59585K91646J36137P50601
3893.6G13497579O18935k70248o24478j75416N92232J348257J380265Q33570L26753
$$ y = [675754607, 676567674, 677227199, 678025007, 679272652, 680761755, 681849599, 682459712, 683083534, 683982670, 684747159, 685477197, 686487913, 687523723, 688359916, 688818455, 688928068, 688985467, 688830853, 689065337, 690273464, 691333592, 692467809, 693972409, 694864869, 694739103, 694411814, 694605172, 694778144, 695639908, 697144926, 698189795, 698916435, 699402869, 699661851, 699882269, 699785352, 699655950, 700406194, 701773405, 703196943, 704305470, 704523861, 703339219, 701608956, 702515602, 705047190, 706586003, 706847608, 706530571, 706716359, 707111239, 707068980, 707482278, 708600223, 709828496, 710580647, 710473955, 710487127, 711058557, 711659610, 712319195, 712610841, 712746978, 713497579, 714116514, 713846266, 713221788, 713046372, 713638604, 714986861, 716367126, 717200696, 717527449]
3912G17527449q4698l02255j4425L91722K95758J19269L25799L52860R1612K46823
3932.3G18949914O12736N08964J35422j30892K563M01079L69966J84715L59059M00543
3952.7G21794069J95205J67429K22326J68979J89304K67208K40385J98842K06589J87516
3973.1G23837852J91331K38777J94370J65284K78413K47002L934l8982J35124K15531
3993.5G25468636K06828K22563
3997.6G25898027
$$ y = [717527449, 717442751, 717140496, 717126071, 717517793, 717813551, 717932820, 718258619, 718611479, 718703091, 718949914, 719562650, 720071614, 720207036, 720076144, 720078707, 720479786, 720849752, 721034467, 721393526, 721794069, 721989274, 722156703, 722379029, 722548008, 722737312, 723004520, 723244905, 723443747, 723650336, 723837852, 724029183, 724267960, 724462330, 724627614, 724906027, 725153029, 725156963, 725117981, 725253105, 725468636, 725675464, 725898027]
##END=$$ End of the data block
