##TITLE=$$ Begin of the data block
##JCAMP-DX=5.00 $$ ACD/SpecManager v 10.08
##SPECTROMETER/DATA SYSTEM=Alpha
##DATE=23 Dec 2014 09:14:34
##DATA TYPE=INFRARED SPECTRUM
##DATA CLASS=XYDATA
##ORIGIN=
##OWNER=
##NPOINTS=1765
##FIRSTX=399.76428223
##LASTX=3997.64306641
##MAXX=3997.64306641
##MINX=399.76428223
##MAXY=0.84647053
##MINY=0.31151304
##XFACTOR=1.0000000000
##YFACTOR=1.000000000000000e-9
##FIRSTY=0.60761994
##DELTAX=2.03961372
##XUNITS=1/CM
##YUNITS=ARBITRARY UNITS
##XYDATA=(X++(Y..Y))
399.8F07619941m503608l456175j847505m45426P27117J700759J834095P15375r09210
418.1F01435363j528322j258552j533807k146840k816021l037751k508640k153874
434.4E84451556j882851m38034J707494L313124L725111L298164L028095K827167J814246
452.8F01844072R3043r63509q33094q07643j741111k660752k785503k539456l049672
471.2E86556375l865004k930581j237273p32363j189231j266420l70205M25756J3828
489.5E75404882j029551j259386q13127j080453k143025k721310k170444j760602k374053
507.9E60052931l362953l794074l562093l699660m446447m445970l211081j976550
524.2E31554103j414538q25226K30909J405537K283275L103971M359663N436539N045176
$$ y = [607619941, 603116333, 599660158, 597812653, 597367227, 598094344, 599795103, 601629198, 602344573, 601435363, 599907041, 598648489, 597114682, 594967842, 592151821, 589114070, 586605430, 584451556, 582568705, 582130671, 583838165, 587151289, 590876400, 594174564, 597202659, 600029826, 601844072, 601937115, 600973606, 600140512, 599332869, 597591758, 594931006, 592145503, 589606047, 586556375, 582691371, 579760790, 578523517, 577791154, 576601923, 575335503, 574965298, 575391054, 575404882, 574375331, 573115945, 572302818, 571222365, 569079340, 566358030, 564187586, 562426984, 560052931, 556689978, 552895904, 549333811, 545634151, 541187704, 536741734, 533530653, 531554103, 530139565, 529314339, 529545248, 530950785, 533234060, 536338031, 540697694, 546134233, 551179409]
542.5E51179409L207207J300752K63095k51234j223325k611280l342390l330171l681302
560.9E41510761m909218o198346o663919o222427n352854m043639j579881J608372
577.2E08148849M012406N335152O230176O880641O679892N075634K921938J540423
593.5E46825111J085341O58631j34885o57797l35038L77298N54085L45051P99477J929819
613.9E51447093K613009K572953K743602L695309M556656M149139K988398K521098
630.2E77287257K831220K618373J492917P70033J190006J614392J086772L41892N56171
648.6E89789033J414955J518011P66158L44336Q90434J534640J298488M67360J42455
667E98165870J496553K109170J196325Q92401J517057K026320J602113Q97646R14037
$$ y = [551179409, 554386616, 555687368, 555950463, 555699229, 554475904, 551864624, 548522234, 545192063, 541510761, 536601543, 530403197, 523739278, 517516851, 512163997, 508120358, 506540477, 508148849, 512161255, 517496407, 523726583, 530607224, 537287116, 542362750, 545284688, 546825111, 547910452, 548569083, 548434198, 547776401, 547441363, 547818661, 548372746, 548717797, 549517274, 551447093, 554060102, 556633055, 559376657, 563071966, 567628622, 571777761, 574766159, 577287257, 580118477, 582736850, 584229767, 584999800, 586189806, 587804198, 588890970, 589232862, 589789033, 591203988, 592721999, 593488157, 593832493, 594722927, 596257567, 597556055, 598023415, 598165870, 599662423, 601771593, 602967918, 603860319, 605377376, 607403696, 609005809, 609903455, 610817492]
685.3F10817492J248837R01103r4831q71003j056135j371860k332807l167331k956510
703.7F01116955j986623j062989k17497R97662K563179L851294M342616M522741N066454
722F19193792N743862N814194N019784M200757M012823L809452K932846J789511J018226
740.4F53535247M80473m08352j793861l035426l616393l851533m246533m582524m326343
758.7F28154755l414214k182245r32098O35445K869845N155802O642282P367551P820308
777.1F52117431P967055P423460O257058N010485M222811L950119L672778L308475
793.4F93929672L357053L868878M273057M056573L372788K848566K678871K376378
809.7G20761836J729011J223326J137018R92835M06801m01616j051724j530528k252996
$$ y = [610817492, 612066329, 612967432, 612872601, 612001598, 610945463, 609573603, 607240796, 604073465, 601116955, 599130332, 598067343, 597849846, 598847508, 601410687, 605261981, 609604597, 614127338, 619193792, 624937654, 630751848, 635771632, 639972389, 643985212, 647794664, 650727510, 652517021, 653535247, 654015720, 653607368, 651813507, 648778081, 645161688, 641310155, 637063622, 632481098, 628154755, 624740541, 622558296, 621626198, 622261643, 625131488, 630287290, 636929572, 644297123, 652117431, 660084486, 667507946, 673765004, 678775489, 682998300, 686948419, 690621197, 693929672, 697286725, 701155603, 705428660, 709485233, 712858021, 715706587, 718385458, 720761836, 722490847, 723714173, 724851191, 725844026, 726250827, 725849211, 724797487, 723266959, 721013963]
828.1G21013963l405988m431248m729032m606009m634380m654288m228533l483474
844.4F86841011k985358l039837l233373l155291l164530l606022l696918j930952
860.7F62028730J934111O016016Q507609R695888J0426700J0272741Q463383N411625
877G22756803K448738J47819j981437m126668n631924n951345n552649n249858n123496
895.4F91735983m765332m229367m180491m892706n797208o455600p147074q187115
911.7F46081090r252608r656906r061933p695436n953908m073262k250791p63953K89023
930.1E97661316J156211K159596L305137M258096M700720M525125L394962P36058l160894
948.4F18736327p114470j0239184j2369633j3867438j5160322j6295314j7202139j7998755
$$ y = [721013963, 717607975, 713176727, 708447695, 703841686, 699207306, 694553018, 690324485, 686841011, 683855653, 680815816, 677582443, 674427152, 671262622, 667656600, 663959682, 662028730, 663962841, 669978857, 678486466, 688182354, 698609054, 708881795, 717345178, 722756803, 725205541, 725353360, 723371923, 719245255, 713613331, 707661986, 702109337, 696859479, 691735983, 686970651, 682741284, 678560793, 673668087, 667870879, 661415279, 654268205, 646081090, 636828482, 627171576, 618109643, 610414207, 604460299, 600387037, 598136246, 597372293, 597661316, 598817527, 600977123, 604282260, 608540356, 613241076, 617766201, 621161163, 621897221, 618736327, 611621857, 601382673, 589013040, 575145602, 559985280, 543689966, 526487827, 508489072]
964.7E08489072j8770188j9504666k0133853k0451248k0331353j9729972j8457353
979C71110439j6372978j3665736j0703296p861942n421072l387242j724601m60536
995.3C11513036L92765Q67158J034379R14157M62621k23040q20190j056880q56876
1013.7C12227130l07113M81874J376122K222985K953529L573627M004359M147559M058242
1032C34738314L690571K934634J975507J251161R77099J041502J300245J854092K876312
1050.4C52639437M233926N635947O915957Q176178R568810J0875464J1251032R244382
1066.7D18541133L726781m110515j0435343j2026161r307385n077064j395583J276791
1083C81192654L191919M560083N550682O242037O525219O218075N186260L624350K017826
$$ y = [508489072, 489718884, 470214218, 450080365, 429629117, 409297764, 389567792, 371110439, 354737461, 341071725, 330368429, 322506487, 317085415, 313698173, 311973572, 311513036, 311905801, 312772959, 313807338, 314721495, 315184116, 314961076, 314140886, 313084006, 312227130, 311920017, 312401891, 313778013, 316000998, 318954527, 322528154, 326532513, 330680072, 334738314, 338428885, 341363519, 343339026, 344590187, 345567286, 346608788, 347909033, 349763125, 352639437, 356873363, 362509310, 369425267, 377601445, 387170255, 398045719, 409296751, 418541133, 422267914, 418157399, 407722056, 395695895, 386388510, 381311446, 379915863, 381192654, 384384573, 388944656, 394495338, 400737375, 407262594, 413480669, 418666929, 422291279, 424309105]
1101.4D24309105R88871J006454J934379L127694M033864M443347M384905L922701
1117.7D48151320L104061K276003J976043K423406L381312M346907M653096L756225
1134D74068373J528353j653254m947484p418871q595526q703172q124441p020801n430103
1152.4D23703074l549903j786411k57820J317024L148556N170494P222623R155124
1168.7D44122761J0930062J2479693J3511180J3838232J3771474J3676405J3385654
1183E35715461J2473106J0953188R324551P766306N990446M038453K538383J922905
1199.3E90722799J845777J768113J804769K405524L472924M370570M666209M616976
1215.6F15673661M533708M076958K847135J220524M6552m65274r15170j570880j928687
$$ y = [424309105, 425297976, 426304430, 428238809, 431366503, 435400367, 439843714, 444228619, 448151320, 451255381, 453531384, 455507427, 457930833, 461312145, 465659052, 470312148, 474068373, 475596726, 473943472, 468995988, 461577117, 452981591, 444278419, 436153978, 429133177, 423703074, 420153171, 418366760, 418108940, 419425964, 422574520, 427745014, 434967637, 444122761, 455052823, 467532516, 481043696, 494881928, 508653402, 522329807, 535715461, 548188567, 559141755, 568466306, 576232612, 582223058, 586261511, 588799894, 590722799, 592568576, 594336689, 596141458, 598546982, 602019906, 606390476, 611056685, 615673661, 620207369, 624284327, 627131462, 628351986, 628398538, 627933264, 627018094, 625447214, 623518527]
1234F23518527j659751j190126j003683q74758k49922Q35240J670957J828670J739681
1252.3F24614835J881242J972317J570940R40740P77305J267552J820803J903295J722634
1270.7F38471663J614094J330912N54383l88205q22485o52909n34535q91089j311600
1289F37370229j329243j216412j468956j966000k134204j811445j499593j633644j883865
1307.4F22426867j668274j147568r17435j149595j453220j434565j530230k421260
1323.7F10704720l779888m748702n004049m846155m529596l926336k815426j238227
1340E79816341m112K78771K38001L07262J55508l59296q68857j002431j027286j382053
1360.4E76151848j631081j083553n05209l51906k73704k02179L70860J122117J066923
$$ y = [623518527, 621858776, 620668650, 619664967, 618790209, 618540287, 619375527, 621046484, 622875154, 624614835, 626496077, 628468394, 630039334, 630980074, 631757379, 633024931, 634845734, 636749029, 638471663, 640085757, 641416669, 641971052, 641582847, 640760362, 640107453, 639572918, 638681829, 637370229, 636040986, 634824574, 633355618, 631389618, 629255414, 627443969, 625944376, 624310732, 622426867, 620758593, 619611025, 618693590, 617543995, 616090775, 614656210, 613125980, 610704720, 606924832, 602176130, 597172081, 592325926, 587796330, 583869994, 581054568, 579816341, 579812229, 580091000, 580329001, 580636263, 580791771, 580432475, 579563618, 578561187, 577533901, 576151848, 574520767, 573437214, 572932005, 572580099, 572306395, 572104216, 572475076, 573597193, 574664116]
1378.8E74664116O04689P08997J822353L613770M383325L135145J543701O92844K16961
1397.1E91385901m32432q73685j184463j351357j364648j729548j898050j480460j282752
1415.5E79788506j577735j073122K53737Q79824J027823Q47161R06288J530707J605928
1433.9E84189117J382232J945734K330422K161205J550317N24640j31786j70529n77629
1452.2E93203723j677513l089070j887679J027763J495540J829147L339947M398226
1468.5E98640084N172074P491768R221136Q848548Q064151P265687O501615N387783
1484.9F56592846M653275N029142N731284M656256L326535L532886M141868L459692
1501.2F91123784J900017N49972J811564M009962L231525J998365J224280J221716
$$ y = [574664116, 575268805, 575977802, 577800155, 581413925, 585797250, 588932395, 590476096, 591168940, 591385901, 590953469, 590079784, 588895321, 587543964, 586179316, 584449768, 582551718, 581071258, 579788506, 578210771, 577137649, 577391386, 578271210, 579299033, 580146194, 581052482, 582583189, 584189117, 585571349, 587517083, 589847505, 592008710, 593559027, 594083667, 593951881, 593781352, 593203723, 591526210, 588437140, 586549461, 587577224, 589072764, 590901911, 594241858, 598640084, 603812158, 611303926, 620525062, 629373610, 637437761, 644703448, 651205063, 656592846, 661246121, 666275263, 672006547, 676662803, 679989338, 683522224, 687664092, 691123784, 693023801, 693573773, 695385337, 699395299, 702626824, 704625189, 705849469, 707071185]
1517.5G07071185J091957J089812J900494K077102J899183J312673L48330L34918P36475
1535.8G17862129n74469k020419j45912J690984J434147K65062o57797p81357r82046
1554.2G16090322j857818k879202l73244J435935K44618p99835j345992q46148j35183
1572.6G09533453r33886j354932j04010J93178l88503q96871j280665j398206j370847
1590.9G01998711j556635j904130k042294k070546k270698k616406l009200l293991
1607.2F83234811l342271l264427l643394m760980m809738k895534k898514l968239
1623.5F53651714l543675k931058k631307k395987k970874l085077o99163M61340J0073
1641.9F35865986n69343n01991J218141J728594J029074L229499M693210L602982K896785
$$ y = [707071185, 708163142, 709252954, 711153448, 713230550, 715129733, 716442406, 716790736, 717125654, 717862129, 717287660, 715267241, 715121329, 716812313, 718246460, 718511522, 717853725, 717072368, 716090322, 714232504, 711353302, 710980058, 712415993, 712660611, 711860776, 710514784, 709668636, 709533453, 708599567, 707244635, 707140625, 707333803, 706945300, 706048429, 704767764, 703369558, 701998711, 700442076, 698537946, 696495652, 694425106, 692154408, 689538002, 686528802, 683234811, 679892540, 676628113, 672984719, 668223739, 663414001, 660518467, 657619953, 653651714, 650108039, 647176981, 644545674, 642149687, 639178813, 636093736, 635394573, 635855913, 635865986, 635296643, 634794652, 636012793, 637741387, 638770461, 641999960, 646693170, 650296152, 653192937]
1660.3F53192937L302575M271090L761828L211855M180789M621685M809380N335867
1676.6F86688006M484951L201783L024519N473554O241142M788816M432917L602803
1692.9G21938491K701580K598405L028155M470229M166126L037989L109217L029108
1709.2G48079300K414405J520515O80506J373470L032684K764702J911342J616180
1725.5G63393104J308858R98974O53327Q56399K115667K045393J572490J659036J589357
1743.9G76192605J369000J399517K117634L039360K658665J937270J842916J629174
1760.2G92186141J573920J719177J251519O35087K27452N89788J743316J884043J209736
1778.6H03020179P83503Q28803R80258J004517M61698k42651L19481J349330J162588
$$ y = [653192937, 656495512, 660766602, 664528430, 667740285, 671921074, 676542759, 681352139, 686688006, 691172957, 694374740, 697399259, 702872813, 709113955, 713902771, 718335688, 721938491, 724640071, 727238476, 730266631, 734736860, 738902986, 741940975, 745050192, 748079300, 750493705, 752014220, 752694726, 754068196, 757100880, 759865582, 761776924, 763393104, 764701962, 765700936, 766354263, 767210662, 769326329, 771371722, 772944212, 774603248, 776192605, 777561605, 778961122, 781078756, 784118116, 786776781, 788714051, 790556967, 792186141, 793760061, 795479238, 796730757, 797365844, 797593296, 798183084, 799926400, 801810443, 803020179, 803803682, 804632485, 805612743, 806617260, 807078958, 806836307, 807155788, 808505118, 809667706]
1796.9H09667706N20528N05686J069843J182735P07984K61248M57882R72271R35555
1815.3H16281438N63264M01258L04342J69396K08020R5666J22547R22501J164496N58495
1835.7H20791423K28525K14040j02222l15428K86877P44045P20143N81444K85446L6419
1856.1H23470712O8605K79724K60890j38521o08504l35753P34150R94206M61936K10106
1876.5H25397551L23713L59177J97888Q6903P2480O8724K71261L42488K37703L82364
1896.9H27740252M03404J36435k5868L7730P1406K7478J08361J76907M172j34826J7584
1919.3H28563035O0737J62422M62711M04954J36078L9517J00136J57058M2856k60412
1939.7H29869092l33250J47045M91261L14891J27912J56283K35856K14398J02937Q3208
$$ y = [809667706, 810188234, 810693920, 811763763, 812946498, 813654482, 813915730, 814373612, 815345883, 816281438, 816844702, 817245960, 817550302, 817719698, 817927718, 818023384, 818145931, 819068432, 820232928, 820791423, 821019948, 821233988, 821131766, 820816338, 821103215, 821847260, 822567403, 823148847, 823434293, 823470712, 823539317, 823819041, 824079931, 823941410, 823332906, 822997153, 823731303, 824725509, 825187445, 825397551, 825721264, 826080441, 826278329, 826365232, 826437712, 826506436, 826777697, 827120185, 827357888, 827740252, 828143656, 828280091, 828254223, 828291953, 828363359, 828390837, 828499198, 828676105, 828680277, 828545451, 828563035, 828623772, 828786194, 829248905, 829653859, 829789937, 829829454, 829929590, 830086648, 830129504, 829869092, 829535842, 829682887, 830174148, 830489039, 830616951, 830773234, 831009090, 831223488, 831326425, 831409633]
1960.1H31409633J75893J14978n2512M7088K73764L02195J75655J1564l0816Q8751
1980.5H32516193J63973K4855j62780j52111j0908J19209J31607K9326L0815R9004
2000.9H32789183n663j99735k19464n3823l7194l02493n11706l74973j71721l36468
2021.3H30575943o91831o30140p2241J70827j67489m20750k98738j42276k55227m14908
2041.7H27653170l18408j27077j09792k39372k64824n5849J32739L0279j54376j04546
2062.1H26441944J09791K02895N0068r6024K8849K00987J22368o2167m8161J41323
2082.5H27091873J98960L0816o7950R4652K47360J47760j8239K4199K23339K85923
2102.9H28258693J17958j1385R6619K32399J57416r477m471J24514J48833K2352r9480
$$ y = [831409633, 831585526, 831700504, 831647992, 831695080, 831968844, 832271039, 832446694, 832458258, 832427442, 832516193, 832680166, 832705021, 832542241, 832390130, 832379222, 832498431, 832630038, 832659364, 832690179, 832789183, 832783520, 832583785, 832364321, 832310498, 832273304, 831970811, 831459105, 831084132, 830912411, 830575943, 829884112, 829253972, 829181731, 829352558, 829185069, 828764319, 828465581, 828323305, 828068078, 827653170, 827334762, 827207685, 827097893, 826858521, 826593697, 826537848, 826670587, 826700866, 826546490, 826441944, 826551735, 826754630, 826804698, 826708674, 826737523, 826938510, 827060878, 826998711, 826950550, 827091873, 827290833, 827321649, 827253699, 827348351, 827595711, 827743471, 827725232, 827749431, 827972770, 828258693, 828376651, 828365266, 828461885, 828694284, 828851700, 828842223, 828837752, 828962266, 829111099, 829133451, 829033971]
2125.3H29033971l5227J30773J22488n8413j10984N0962J81437Q9526p7009m8995J25527
2147.7H29404056J50442m947l6597J41680L06964K81155J35124J34110K92540L42130
2168.1H31146657K79069L10243M42743N36799M54545K70546K54452M23670M87029L28422
2188.5H34934175J93715K92480M80950M70459K67923J79887L40760M68314L35991J78337
2208.9H38142991K61068M50373M39465K21133J44661L48210M91262L36170J22785J47105
2229.3H41105223L42130L82424J78218M9650J98543L49880K14040k5094K5630L02971
2249.7H43123615L34322O1631o9320J50502L80218K46227j9014K6941K92182L83914
2270.1H44911218J88350L6776J88709L57747K36749L2068O7770K46346K04802q5890
$$ y = [829033971, 828998744, 829129517, 829252005, 829193592, 829082608, 829133570, 829315007, 829404533, 829327524, 829278529, 829404056, 829554498, 829549551, 829512954, 829654634, 829961598, 830242753, 830377877, 830511987, 830804527, 831146657, 831425726, 831735969, 832178712, 832715511, 833170056, 833440602, 833695054, 834118724, 834605753, 834934175, 835127890, 835420370, 835901320, 836371779, 836639702, 836819589, 837160349, 837628663, 837964654, 838142991, 838404059, 838854432, 839293897, 839515030, 839659691, 840007901, 840499163, 840835333, 840958118, 841105223, 841447353, 841829777, 842007995, 842057645, 842256188, 842606068, 842820108, 842795014, 842820644, 843123615, 843457937, 843519568, 843450248, 843600750, 843980968, 844227195, 844208181, 844235122, 844527304, 844911218, 845099568, 845136344, 845325053, 845682800, 845919549, 845951617, 846019387, 846265733, 846470535, 846384645]
2290.5H46384645j97173K6465J81675P391k48373k51710n7101l1114k86639m43101
2310.9H45084965k71439j17004l01063o08266o28352l28362j68919m01497n74172l31879
2331.3H41354012m4167j27971l81052m30167k25186J27136O05822P12216N8949q00729
2351.7H40848863j247644j177013q44181m12881n2750J65641L98755O78957Q79824
2370.1H39237571R38773Q34525P32123P84100Q40365O84619L80278J30534J5199k6881
2390.4H44551206q9705j91510k12610r7155n7161k03550l04163k35676j73211k55883
2410.8H42730582l77953l58403k55108k56598l67761m33623l87788l56555m29332m99428
2431.2H39008033m52280l38912l12567m31418n30779m80414l79026l81469n06640n73575
$$ y = [846384645, 846187472, 846213937, 846395612, 846403003, 846154630, 845902920, 845845819, 845814705, 845528066, 845084965, 844813526, 844696522, 844395459, 843787193, 843158841, 842830479, 842661560, 842260063, 841685891, 841354012, 841309845, 841181874, 840800822, 840370655, 840145469, 840272605, 840878427, 841590643, 841649592, 840848863, 839601219, 838424206, 837580025, 837167144, 837114394, 837280035, 837678790, 838357747, 839237571, 840176344, 841010869, 841742992, 842527092, 843367457, 844052076, 844432354, 844562888, 844578087, 844551206, 844461501, 844269991, 844057381, 843960226, 843903065, 843699515, 843395352, 843159676, 842986465, 842730582, 842352629, 841994226, 841739118, 841482520, 841114759, 840681136, 840293348, 839936793, 839507461, 839008033, 838555753, 838216841, 837904274, 837472856, 836942077, 836461663, 836082637, 835701168, 835194528, 834620953]
2451.6H34620953m68731l57807m25160n42104m70638l27588l36766m15981m13239l43918
2472H30519021l11614l86357m67837m16457k97487k88427m06027m31776k74479j66655
2492.4H27071905k46823l24428k55465j74344k09749k89559k94030k06709j52051k05755
2512.8H24712992k78712l00467k82824k81036l27050l69966l63648l64781m19914m82023
2533.2H21242571m97282m61876m70996n58376n85974m98831m13060m47571n48542n41329
2553.6H16218734m52936m52220n23508n65708n30004m32730l89337m52817n10037m77254
2574H11432183m35591m53412m73857m56214m07339l48985l45051l92020l68476k70724
2594.4H07480514k58505l47376l81768l08871k67387l80754n30541n52535n12898n47350
$$ y = [834620953, 834152222, 833794415, 833369255, 832827151, 832356513, 832028925, 831692159, 831276178, 830862939, 830519021, 830207407, 829821050, 829353213, 828936756, 828639269, 828350842, 827944815, 827513039, 827238560, 827071905, 826825082, 826500654, 826245189, 826070845, 825861096, 825571537, 825277507, 825070798, 824918747, 824712992, 824434280, 824133813, 823850989, 823569953, 823242903, 822872937, 822509289, 822144508, 821724594, 821242571, 820745289, 820283413, 819812417, 819254041, 818668067, 818169236, 817756176, 817308605, 816760063, 816218734, 815765798, 815313578, 814790070, 814224362, 813694358, 813261628, 812872291, 812419474, 811909437, 811432183, 810996592, 810543180, 810069323, 809613109, 809205770, 808856785, 808511734, 808119714, 807751238, 807480514, 807222009, 806874633, 806492865, 806183994, 805916607, 805535853, 805005312, 804452777, 803939879, 803392529]
2614.8H03392529o64412p43211p13050o98865p82787q69513q61168q13782q61049r76026
2635.2G95408666j013219r43899r22203r90749j020312r83715r44138r32991r57907
2653.5G86699533j000404r61423q59797q54432r00567q82268q54492q55982q57473
2671.9G78672695q32200p32899o60777p36594q14140p60257o99997p35521p83444p89225
2692.3G71127641p72238p68423q24451q95262q97646q58724q69393r27091r36091q98838
2712.7G62479484q82864q71956q39770q11756q12649p97987p58291p45713p22707o88255
2733.1G54547536o74784o34670n97417o29187o79970o85513o43015n91278n80668n76318
2753.5G48254716n30779n06759n39183n47588n08249m92156n38051n69284n29825n32449
$$ y = [803392529, 802728117, 801984906, 801271856, 800572991, 799790204, 798920691, 798059523, 797245741, 796384692, 795408666, 794395447, 793451548, 792529345, 791538596, 790518284, 789534569, 788590431, 787657440, 786699533, 785699129, 784737706, 783877909, 783023477, 782122910, 781240642, 780386150, 779530168, 778672695, 777840495, 777107596, 776446819, 775710225, 774896085, 774135828, 773435831, 772700310, 771916866, 771127641, 770355403, 769586980, 768762529, 767867267, 766969621, 766110897, 765241504, 764314413, 763378322, 762479484, 761596620, 760724664, 759884894, 759073138, 758260489, 757462502, 756704211, 755958498, 755235791, 754547536, 753872752, 753238082, 752640665, 752011478, 751331508, 750645995, 750002980, 749411702, 748831034, 748254716, 747723937, 747217178, 746677995, 746130407, 745622158, 745130002, 744591951, 744022667, 743492842, 742960393]
2773.9G42960393o44505p46309p79689p97331q16286q65876r26555r34839r82642j127601
2794.3G34338760j231074j254260j292944j354397j433492j502811j513601j551330
2810.6G23204851j666784j762092j807988j842201j897216j992940k050341k058923
2826.9G08126366k112925k237797k358138k410352k472878k659380k949655l178716
2843.2F87746525l255248l336132l477335l394425k985298k549708k345324k426266
2859.5F63976789k710522l066122l479719l968597m384875m611671m772902m923403
2875.9F32058978m860163m501819l955245l334940k720952k084911j496434j061201
2892.2F08043313p74801o87659p42375p99835q94845j135349j487136j798093k107263
$$ y = [742960393, 742315888, 741569579, 740789890, 739992559, 739176273, 738310397, 737383842, 736449003, 735466361, 734338760, 733107686, 731853426, 730560482, 729206085, 727772593, 726269782, 724756181, 723204851, 721538067, 719775975, 717967987, 716125786, 714228570, 712235630, 710185289, 708126366, 706013441, 703775644, 701417506, 699007154, 696534276, 693874896, 690925241, 687746525, 684491277, 681155145, 677677810, 674283385, 671298087, 668748379, 666403055, 663976789, 661266267, 658200145, 654720426, 650751829, 646366954, 641755283, 636982381, 632058978, 627198815, 622696996, 618741751, 615406811, 612685859, 610600948, 609104514, 608043313, 607268512, 606580853, 605838478, 605038643, 604143798, 603008449, 601521313, 599723220, 597615957]
2910.5E97615957k567112l119767l543436l707350l642559l329038k769769k038777
2926.8E72898149j198947l32296O13034J699805K793670L704250M380822M867554N154848
2945.2E94580889N226493N231082N278051N241454N155146N145311N104959M900754
2961.5F35864139M542231M174948L915012L728568L587127L448367L278613L166139
2977.8F65705144L037990K768456K468408K244711K091229J970887J737892J363933
2994.2F83388650J092017Q63910N25355K41995o56k61247m12285m97758o97494j021266
3014.5F83221221j320601j533091j686751j778722j869798j976371k006411k003491
3030.9F69045985k008975k118051k338648k363741k248585k319038k553404k706170
$$ y = [597615957, 595048845, 591929078, 588385642, 584678292, 581035733, 577706695, 574936926, 572898149, 571699202, 571366906, 571979940, 573679745, 576473415, 580177665, 584558487, 589426041, 594580889, 599807382, 605038464, 610316515, 615557969, 620713115, 625858426, 630963385, 635864139, 640406370, 644581318, 648496330, 652224898, 655812025, 659260392, 662539005, 665705144, 668743134, 671511590, 673979998, 676224709, 678315938, 680286825, 682024717, 683388650, 684480667, 685344577, 685869932, 686111927, 686111271, 685850024, 685437739, 684939981, 684242487, 683221221, 681900620, 680367529, 678680778, 676902056, 675032258, 673055887, 671049476, 669045985, 667037010, 664918959, 662580311, 660216570, 657967985, 655648947, 653095543, 650389373]
3047.2F50389373k612650k486229k552509k655506k718688k752661k673090k550900
3063.5F29387140k499580k580464k752006k791464k642393k435506k364635k562702
3079.8F08758390k778113k815604k808392k722025k628744k757728k902806k779841
3096.1E86565137k546847k558649k730488k666891k436876k401829k604604k655625
3112.4E65963328k439559k339363k466082k703548k884328k768994k514898k428472
3128.8E45418084k509356k593100k498388k296269k291620k508819k600253k480685
3145.1E25639594k349615k198160k083838k232135k489745k491593k324403k244711
3161.4E07225394k236008k216161k192676k152443k107948k101153k075314k034724
$$ y = [650389373, 647776723, 645290494, 642737985, 640082479, 637363791, 634611130, 631938040, 629387140, 626887560, 624307096, 621555090, 618763626, 616121233, 613685727, 611321092, 608758390, 605980277, 603164673, 600356281, 597634256, 595005512, 592247784, 589344978, 586565137, 584018290, 581459641, 578729153, 576062262, 573625386, 571223557, 568618953, 565963328, 563523769, 561184406, 558718324, 556014776, 553130448, 550361454, 547846556, 545418084, 542908728, 540315628, 537817240, 535520971, 533229351, 530720532, 528120279, 525639594, 523289979, 521091819, 519007981, 516775846, 514286101, 511794508, 509470105, 507225394, 504989386, 502773225, 500580549, 498428106, 496320158, 494219005, 492143691, 490108967]
3177.7D90108967k013117k012253k013296j970231j911670j895220j918852j937836
3194D74436492j919747j835644j726627j666457j674533j735955j785547j735746j620234
3212.4D58736002j554220j522094j496196j501829j512974j509100j484275j408220
3228.7D46747094j248210j164198j364023j548528j450241j311123j230330j159608
3245D36270833j197129j321555j305818j123458j003743j050651j094788j038521j003832
3263.4D26131338r72778p93278o15805p92414j090139j117439j038223r72778r09745
3281.7D17828739q87126q80867q43376p11978o09904p09504r14931j076609j088411
3300.1D10106033q76874o23464o78033j027435j292616j315177j198202j063555r99064
$$ y = [490108967, 488095850, 486083597, 484070301, 482100070, 480188400, 478293180, 476374328, 474436492, 472516745, 470681101, 468954474, 467288017, 465613484, 463877529, 462091982, 460356236, 458736002, 457181782, 455659688, 454163492, 452661663, 451148689, 449639589, 448155314, 446747094, 445498884, 444334686, 442970663, 441422135, 439971894, 438660771, 437430441, 436270833, 435073704, 433752149, 432446331, 431322873, 430319130, 429268479, 428173691, 427135170, 426131338, 425158560, 424365282, 423749477, 422957063, 421866924, 420749485, 419711262, 418738484, 417828739, 416941613, 416060746, 415217370, 414505392, 413895488, 413185984, 412271053, 411194444, 410106033, 409229159, 408605695, 407927662, 406900227, 405607611, 404292434, 403094232, 402030677, 401031613]
3318.4D01031613j006484r96858r88096j136899j295089j231343j134932j058191r08792
3336.8C91274929r77367j248926j375645j370311j197011r32097j065850j473129j525193
3355.2C80109400j248390j105905j207619j217217r40144p99298j114219j529694j543462
3373.5C69403452j209379r98735r90391j026004r97812q10116m96120k43544l86298
3391.9C62245053q10504q69840m15653j47790n64933j021772q12382l95566k78652
3410.2C56927961l38524n01752o34075m95106k53230j38283l9190J58698L16888K38508
3430.6C55241895K06500L29912J61171k09600k36809R4741L82155M77344M81129M74334
3451C57402772N10096O25491P93189Q94547P61658P41481J118660J305730Q66204L12895
$$ y = [401031613, 400025129, 399028271, 398040175, 396903276, 395608187, 394376844, 393241912, 392183721, 391274929, 390297562, 389048636, 387672991, 386302680, 385105669, 384173572, 383107722, 381634593, 380109400, 378861010, 377755105, 376547486, 375330269, 374390125, 373590827, 372476608, 370946914, 369403452, 368194073, 367195338, 366204947, 365178943, 364181131, 363371015, 362874895, 362631351, 362245053, 361434549, 360564709, 360149056, 360001266, 359436333, 358414561, 357602179, 357206613, 356927961, 356589437, 356087685, 355453610, 354958504, 354705274, 354566991, 354527801, 354686499, 355003387, 355241895, 355448395, 355778307, 355939478, 355729878, 355493069, 355587810, 355969965, 356447309, 356928438, 357402772, 357912868, 358538359, 359331548, 360226095, 360987753, 361729234, 362847894, 364153624, 365019828, 365332723]
3471.4C65332723L45975P76768J108467J044423P07089P42525J025826R70006Q86142
3489.8C72939944J085788J218200J181871J083284J033277J047849R67622Q54522Q95977
3508.1C82308334J167297J507283J444757J094728J017064J206935J426369J324176
3524.4C92496943R76146J049220J468450J653999J684189J634270J487166J546561
3540.8D03996944J598239J407028J286685J457721J625598J741677J968533K105445
3557.1D17187870K080887J981318J627445J314730K123803L290742L166914K614349
3573.4D35388058K551347K781779L040791L181606K929092K443105K648621L562868
3589.7D58527267L609806L240705L431082L774225L795445L786773L616631L144741
$$ y = [365332723, 365678698, 366455466, 367563933, 368608356, 369315445, 370057970, 371083796, 372053802, 372939944, 374025732, 375243932, 376425803, 377509087, 378542364, 379590213, 380557835, 381412357, 382308334, 383475631, 384982914, 386427671, 387522399, 388539463, 389746398, 391172767, 392496943, 393473089, 394522309, 395990759, 397644758, 399328947, 400963217, 402450383, 403996944, 405595183, 407002211, 408288896, 409746617, 411372215, 413113892, 415082425, 417187870, 419268757, 421250075, 422877520, 424192250, 426316053, 429606795, 432773709, 435388058, 437939405, 440721184, 443761975, 446943581, 449872673, 452315778, 454964399, 458527267, 462137073, 465377778, 468808860, 472583085, 476378530, 480165303, 483781934, 486926675]
3606D86926675L175020L642261L786862L881097L712237L621816M432142M649937L727079
3624.4E21555126K605855K743483M555046M860580M272461L978014L740192L609955
3640.7E51920712L455937K834260K067924K872705M991234M855454L718435L847421
3657E80564082M200577L616631L012360K670288K007484J760602K734363K589226K208114
3675.4F05363727L581702M054129L515780K946318K219975J594185J786828K756000
3691.7F27818644L099203K684593K030671J454353J546145K131164J911044R60410
3708F43636227M31418J478136K849757K549053J562655R36508Q85725J142442J479208
3726.4F56951129J575470Q75414m1127K37167J896560K610385J497090p9036r7632
$$ y = [486926675, 490101695, 493743956, 497530818, 501411915, 505124152, 508745968, 513178110, 517828047, 521555126, 524160981, 526904464, 531459510, 536320090, 540592551, 544570565, 548310757, 551920712, 555376649, 558210909, 560278833, 563151538, 568142772, 572998226, 576716661, 580564082, 584764659, 588381290, 591393650, 594063938, 596071422, 597832024, 600566387, 603155613, 605363727, 608945429, 612999558, 616515338, 619461656, 621681631, 623275816, 625062644, 627818644, 630917847, 633602440, 635633111, 637087464, 638633609, 640764773, 642675817, 643636227, 644067645, 645545781, 648395538, 650944591, 652507246, 653443754, 654329479, 655471921, 656951129, 658526599, 659402013, 659360886, 659598053, 661494613, 664104998, 665602088, 665523052, 665425420]
3744.7F65425420J111209O66082O16729K208710K436042J474261J035571J401067J340985
3763.1F77716076Q49665O81161P82431J237809J500786J082062N74470N76138R16362
3781.4F85916960Q48055Q09074J069963J059889P80106L36945J8597N2273j45137K33173
3801.8F90979898J224875J066685J164973J563132R24825j54614m14014J16229J13130
3820.2F96585119R04679J632333J074135O86705M68791K70128K40743j13666j36137
3838.5G01612830P69735J402318J528561J177490J46866j332879j825452R49383K583325
3856.9G07012177J540482K47776l42727K05040M93884J7703M28140J173258J246214
3875.2G12021947O65188k38717l2902O44863O75499O70970K60115J05619P89523O84560
$$ y = [665425420, 666536629, 667202711, 667819440, 670028150, 672464192, 673938453, 674974024, 676375091, 677716076, 678565741, 679246902, 680029333, 681267142, 682767928, 683849990, 684424460, 685000598, 685916960, 686765015, 687574089, 688644052, 689703941, 690484047, 690820992, 690839589, 690891862, 690746725, 690979898, 692204773, 693271458, 694436431, 695999563, 696924388, 696769774, 696355760, 696471989, 696585119, 697489798, 699122131, 700196266, 700882971, 701351762, 701621890, 701862633, 701748967, 701612830, 702382565, 703784883, 705313444, 706490934, 706637800, 705304921, 703479469, 704428852, 707012177, 708552659, 708800435, 708457708, 708662748, 709156632, 709174335, 709602475, 710775733, 712021947, 712687135, 712448418, 712415516, 713060379, 713735878, 714406848, 714666963, 714772582, 715562105, 716246665]
3895.6G16246665k66195o74605k27630N72502J370609J432598Q83817L67284m9114
3914G19655931l23951o9320L87787L00289R1612L16799L85880J25527K69950O36518
3934.4G21777022N17428J64211n7102j073K57612K35975J63495M50432N64278K95519
3954.8G24367797R1851O2227J26481L17812M02511K70545J49369J17302J25647J77324
3975.2G26208866K31743J94728J76787K86579K72096N8770j3888J10268K01524K29656
3995.6G27957129K37644
3997.6G28194773
$$ y = [716246665, 715980470, 715305865, 715078235, 715650737, 717021346, 718453944, 719337761, 719705045, 719655931, 719331980, 719262660, 719650447, 719950736, 720042348, 720359147, 720745027, 720870554, 721140504, 721777022, 722294450, 722458661, 722401559, 722400486, 722658098, 722894073, 723057568, 723508000, 724072278, 724367797, 724459648, 724521875, 724648356, 724966168, 725368679, 725639224, 725788593, 725905895, 726031542, 726208866, 726440609, 726635337, 726812124, 727098703, 727370799, 727429569, 727415681, 727525949, 727727473, 727957129, 728194773]
##END=$$ End of the data block
