##TITLE=$$ Begin of the data block
##JCAMP-DX=5.00 $$ ACD/SpecManager v 10.08
##SPECTROMETER/DATA SYSTEM=Alpha
##DATE=22 Dec 2014 10:36:42
##DATA TYPE=INFRARED SPECTRUM
##DATA CLASS=XYDATA
##ORIGIN=
##OWNER=
##NPOINTS=1765
##FIRSTX=399.76428223
##LASTX=3997.64306641
##MAXX=3997.64306641
##MINX=399.76428223
##MAXY=0.84692860
##MINY=0.36597064
##XFACTOR=1.0000000000
##YFACTOR=1.000000000000000e-9
##FIRSTY=0.63557261
##DELTAX=2.03961372
##XUNITS=1/CM
##YUNITS=ARBITRARY UNITS
##XYDATA=(X++(Y..Y))
399.8F35572612m259646m469156j566112J628757J818478j81198r51708L44873J738965
$$ 635572612 631312966 626843810 625277698 626906455 628724933 628543735 627592027 627936900 629675865
418.1F29675865Q55267k000332k846300r23515k5034k376973m831493l738105O2525
$$ 629675865 630531132 628530800 625684500 624760985 624735951 622358978 617527485 613789380 613851905
436.5F13851905K357542J768411J243591K992988N358934N116820J714826j280069
$$ 613851905 616209447 617977858 619221449 622214437 627573371 632690191 634405017 633124948
452.8F33124948r11892J075387J163840j441598l355503k589404j188159j692593l680706
$$ 633124948 632213056 633288443 634452283 633010685 629655182 627065778 625877619 624185026 620504320
471.2F20504320m356504k191722p1585m03941k069891k199173L3498J729012N59211
$$ 620504320 616147816 613956094 613884509 613480568 611410677 609211504 609245002 610974014 611533225
489.5F11533225j661182k031326p04825m2677j214325l061533l383995k043426j372456
$$ 611533225 609872043 607840717 607135892 607093215 605878890 602817357 599433362 597389936 596017480
507.9E96017480k583265m115463m116833l031790k605856l384769l819108k660334
$$ 596017480 593434215 589318752 585201919 582170129 579564273 576179504 572360396 569700062
524.2E69700062n77509O54042M35054J58727J327157L894806N575955M780531L203273
$$ 569700062 569122553 569776595 570211649 570370376 571697533 575592339 581168294 585948825 589152098
542.5E89152098K745092K588570J204371r97484k448082k402424j871407k506018m222453
$$ 589152098 591897190 594485760 595690131 594692647 592244565 589842141 587970734 585464716 581242263
560.9E81242263n386650n279720n040824n494833n587698l947138p71106K275169L783763
$$ 581242263 575855613 570575893 565535069 560040236 554452538 550505400 549734294 552009463 555793226
579.3E55793226M355013N402267O745219O793082M792035K218008J087069J321495
$$ 555793226 560148239 565550506 572295725 579088807 583880842 586098850 587185919 588507414
595.6E88507414J186788K7597j091004r37819K80559J101792P78794K99394R67086
$$ 588507414 589694202 589721799 588630795 587692976 587973535 589075327 589854121 590153515 591120601
613.9E91120601K448082L319323L077924K677619L069461L906905L906787K634048
$$ 591120601 593568683 596888006 599965930 602643549 605713010 609619915 613526702 616160750
630.2F16160750J430929J531899K262890K115965R50098J62363P59244J808465J726687
$$ 616160750 617591679 619123578 621386468 623502433 624452531 624614894 625374138 627182603 628909290
648.6F28909290N84245k6644P77304J838565J562476L32773r3043O09339J720905K095401
$$ 628909290 629493535 629466891 630244195 632082760 633645236 633978009 633884966 634494305 636215210 638310611
669F38310611O53923K79426J486659K642036K087891N13375P6473J191377J943648
$$ 638310611 638964534 639243960 640730619 643372655 645460546 645973921 646050394 647241771 649185419
687.3F49185419R23097q89957j564681q89600n89728j863837l593207l625214j708388
$$ 649185419 650108516 649218559 647653878 646764278 646174550 644310713 640717506 637092292 635383904
705.7F35383904J22845M46320K34544J255989L589571N320549N104184L917396L913641
$$ 635383904 635506749 635953069 636187613 637443602 641033173 646353722 651457906 655375302 659288943
724.1F59288943N428910O242514M743457K400696J755833K930582L439367J644790
$$ 659288943 664717853 670960367 675703824 678104520 679860353 682790935 686230302 687875092
740.4F87875092r70185j834035r91940r70304l016591n293966n436837l693700k524436
$$ 687875092 686904907 685070872 684078932 683108628 680092037 674798071 669361234 665667534 663143098
758.7F63143098l072261l648520k220988J087606L999769M724861M345834N280375
$$ 663143098 660070837 656422317 654201329 655288935 659288704 664013565 668359399 673639774
775.1F73639774P676840Q926690P258892M457116L621042M935920N607069L837764
$$ 673639774 681316614 690243304 697502196 701959312 705580354 710516274 716123343 719961107
791.4G19961107J485765J605510M012943N431652L947794J410485Q76367K543330L404856
$$ 719961107 721446872 723052382 727065325 732496977 736444771 737855256 738731623 741274953 744679809
809.7G44679809J552581j010894j162827R56773K038837J42693k630293l215194j750767
$$ 744679809 746232390 745221496 744058669 745015442 747054279 747196972 744566679 741351485 739600718
828.1G39600718j261055l437341o083488o144524l893733k410650l456712n191386
$$ 739600718 738339663 734902322 728818834 722674310 718780577 716369927 712913215 707721829
844.4G07721829m775643k507508j391351k975583n293548n421400l038466k6286K202630
$$ 707721829 702946186 700438678 699047327 696071744 690778196 685356796 682318330 682292044 684494674
862.8F84494674L970325O531298R852589J1524558R520948N531430L056705K699017
$$ 684494674 688464999 694996297 704848886 716373444 725894392 731425822 734482527 737181544
879.1G37181544J662195j821041n597293o525100m813254l534734m441917n965173
$$ 737181544 738843739 737022698 731425405 724900305 720087051 716552317 712110400 706145227
895.4G06145227n677700l705800k667904m165530o605565p498563o721437o412506
$$ 706145227 700467527 696761727 694093823 689928293 683322728 675824165 669102728 662690222
911.7F62690222p965386r896814r627939o870866l933072k761423k689660j717210
$$ 662690222 654724836 644828022 635200083 628329217 624396145 621634722 618945062 617227852
928F17227852N73278K511382K703845J968563K330482M204929N376696L478826q72493
$$ 617227852 617801130 620312512 623016357 624984920 627315402 631520331 636897027 640375853 639503360
946.4F39503360m774451o900728q634806j1290133j4018834j5097975j4597357j4397442
$$ 639503360 634728909 627828181 619193375 607903242 593884408 578786433 564189076 549791634
962.7E49791634j5615165j7330170j8061131j7650336j7167568j7312616j7375976
$$ 549791634 534176469 516846299 498785168 481134832 463967264 446654648 429278672
977D29278672j6201109j3697147j0834217q459390o536781m602850k448529n28008
$$ 429278672 413077563 399380416 388546199 380086809 373550028 368947178 366498649 365970641
993.3C65970641N06610P22259Q02487J204670J594484J248985J48863p74115p38740
$$ 365970641 366477251 367199510 368001997 369206667 370801151 372050136 372198999 371424884 370686144
1011.6C70686144k087O19382Q28922J110196K001196L208220L896415L761322L330499
$$ 370686144 370684057 371303439 372132361 373242557 375243753 378451973 382348388 386109710 389440209
1030C89440209L263026L411621K971977J725316N54115K99334Q39144J433462J648247
$$ 389440209 392703235 396114856 399086833 400812149 401366264 401665598 402504742 403938204 405586451
1048.4D05586451K000422L288954N294651O929248P676423Q107543Q964539R715885
$$ 405586451 407586873 410875827 416170478 423099726 430776149 438883692 447848231 457564116
1064.7D57564116Q280009L034889m379034r614169j0040582p123798l836333j370520
$$ 457564116 465844125 468879014 464499980 454885811 444845229 437721431 433885098 432514578
1081D32514578P74026K897590M503996N178272N249262N382478N646736N274027L704936
$$ 432514578 433288604 436186194 440690190 445868462 451117724 456500202 462146938 467420965 471125901
1099.4D71125901J597643M03523Q21620K099485L029763L273517L378898L689557L750623
$$ 471125901 472723544 473127067 473948687 476048172 479077935 482351452 485730350 489419907 493170530
1117.7D93170530K965241J678169J063198J812786L325164M313707M056395K896487
$$ 493170530 496135771 497813940 498877138 500689924 504015088 508328795 512385190 515281677
1134E15281677J358211o97195l458917o218017p764905p677794o671697n677640m875183
$$ 515281677 516639888 515942693 512483776 506265759 498500854 490823060 484151363 478473723 473598540
1152.4D73598540l771484k066106j68204J284927K337814L709107N816490Q177340
$$ 473598540 469827056 467760950 467592746 468877673 471215487 474924594 480741084 488918424
1168.7D88918424R984851J0913252J1340678J1839151J2450755J2542546J1660695
$$ 488918424 498903275 509816527 521157205 532996356 545447111 557989657 569650352
1183E69650352J0358274R408832Q671045P353067N227328L159105K159238K148211
$$ 569650352 580008626 589417458 598088503 605441570 610668898 613828003 615987241 618135452
1199.3F18135452K152860J678527J349687J947940L221810M177689M250288L830314
$$ 618135452 620288312 621966839 623316526 625264466 628486276 632663965 636914253 640744567
1215.6F40744567L601909L526330K883017J378059k07603r25898q51691q21591j302480
$$ 640744567 644346476 647872806 650755823 652133882 651926279 651000381 650148690 649327099 648024619
1234F48024619j846075j707256q95441j55568Q0645K00033P70331J671791K170205
$$ 648024619 646178544 644471288 643575847 643420279 643500924 643700957 644471288 646143079 648313284
1252.3F48313284J859188J151800P91669J018822J302362J186847J025796J346529
$$ 648313284 650172472 651324272 652115941 653134763 654437125 655623972 656649768 657996297
1268.6F57996297J961052K101958J365602K75254l22699k60651j57893m70877r15706
$$ 657996297 659957349 662059307 663424909 663700163 663377464 663116813 662958920 662488043 661572337
1287F61572337j018584q19683q29398j311839j899123k058149j743614j417279j492739
$$ 661572337 660553753 659734070 658904672 657592833 655693710 653635561 651891947 650474668 648981929
1305.4F48981929j798392j775920j336813r44376r54270j260579j465618j557231k036989
$$ 648981929 647183537 645407617 644070804 643126428 642172158 640911579 639445961 637888730 635851741
1323.7F35851741l096044m230082m744351m478216l847957l248930k596676j510978
$$ 635851741 632755697 628525615 623781264 619303048 615455091 612206161 609609485 608098507
1340F08098507k46584M24861M40538J49310r9361j69337k71857n50210r40084j222730
$$ 608098507 607851923 608276784 608717322 608866632 608767271 608597934 608326077 607775867 606835783 605613053
1360.4F05613053j057565n13375l46363m42505k23755K20358P69257J047969Q65281
$$ 605613053 604555488 604042113 603695750 603253245 603029490 603249848 604019105 605067074 605932355
1378.8F05932355O89030R86278J918733L214896L726601K870083J724839Q12054L2484
$$ 605932355 606621385 607607663 609526396 612741292 616467893 619337976 621062815 621874869 621907353
1397.1F21907353n73933q08060j048267j366198j460492j621128j737415j539171j369536
$$ 621907353 621333420 620525360 619477093 618110895 616650403 615029275 613291860 611752689 610383153
1415.5F10383153j447201j037955o5982M63783P44641Q32200Q73327J171470J302123
$$ 610383153 608935952 607897997 607832015 608295798 609040439 609872639 610745966 611917436 613219559
1433.9F13219559J413644J848042J809001J511096J211644O85155o676n67793j014352
$$ 613219559 614633203 616481245 618290246 619801342 621012986 621698141 621691465 621123672 620109320
1452.2F20109320j520992k317130j813591J29819R25422J757920L102064L769934M463077
$$ 620109320 618588328 616271198 614457607 614587426 615512848 617270768 620372832 624142766 628605843
1470.6F28605843O653964Q267939P793606O815493O100833N818784N283296M715443
$$ 628605843 635259807 643527746 651321352 658136845 664237678 670056462 675339758 680055201
1486.9F80055201M643977M865050M217148L521979L647566L667712L041863K150059
$$ 680055201 684699178 689564228 693781376 697303355 700950921 704618633 707660496 709810555
1503.2G09810555J517057K336622L265500K638340J961052J641214J755655J611650
$$ 709810555 711327612 713664234 716929734 719568074 721529126 723170340 724925995 726537645
1519.5G26537645J538157J932979K056122K102911J686454R28938Q74699J224994O21558
$$ 726537645 728075802 730008781 732064903 734167814 735854268 736783206 737657905 738882899 739504457
1537.9G39504457o2883O19471J361489J452267J007378L45648j42217m90248r05931
$$ 739504457 739441574 740061045 741422534 742874801 743882179 744227827 744085610 743595362 742689431
1556.2G42689431j397312k74956M77731l47376q75473j146614j294434j183987j711905
$$ 742689431 741292119 741017163 741494894 741147518 740272045 739125431 737830997 736647010 734935105
1574.6G34935105k035558j101852j007795j741111k015412j804471j630485j813054
$$ 734935105 732899547 731797695 730789900 729048789 727033377 725228906 723598421 721785367
1590.9G21785367k170265k269805j957237j734972j996100k400101k511143k358318
$$ 721785367 719615102 717345297 715388060 713653088 711656988 709256887 706745744 704387426
1607.2G04387426k282321k417386k801895l534436l549278k143442k042294k913713
$$ 704387426 702105105 699687719 696885824 693351388 689802110 687658668 685616374 682702661
1623.5F82702661k772510k225042j737237j319766j632810j857698l06010P67887O51657
$$ 682702661 679930151 677705109 675967872 674648106 673015296 671157598 670851588 671619475 672271132
1641.9F72271132J60933N2631J258373J797378J571238K830923L321111K785623K732337
$$ 672271132 672432065 672484696 673743069 675540447 677111685 679942608 683263719 686049342 688781679
1660.3F88781679L111064L330886K720595K639472L723622L946304L712356L884792
$$ 688781679 691892743 695223629 697944224 700583696 704307318 708253622 711965978 715850770
1676.6G15850770L639937L221989L202796M388749M512489L756583L793657L224015
$$ 715850770 719490707 722712696 725915492 730304241 734816730 738573313 742366970 745590985
1692.9G45590985K370477K000331K274633L354549L072918K012372J726806J734793
$$ 745590985 747961462 749961793 752236426 755590975 758663893 760676265 762403071 764137864
1709.2G64137864J652658J305997P15316Q14140J875400K185643J857757J437486Q50498
$$ 764137864 765790522 767096519 767811835 768625975 770501375 772687018 774544775 775982261 776832759
1727.6G76832759N53728O83367J253128J901209J440287J105249J583814J933098J599789
$$ 776832759 777386487 778069854 779322982 781224191 782664478 783769727 785353541 787286639 788886428
1745.9G88886428J086950J364827K380729K484798J824439J341045J205862J641333
$$ 788886428 789973378 791338205 793718934 796203732 798028171 799369216 800575078 802216411
1762.2H02216411J970470J380145N62191K57909Q93951J788437J532495P18773M22358
$$ 802216411 804186881 805567026 806129217 806387126 807281077 809069514 810602009 811320782 811743140
1780.6H11743140Q08835J151145R79066L16560j63317N10335J383066J068354L10183
$$ 811743140 812551975 813703120 814682186 814998746 814835429 815345764 816728830 817797184 818107367
1799H18107367J96099Q36491J175762Q08656K17855J22368O15478R43243P55549L30806
$$ 818107367 818303466 819139957 820315719 821124375 821342230 821464598 822080076 823023319 823778868 824109674
1819.4H24109674L0517J27912N37872M97341M8518J93477O49929P62641N85080J04904
$$ 824109674 824140191 824268103 824805975 825303316 825351834 825545311 826195240 826957881 827542961 827647865
1839.8H27647865l90649k44200N89728Q13007L19422o5327N7697M22597M13537K4081
$$ 827647865 827257216 827013016 827602744 828415751 828735173 828669846 828727543 829150140 829563677 829587758
1860.2H29587758k10464p5162O2227Q9705K19465K58386K79128M74394M99308J62899
$$ 829587758 829377294 829302132 829364359 829454064 829673529 829931915 830211043 830685437 831184745 831347644
1880.5H31347644j04963N7637L66688L69489J40667n1856O2943M62770N18382J03235
$$ 831347644 831242681 831300318 831667006 832036495 832177162 832125306 832188249 832651019 833169401 833272636
1900.9H33272636k22206r3699K33054L11256P7546j81854k09809P0572L65377J40071
$$ 833272636 833050430 832956731 833189785 833501041 833578587 833396733 833186924 833257496 833622873 833762944
1921.3H33762944j60098O5207M19796M33087Q8811k39790j47581K20597K55585j17421
$$ 833762944 833602846 833668053 834087849 834520936 834609747 834369957 834222376 834442973 834698558 834581137
1941.7H34581137k42830O6281M12225M81904J70529j68324r7572K68995M37618K00033
$$ 834581137 834338307 834404588 834816813 835298717 835469246 835300922 835203350 835472345 835909963 836109996
1962.1H36109996j77324k09928K20895M79818K06709j54674j40965J92940L71754J47223
$$ 836109996 835932672 835722744 835943639 836423457 836630166 836475492 836334527 836527467 836899221 837046444
1982.5H37046444j92165k48611m828J95503J46330n4777j58191L0876K41160Q8215
$$ 837046444 836854279 836605668 836600840 836796343 836942673 836887896 836729705 836760581 837001741 837089956
2002.9H37089956k57194l58403j01805J17541n4598m40419n84960l64184j70172l52978
$$ 837089956 836832762 836474359 836372554 836490095 836435497 835995078 835410118 835045934 834875762 834522784
2023.3H34522784o16074m04537L9459J66654n2750l70323m88163l01539l8028m7505
$$ 834522784 833906710 833502173 833541632 833708286 833655536 833285213 832797050 832495511 832457483 832409978
2043.7H32409978l10361m24147j97590R6798J03116j26481k33531n4419J70350J51754
$$ 832409978 832099617 831675470 831477880 831574678 831677794 831551313 831317782 831263363 831433713 831585467
2064.1H31585467m2677j13726M4585K17080J76608l0160j62542l4332K12371K30611
$$ 831585467 831542790 831429064 831473649 831690729 831867337 831837177 831674635 831640303 831852674 832083285
2084.5H32083285J907j48296j2875K49028L10123R7514p9573K4736K48969K89202R7036
$$ 832083285 832085192 831936896 831924021 832173049 832483172 832580686 832501113 832525849 832774818 833064020 833161056
2106.9H33161056q4698m1545J59085K22981L9935j14321n3168Q4698J23799J8359j04666
$$ 833161056 833076358 833034813 833193898 833416879 833456814 833342493 833289325 833374023 833497822 833516181 833411515
2129.4H33411515p5639O5327J35660N2214r3043j19269L9995J89483J27435m5955o8963
$$ 833411515 833335876 833401203 833536863 833589077 833496034 833376765 833416760 833606243 833733678 833687723 833618760
2151.8H33618760J05858K40564J81854P9215R5904J93655K80917K71678K13265K47836
$$ 833618760 833724618 833965182 834147036 834226251 834322155 834515810 834796727 835068405 835281670 835529506
2172.2H35529506L54946M33802M07637K78830J81794K41876L72410L80277K62499J91808
$$ 835529506 835884452 836318254 836725891 837004721 837186515 837428391 837800801 838181078 838443577 838635385
2192.6H38635385K56538L44158L17275J98603J31309K11000L40998L55483K71916K21133
$$ 838635385 838891923 839236081 839553356 839751959 839883268 840094268 840435266 840790749 841062665 841283798
2213H41283798K50876L02315K81393K13922J67548J54019K10583K63691J96099J02222
$$ 841283798 841534674 841836989 842118382 842332304 842499852 842653871 842864454 843128145 843324244 843426466
2233.4H43426466R7036J66595K32280J73151L9995J2815J06156J82688J46627N0664
$$ 843426466 843523502 843690097 843922377 844095528 844135523 844148338 844254494 844437182 844583809 844634473
2253.8H44634473K7359J31190K53558K35975R8586J8656P8201J89305K08139J17958
$$ 844634473 844661832 844793022 845046580 845282555 845381141 845399797 845477998 845667303 845875442 845993400
2274.2H45993400N2094P4804J35958J82212J49667L8743K920R0659J39415O8724l5166
$$ 845993400 846045494 846120298 846256256 846438468 846588135 846626878 846629798 846720457 846859872 846928596 846893430
2296.6H46893430n4062J2637M9889J2099n8949r1433l5584N0008L8862q7320j58608
$$ 846893430 846839368 846852005 846901894 846913993 846855044 846763611 846728027 846778035 846816897 846729577 846570969
2319.1H46570969j06991m7445j4246m1663j58429k44558k03073j81675k70546k81155
$$ 846570969 846463978 846416533 846402287 846360624 846202195 845957637 845754564 845572889 845302343 845021188
2339.5H45021188j66297o0737L6061O2466o1274k14279k53617k27690k70665k66373
$$ 845021188 844854891 844794154 844830215 844892681 844831407 844617128 844363511 844135821 843865156 843598783
2359.9H43598783j48356o5088m1843o3896j25766j20341Q404J19150O2346n4657n4241
$$ 843598783 843450427 843385339 843343496 843279600 843153834 843033493 843041897 843161047 843223393 843168736 843114495
2382.3H43114495L0756M5657p1108k30253k71499j56581n4062j29699k98024l30865
$$ 843114495 843145251 843190908 843119800 842889547 842618048 842461467 842407405 842277706 841979682 841648817
2402.7H41648817j99377q4103j55508l69668m77433l61681k14160k46644m19199n08190
$$ 841648817 841449440 841365337 841209829 840840161 840362728 840001047 839786887 839540243 839121044 838612854
2423.1H38612854l95894k53260k88546m50253n45383m87029l48389l20852m80295o02424
$$ 838612854 838216960 837963700 837675154 837224901 836679518 836192489 835844100 835523248 835042953 834440529
2443.5H34440529m88698k90096k74420m45366n82277n08786l23236k96652m51505n71251
$$ 834440529 833951831 833661735 833387315 832941949 832359672 831850886 831527650 831230998 830779493 830208242
2463.9H30208242n11825l03626j63436k91109n26369n45621l56197k46108l55720n19574
$$ 830208242 829696417 829392791 829229355 828938246 828411877 827866256 827510059 827263951 826908231 826388657
2484.3H26388657m70102k14874n8771j92046m45306m78089k80380j26779j66655l27408
$$ 826388657 825918555 825703681 825644910 825452864 825007558 824529469 824249089 824122310 823955655 823628247
2504.7H23628247l59833j72437m5657j88172m14669m47750k54035j04845k37942m98891
$$ 823628247 823268414 823095977 823050320 822862148 822447479 821999729 821745694 821640849 821402907 820904016
2525.1H20904016n72860l93927k14934k86818n19871o26684n00440l19660l63469n87225
$$ 820904016 820331156 819937229 819722295 819435477 818915606 818288922 817788482 817468822 817105353 816518128
2545.5H16518128o73950n12838k83480k85864n36799o79434n38587l34144l21626n05746
$$ 816518128 815844178 815331340 815047860 814761996 814225197 813545763 813007176 812673032 812351406 811845660
2565.8H11845660o54578n34713k71023k39968m69684o39856n77510l54886k31623l72589
$$ 811845660 811191082 810656369 810385346 810145378 809675694 809035838 808458328 808103442 807871819 807499230
2586.2H07499230n50211m73201k18153j17957l14594n56588n30600k80798j57535l44873
$$ 807499230 806949019 806475818 806257665 806139708 805825114 805268526 804737926 804457128 804299593 803954720
2606.6H03954720n84721n74708m03702l72470n93960q29935q08299o13510n49376p28190
$$ 803954720 803369999 802795291 802391589 802019119 801425159 800595224 799786925 799173415 798624039 797895849
2627G97895849r34363r30190p61866o70553q05258j000941j001775q35181p02619p66158
$$ 797895849 796961486 796031296 795269430 794598877 793793619 792792678 791790903 790955722 790253103 789486945
2647.4G89486945r70424j012086p93398o26325p33436r45508r79304p85470o12557
$$ 789486945 788516521 787504435 786711037 786084712 785351276 784405768 783426464 782640994 782028437
2665.8G82028437o86169q80837q74579o60062n24044n92113p64131q28803o77824n16713
$$ 782028437 781342268 780461431 779586852 778926790 778402746 777810633 777046502 776217699 775539875 775023162
2686.2G75023162n89251q05259q62956o78301n21004o30796q81433r73225q43704p10547
$$ 775023162 774433911 773628652 772765696 772087395 771566391 770935595 770054162 769080937 768237233 767526686
2706.6G67526686p53045r19700r85384q19981o11364o11723p78198q74520p71403n94914
$$ 767526686 766773641 765853941 764868557 764048576 763437212 762825489 762047291 761172771 760401368 759806454
2727G59806454n84662p30991p82848o12199m00007m02450o05285p48039o51240m55618
$$ 759806454 759221792 758490801 757707953 757095754 756695747 756293297 755688012 754939973 754288733 753833115
2747.4G53833115m19795n63443o65069n68270l86417l26813m39167n67138n35667m08947
$$ 753833115 753413320 752849877 752184808 751616538 751230121 750903308 750464141 749897003 749361336 748952389
2767.8G48952389m00841n43714o62327o56724n71668n66661p37429q86261q51512p80285
$$ 748952389 748551548 748007834 747345507 746688783 746117115 745550454 744813025 743926764 743075252 742294967
2788.2G42294967q35240r84072j090885j084089j061797j123488j224518j330375j382828
$$ 742294967 741459727 740475655 739384770 738300681 737238884 736115396 734890878 733560503 732177675
2806.5G32177675j345098j351774j487792j637280j653373j588404j611769j748800
$$ 732177675 730832577 729480803 727993011 726355731 724702358 723113954 721502185 719753385
2822.8G19753385j885772j932204j913249j916469j991987k112448k187610k270460
$$ 719753385 717867613 715935409 714022160 712105691 710113704 708001256 705813646 703543186
2839.1G03543186k457142k673030k840399k907813k874434k776086k624989k461731
$$ 703543186 701086044 698413014 695572615 692664802 689790368 687014282 684389293 681927562
2855.5F81927562k289713k198875k400815k852798l292143l641486l899515m044771
$$ 681927562 679637849 677438974 675038159 672185361 668893218 665251732 661352217 657307446
2871.8F57307446m199862m340292m206538l797650l320336k811373k266943j712680
$$ 657307446 653107584 648767292 644560754 640763104 637442768 634631395 632364452 630651772
2888.1F30651772j159608p30276n10812m69208n51105o18100o81042q60453j120746
$$ 630651772 629492164 628761888 628251076 627781868 627230763 626612663 625931621 625071168 623950422
2906.5F23950422j407802j679421j983344k455533k932727l104151l022551k802968
$$ 623950422 622542620 620863199 618879855 616424322 613491595 610387444 607364893 604561925
2922.8F04561925k389669j761199j005172k85507M78209J414895K367675L189087L846645
$$ 604561925 602172256 600411057 599405885 599120378 599598587 601013482 603381157 606570244 610416889
2941.1F10416889M268766M436671M460395M499256M604459M605234M444897M335642
$$ 610416889 614685655 619122326 623582721 628081977 632686436 637291670 641736567 646072209
2957.4F46072209M341125M257977L947318L521323L193796L025889K977193K976000
$$ 646072209 650413334 654671311 658618629 662139952 665333748 668359637 671336830 674312830
2973.8F74312830K897501K813220K769172K587140K274990K009809J845002J751006
$$ 674312830 677210331 680023551 682792723 685379863 687654853 689664662 691509664 693260670
2990.1F93260670J591742J270175R79304P54893M96387K95580Q1777j95264l45409
$$ 693260670 694852412 696122587 697101891 697856784 698353171 698648751 698730528 698535264 698189855
3008.4F98189855l68119n25057q76188j192749j349032j414716j474917j575291j692236
$$ 698189855 697821736 697296679 696420491 695227742 693878710 692463994 690989077 689413786 687721550
3026.8F87721550j738429j696169j650512j789630k037048k016068j836061j883090
$$ 687721550 685983121 684286952 682636440 680846810 678809762 676793694 674957633 673074543
3043.1F73074543k138793k299130k198994k090514k156555k242268k305567k331614
$$ 673074543 670935750 668636620 666437626 664347112 662190557 659948289 657642722 655311108
3059.4F55311108k252162k114713k006292k126873k412200k417624k156258j980066
$$ 655311108 653058946 650944233 648937941 646811068 644398868 641981244 639824986 637844920
3075.7F37844920k018154k239704k390325k335071k291739k294600k306938k417505
$$ 637844920 635826766 633587062 631196737 628861666 626569927 624275327 621968389 619550884
3092.1F19550884k455175k273619k103746k186239k357543k298653k084255k048612
$$ 619550884 617095709 614822090 612718344 610532105 608174562 605875909 603791654 601743042
3108.4F01743042k238690k241314j960277j877845k111494k404213k564371k432227
$$ 601743042 599504352 597263038 595302761 593424916 591313422 588909209 586344838 583912611
3124.7E83912611k133250k006889k121448k220154k088726j860380j878619k156079
$$ 583912611 581779361 579772472 577651024 575430870 573342144 571481764 569603145 567447066
3141E67447066k263963k104521j971006j833975j718164j899362k159357k146184k023220
$$ 567447066 565183103 563078582 561107576 559273601 557555437 555656075 553496718 551350534 549327314
3159.4E49327314j954079j888454j813650j782715j809180j807153j744867j684963
$$ 549327314 547373235 545484781 543671131 541888416 540079236 538272083 536527216 534842253
3175.7E34842253j702607j738369j708806j661181j626552j583337j565934j609325
$$ 534842253 533139646 531401277 529692471 528031290 526404738 524821401 523255467 521646142
3192E21646142j651347j606106j507462j484692j501619j460910j418412j402199j372040
$$ 521646142 519994795 518388689 516881227 515396535 513894916 512434006 511015594 509613395 508241355
3210.3E08241355j338899j309275j296401j333058j348555j299918j258343j212806
$$ 508241355 506902456 505593181 504296780 502963722 501615167 500315249 499056906 497844100
3226.7D97844100j113951r94802r92954j214206j370161j255155j132369j046866q86709
$$ 497844100 496730149 495735347 494742393 493528187 492158026 490902871 489770502 488723636 487836927
3245D87836927q80211j090259j126408r48400q94725r67592r39876q42541q40843q50856
$$ 487836927 486956716 485866457 484740049 483791649 482896924 481929332 480989456 480146915 479306072 478455216
3265.4D78455216o87749m57882n36502q77321j046747r46700p91788p27922p14987
$$ 478455216 477767467 477309585 476773083 475895762 474849015 473902315 473110527 472382605 471667618
3283.8D71667618p16150o82354n50330n06550o89298q78006r00209p96855o26325n00441
$$ 471667618 470951468 470269114 469718784 469212234 468522936 467644930 466744721 465947866 465321541 464821100
3304.2D64821100n95569r02713j162827j186758j045436r39697r10461q41558p30991
$$ 464821100 464225531 463322818 462159991 460973233 459927797 458988100 458077639 457236081 456505090
3322.5D56505090p51466r90122j165450j049936q82297q24929p80284q50886j038104
$$ 456505090 455753624 454763502 453598052 452548116 451665819 450840890 450060606 449209720 448171616
3340.9D48171616j133711j175224j098633q70764q89630j183003j294911j127570r62556
$$ 448171616 447037905 445862681 444764048 443893284 443003654 441820651 440525740 439398170 438435614
3359.2D38435614r84311r98944p87824o95944j003236j367956j369536j074076q88407
$$ 438435614 437451303 436452359 435664535 434968591 433965355 432597399 431227863 430153787 429265380
3377.6D29265380q80867r06527q73059p07210m33832j78456k74629p16716q20458l36647
$$ 429265380 428384513 427477986 426604927 425897717 425463885 425285429 425010800 424294084 423473626 423136979
3398D23136979n8472m93824r20147p25955l74406k64734k90811m17889n25593m20094
$$ 423136979 423078507 422584683 421664536 420938581 420564175 420299441 420008630 419590741 419065148 418645054
3418.4D18645054k59250j84745m7237J62274K60234J91599K25425L62158J62601k60681
$$ 418645054 418385804 418201059 418153822 418316096 418576330 418767929 418993354 419355512 419518113 419257432
3438.8D19257432k95728P8320M15176M92990M08411M41403N38766N52118O44147P67201
$$ 419257432 418961704 419040024 419455200 419948190 420356601 420798004 421336770 421888888 422533035 423300236
3459.2D23300236O54012O27339J007736J216441P97511K75075K95550O60509R63211
$$ 423300236 423954248 424581587 425589323 426805764 427603275 427878350 428173900 428834409 429797620
3477.5D29797620R53853O38395O23942R76354J014858Q12084Q54730J006842J078993
$$ 429797620 430751473 431389868 432013810 432990164 434005022 434817106 435671836 436678678 437757671
3495.9D37757671J021892R11861R05753Q57740P66993Q88318J184880J406253J274258
$$ 437757671 438779563 439691424 440597177 441454917 442221910 443110228 444295108 445701361 446975619
3514.2D46975619R57399R14008J129865J355529J286835R88692R63091J248420J462877
$$ 446975619 447933018 448847026 449976891 451332420 452619255 453607947 454571038 455819458 457282335
3532.6D57282335J502990J377374J232892J382739J576066J486450J283557J283377
$$ 457282335 458785325 460162699 461395591 462778330 464354396 465840846 467124403 468407780
3548.9D68407780J436174J610398J749843J821340J926750J936137J624346J399547
$$ 468407780 469843954 471454352 473204195 475025535 476952285 478888422 480512768 481912315
3565.2D81912315K016157K811640K727032K424449K462268K600282K741545K865702
$$ 481912315 483928472 486740112 489467144 491891593 494353861 496954143 499695688 502561390
3581.5E02561390K744019K467573K598167L177642L216267K958775L104150L402412
$$ 502561390 505305409 507772982 510371149 513548791 516765058 519723833 522827983 526230395
3597.9E26230395L442287L413499L283381K934456K880275L195167L424287L517449
$$ 526230395 529672682 533086181 536369562 539304018 542184293 545379460 548803747 552321196
3614.2E52321196L317117L246308L789723L887593L216803K459765K677202L899574
$$ 552321196 555638313 558884621 562674344 566561937 569778740 572238505 574915707 578815281
3630.5E78815281L969849L554225L369629L212213L136516K982676K502561K047002
$$ 578815281 582785130 586339355 589708984 592921197 596057713 599040389 601542950 603589952
3646.8F03589952K648294L939807L777147L080666L248930L479481K995371K507627
$$ 603589952 606238246 610178053 613955200 617035866 620284796 623764277 626759648 629267275
3663.1F29267275K289772J855433J614273K196491K218246K031207K744019K980769
$$ 629267275 631557047 633412480 635026753 637223244 639441490 641472697 644216716 647197485
3679.4F47197485K667427K343059J973688J645029J640737K073765K324342K138555
$$ 647197485 649864912 652207971 654181659 655826688 657467425 659541190 661865532 664004087
3695.8F64004087J725316J323522J309037J633227J536429R46641N78642J197516K045691
$$ 664004087 665729403 667052925 668361962 669995189 671531618 672478259 673056901 674254417 676300108
3714.1F76300108J908482J345217R66012Q55446Q91030J109004J271903Q89004L33607
$$ 676300108 678208590 679553807 680519819 681375265 682266295 683375299 684647202 685536206 685869813
3732.5F85869813M55260J405955J852750J142919K4200j11699Q06033O65725N78284
$$ 685869813 686325073 687731028 689583778 690726697 690750897 690639198 691445231 692110956 692689240
3750.8F92689240J635551J850069J149237Q39174J095593R88066O44326N92292O54995
$$ 692689240 694324791 696174860 697324097 698163271 699258864 700246930 700891256 701483548 702138543
3769.2G02138543R50694J216173R69530N81443N23984O96838O55353O31035P90059
$$ 702138543 703089237 704305410 705274940 705856383 706380367 707077205 707732558 708363593 709153652
3787.5G09153652Q02398O20544L17275J25111K17914J42038L03626Q42929P13706P69317
$$ 709153652 709956050 710576594 710893869 711018980 711236894 711378932 711682558 712525487 713239193 714008510
3807.9G14008510J110733P70449O5446p9870K98321K51770O56903J127064P90000M68254
$$ 714008510 715119243 715889692 715955138 715875268 716173589 716425359 717082262 718209326 718999326 719467580
3828.3G19467580L12448K60174K75493j669p749O30975R93848J046002Q43942J87516
$$ 719467580 719780028 720040202 720315695 720314026 720306277 720937252 721931100 722977102 723821044 724008560
3848.7G24008560p95245j251638M99368J818478J250088L81947r3878R7275K61665
$$ 724008560 723213315 721961677 722461045 724279523 725529611 725911558 725817680 725914955 726176620
3867.1G26176620M7624L09705P43270Q66592N96643N901P9870M76420M67658M48584
$$ 726176620 726224244 726533949 727277219 728143811 728740454 728746355 728826225 729302645 729770303 730218887
3887.5G30218887J94073Q9705N23508N22494o5208m22298j87219L30866Q48770R53495
$$ 730218887 730412960 730502665 731026173 731548667 731483459 731061161 730873942 731204808 732053578 733007073
3907.9G33007073O28710K61188o438r6559P1943K53021K31028J72973K35676K01524
$$ 733007073 733635783 733896971 733890533 733793974 733865917 734118938 734349966 734522939 734758615 734960139
3928.3G34960139L0219J09196L87907L94762J51634l3081K1875K15888J96755Q2493
$$ 734960139 734990358 735099554 735487461 735882223 736033857 736000776 736022651 736238539 736435294 736517787
3948.7G36517787J84596L08811K91586K48373K09987J66714K22027K51353J10924M530
$$ 736517787 736702383 737011194 737302780 737551153 737761140 737927854 738149881 738401234 738512158 738516688
3969.1G38516688K8611O1929R6798J80304K15828J85490J78397J74045J03295M7445
$$ 738516688 738545299 738607228 738704026 738884330 739100158 739285648 739464045 739638090 739741385 739788830
3989.5G39788830R9123J23381P4029O0022
$$ 739788830 739887953 740011334 740085363 740145385
3997.6G40145385
$$ 740145385
##END=$$ End of the data block
