##TITLE=$$ Begin of the data block
##JCAMP-DX=5.00 $$ ACD/SpecManager v 10.08
##SPECTROMETER/DATA SYSTEM=Alpha
##DATE=22 Dec 2014 10:36:42
##DATA TYPE=INFRARED SPECTRUM
##DATA CLASS=XYDATA
##ORIGIN=
##OWNER=
##NPOINTS=1765
##FIRSTX=399.76428223
##LASTX=3997.64306641
##MAXX=3997.64306641
##MINX=399.76428223
##MAXY=0.84787470
##MINY=0.36615321
##XFACTOR=1.0000000000
##YFACTOR=1.000000000000000e-9
##FIRSTY=0.63504088
##DELTAX=2.03961372
##XUNITS=1/CM
##YUNITS=ARBITRARY UNITS
##XYDATA=(X++(Y..Y))
399.8F35040879l898382m171193j842022J564742K053320l08275j224220K41339J825631
$$ 635040879 631142497 626971304 625129282 626694024 628747344 628439069 627214849 627456188 629281819
418.1F29281819J229763j653075k903998j187325P451k149403m700005l753066k05696
$$ 629281819 630511582 628858507 625954509 624767184 624774635 622625232 617925227 614172161 613966465
436.5F13966465K096534J736521J264394L020942N358756N029201J745820j064837
$$ 613966465 616062999 617799520 619063914 622084856 627443612 632472813 634218633 633153796
452.8F33153796o75320J240015R65714j873255l415584k190769q66234j807332l909946
$$ 633153796 632478476 633718491 634684205 632810950 629395366 627204597 626338363 624531031 620621085
471.2F20621085m419148k283275k36213m29988j843572j865148N4776J509309N76079
$$ 620621085 616201937 613918662 613682449 613252461 611408889 609543741 609598517 611107826 611683905
489.5F11683905j562595k123177p97272q4996j285315k982735l126741j860320j314760
$$ 611683905 610121310 607998133 607200861 607115865 605830550 602847815 599721074 597860754 596545994
507.9E96545994k537191m149556m327118l290832k774000l377498l635287k450406
$$ 596545994 594008803 589859247 585532129 582241297 579467297 576089799 572454512 570004106
524.2E70004106n16475O24955K94745q5413J356124M094780N633771M855037L257632
$$ 570004106 569487631 570112586 570407331 570321918 571678042 575772822 581406593 586261630 589519262
542.5E89519262K572000K439320J254499r22739k303004k185107j737713k518535m333615
$$ 589519262 592091262 594530582 595785081 594862342 592559338 590374231 588636518 586117983 581784368
560.9E81784368n495072n348503n044759n464077n636811m067123q46207K246678L794908
$$ 581784368 576289296 570940793 565896034 560431957 554795146 550728023 549881816 552128494 555923402
579.3E55923402M414022N452395O812751O911516M875601K191662R59397J173198J146615
$$ 555923402 560337424 565789819 572602570 579514086 584389687 586581349 587540746 588713944 589860559
597.6E89860559J36911r43362q82626K55764J017689O28710J90616R68158K544045
$$ 589860559 589997470 589054108 588171482 588427246 589444935 590073645 590264261 591232419 593776464
616E93776464L500939L204942K635061L002167L888011L858209K587616J425982J580059
$$ 593776464 597277403 600482345 603117406 606119573 610007584 613865793 616453409 617879391 619459450
634.3F19459450K394617K243340R76562J72496P88212J801968J691818N32389k6346
$$ 619459450 621854067 624097407 625073969 625246465 626034677 627836645 629528463 630060852 630034506
652.7F30034506Q49009J899600J586676K96890j49905O00874J675367K039314P60555
$$ 630034506 630883515 632783115 634369791 634666681 634516776 635117650 636793017 638832331 639592886
671F39592886L80635J424074K457202J974642N56827J27434J156629J941561J009405
$$ 639592886 639973521 641397595 643854797 645829439 646386266 646513700 647670329 649611890 650621295
689.4F50621295q40187j599550q96156n92649j943469l619611l559649j644612K01345
$$ 650621295 649781108 648181558 647285402 646692753 644749284 641129673 637570024 635925412 636126757
707.7F36126757M94897K03311J216889L564954N291342N113423M021168M018724N432308
$$ 636126757 636621654 636824965 638041854 641606808 646898150 652011573 656032741 660051465 665483773
726.1F65483773O179154M667520K379894J837492L055394L457070J534700j056612
$$ 665483773 671662927 676330447 678710341 680547833 683603227 687060297 688594997 687538385
742.4F87538385j873791j034379r68098k969027n263567n430639l663540k474844l125787
$$ 687538385 685664594 684630215 683662117 680693090 675429523 669998884 666335344 663860500 660734713
760.8F60734713l828287k325833J118422L995537M635573M292726N348742P793725
$$ 660734713 656906426 654580593 655699015 659694552 664330125 668622851 673971593 681765318
777.1F81765318Q950114P232249M504979L662705M860759N498230L796935J540244
$$ 681765318 690715432 697947681 702452660 706115365 710976124 716474354 720271289 721811533
793.4G21811533J745701M154265N455196L838598J332045R41157K644003L397107J454353
$$ 721811533 723557234 727711499 733166695 737005293 738337338 739278495 741922498 745319605 746773958
811.8G46773958j042127j071036J016736J950383k5809k756536l188789j632392j257777
$$ 746773958 745731831 744660795 745677531 747627914 747602105 744845569 741656780 740024388 738766611
830.1G38766611l551364o169021o162048l866851k418757l533840n218685m760503
$$ 738766611 735215247 729046226 722884178 719017327 716598570 713064730 707846045 703085542
846.4G03085542k530158j370609k880096n214691n392730l031254m7446K159656L941595
$$ 703085542 700555384 699184775 696304679 691089988 685697258 682666004 682618558 684778214 688719809
864.8F88719809O539583R882331J1558890R559870N510271K975106K635479J642048
$$ 688719809 695259392 705141723 716700613 726260483 731770754 734745860 737381339 739023387
881.1G39023387j787781n558253o529510m829466l581703m542231o041527n677700
$$ 739023387 737235606 731677353 725147843 720318377 716736674 712194443 706152916 700475216
897.4G00475216l646314k590120m127026o651997p581353o717146o370842q002639
$$ 700475216 696828902 694238782 690111756 683459759 675878406 669161260 662790418 654787779
913.7F54787779r949923r617090o816983l898323k767145k687216j678109O12080K530992
$$ 654787779 644837856 635220766 628403783 624505460 621738315 619051099 617372990 617985070 620516062
932.1F20516062K687216J887798K278507M247307N425513L476918q85844m782021o926358
$$ 620516062 623203278 625091076 627369583 631616890 637042403 640519321 639633477 634851456 627925098
950.5F27925098q667529j1315345j4046133j5135944j4636338j4427721j5651226j7356873
$$ 627925098 619257569 607942224 593896091 578760147 564123809 549696088 534044862 516687989
966.8E16687989j8047690j7615199j7140448j7285824j7354608j6210437j3725072
$$ 516687989 498640299 481025100 463884652 446598828 429244220 413033783 399308711
981.1C99308711j0823071q423447o538213m571735k348125m50910N21660P10964Q15601
$$ 399308711 388485640 380062193 373523980 368952245 366604120 366153210 366674870 367385834 368201435
999.4C68201435J222729J573026J219839J43141p59184p27177k7329N75125Q30353
$$ 368201435 369424164 370997190 372217029 372360170 371600986 370873809 370846480 371421605 372251958
1017.8C72251958J171827K034247L174841L871739L765971L333330L268897L428072
$$ 372251958 373423785 375458032 378632873 382504612 386270583 389603913 392872810 396300882
1034.1C96300882K984047J723737N48660L20375Q91358J429051J558483J944154L321260
$$ 396300882 399284929 401008666 401557326 401877701 402769059 404198110 405756593 407700747 411022007
1052.4D11022007N347968O956726P668734Q056342Q895606R674817Q266509L032833
$$ 411022007 416369975 423326701 430995435 439051777 447947383 457622200 465888709 468921542
1068.8D68921542m355430r556443r970576p075250l829002j406848P31527K886892
$$ 468921542 464566112 455009669 445039093 437963843 434134841 432727993 433459520 436346412
1085.1D36346412M493952N138128N226702N426258N708992N307794L721237J599342
$$ 436346412 440840364 445978492 451205194 456631452 462340444 467648238 471369475 472968817
1101.4D72968817L82870P78645K058626L039062L331721L412663L684104L745854K954543
$$ 472968817 473351687 474130332 476188958 479228020 482559741 485972404 489656508 493402362 496356905
1119.8D96356905J651555J059353J846284L322363M256367M021526K900898J366914
$$ 496356905 498008460 499067813 500914097 504236460 508492827 512514353 515415251 516782165
1136.1E16782165o98507l464937o212771p764042p684678o642013n641610m884094
$$ 516782165 516083658 512618721 506405950 498641908 490957230 484315217 478673607 473789513
1152.4D73789513l791779k058357j49667J309156K381176L716409N778670Q186490
$$ 473789513 469997734 467939377 467789710 469098866 471480042 475196451 480975121 489161611
1168.7D89161611J0025858J0879636J1253357J1809826J2483418J2566030J1674404
$$ 489161611 499187469 510067105 521320462 533130288 545613706 558179736 569854140
1183E69854140J0390342R452283Q707523P347942N176902L114044K146304K146900
$$ 569854140 580244482 589696765 598404288 605752230 610929132 614043176 616189480 618336380
1199.3F18336380K148032J686811J360715J943111L220975M163564M220605L825187
$$ 618336380 620484412 622171223 623531938 625475049 628696024 632859588 637080193 640905380
1215.6F40905380L604591L507733K872646J412273j81377r39846q49009q07881j312971
$$ 640905380 644509971 648017704 650890350 652302623 652121246 651181400 650332391 649524510 648211539
1234F48211539j868963j716912q88765j53065Q9944K27093Q04484J708806K186715
$$ 648211539 646342576 644625664 643736899 643583834 643673778 643900871 644705355 646414161 648600876
1252.3F48600876J839757J138687Q21352J052499J300574J183331J044035J358807
$$ 648600876 650440633 651579320 652400672 653453171 654753745 655937076 656981111 658339918
1268.6F58339918J949608K093375J370251K80440l15428k83599k08735m97461r20892
$$ 658339918 660289526 662382901 663753152 664033592 663718164 663434565 663225830 662728369 661807477
1287F61807477j017391q04305p96140j264214j864076k055466j750648j419723j502931
$$ 661807477 660790086 659985781 659189641 657925427 656061351 654005885 652255237 650835514 649332583
1305.4F49332583j810372j777708j336158r48608r68218j285076j457214j501858k016664
$$ 649332583 647522211 645744503 644408345 643459737 642491519 641206443 639749229 638247371 636230707
1323.7F36230707l130078m255414m743099m448891l805459l218054k572716j517534
$$ 636230707 633100629 628845215 624102116 619653225 615847766 612629712 610056996 608539462
1340F08539462k92182L81470M26471J64926q7976j72854k62618n26488r22620j221955
$$ 608539462 608247280 608628750 609055221 609220147 609132171 608959317 608696699 608170211 607247591 606025636
1360.4F06025636j100004n87701l68595m07637j78158K62618P82371J018822Q09133
$$ 606025636 604925632 604337931 603969336 603561699 603383541 603646159 604428530 605447352 606256485
1378.8F06256485O45459J010716J990735L242910L675461K816319J709998Q07583J9431
$$ 606256485 606901944 607912660 609903395 613146305 616821766 619638085 621348083 622155666 622175097
1397.1F22175097n96702q23557j020432j331925j465380j641214j755059j528382j312018
$$ 622175097 621578395 620754838 619734406 618402481 616937101 615295887 613540828 612012446 610700428
1415.5F10700428j374423j018107p8678M65870P11322P85350Q75891J183092J302660
$$ 610700428 609326005 608307898 608229220 608695090 609406412 610191762 611067653 612250745 613553405
1433.9F13553405J447320J875877J784802J476109J188039O76871p928n80906j005412
$$ 613553405 615000725 616876602 618661404 620137513 621325552 622002423 621994495 621413589 620408177
1452.2F20408177j438140k195180j806736L5405Q51989J723826L090441L779710M517316
$$ 620408177 618970037 616774857 614968121 615003526 615855515 617579341 620669782 624449492 628966808
1470.6F28966808O746769Q303821P746637O758750O065309N794525N278885M762590
$$ 628966808 635713577 644017398 651764035 658522785 664588094 670382619 675661504 680424094
1486.9F80424094M741967M913747M193306L500760L611803L611088L008186K150238
$$ 680424094 685166061 690079808 694273114 697773874 701385677 704996765 708004951 710155189
1503.2G10155189J610577K513647L295005K565026J910806J659989J829326J690149
$$ 710155189 711765766 714279413 717574418 720139444 722050250 723710239 725539565 727229714
1519.5G27229714J534880J836121K018690K148151J711071R24170Q68857J228571O92546
$$ 727229714 728764594 730600715 732619405 734767556 736478627 737402797 738271654 739500225 740192771
1537.9G40192771M2140N91159J296223J411497R72927L26276j36376m48167q21114
$$ 740192771 740234911 740826070 742122293 743533790 744506717 744832993 744696617 744248450 743427336
1556.2G43427336j292228l27230L55005m09960q78871j109183j289487j210808j676798
$$ 743427336 742135108 741807878 742162883 741752923 740874052 739764869 738475382 737264574 735587776
1574.6G35587776j975239j151800j103341j803697k044796j789034j577616j796841
$$ 735587776 733612537 732460737 731357396 729553699 727508903 725719869 724142253 722345412
1590.9G22345412k201736k296627j968622j723289j966119k377153k524078k400279
$$ 722345412 720143676 717847049 715878427 714155138 712189019 709811866 707287788 704887509
1607.2G04887509k289354k375782k742827l460169l512859k170444k052009k888560
$$ 704887509 702598155 700222373 697479546 694019377 690506518 688336074 686284065 683395505
1623.5F83395505k753019k239049j792967j383007j624226j749158k52843P40349O31035
$$ 683395505 680642486 678403437 676610470 675227463 673603237 671854079 671601236 672341585 672972620
1641.9F72972620J91748J18076J253963J763523J610338K836228L212630K731443K791345
$$ 672972620 673164368 673282444 674536407 676299930 677910268 680746496 683959126 686690569 689481914
1660.3F89481914L203929L321230K675593K671361L766954L927469L676832L854155
$$ 689481914 692685843 696007073 698682666 701354027 705120981 709048450 712725282 716579437
1676.6G16579437L657103L305077L285826M369318M436314L725708L789127L222346
$$ 716579437 720236540 723541617 726827443 731196761 735633075 739358783 743147910 746370256
1692.9G46370256K389908K028405K283037L319919L027499K013206J735688J727283
$$ 746370256 748760164 750788569 753071606 756391525 759419024 761432230 763167918 764895201
1709.2G64895201J667678J351535P58946Q01206J803517K127707J824022J398742Q43108
$$ 764895201 766562879 767914414 768673360 769474566 771278083 773405790 775229812 776628554 777471662
1727.6G77471662O10470P56204J295031J861810J395703J122534J600206J919150J594186
$$ 777471662 778082132 778838336 780133367 781995177 783390880 784513414 786113620 788032770 789626956
1745.9G89626956J094222J369000K357721K456605J826525J336157J188815J644552
$$ 789626956 790721178 792090178 794447899 796904504 798731029 800067186 801256001 802900553
1762.2H02900553J970827J373768N61953K86877R46522J789868J483857O82891M25100
$$ 802900553 804871380 806245148 806807101 807093978 808040500 809830368 811314225 811997116 812422216
1780.6H12422216Q32021J176655R94206L31163j21414N53071J365841J008153K64346
$$ 812422216 813254237 814430892 815425098 815756261 815634847 816187918 817553759 818561912 818826258
1799H18826258J96457Q39830J149296P82907K14398J19031O02483R54867P65443L11315
$$ 818826258 819022715 819862545 821011841 821794748 822009146 822128177 822730660 823685527 824450970 824762285
1819.4H24762285L3319J62124N69582N30422Q0526J77622O06477P40886N76436J16051
$$ 824762285 824795604 824957728 825527310 826057732 826138258 826315880 826922357 827663243 828239679 828355730
1839.8H28355730l40879k14637N42462P43866K79665n3346J10447M64678M23849K4438
$$ 828355730 828014851 827800214 828342676 829086542 829366207 829312861 829423308 829887986 830311835 830336273
1860.2H30336273k16186q4222P3076J01924J86681K17378K79665M93408N10633J59025
$$ 830336273 830120087 830035865 830108941 830210865 830397546 830614924 830894589 831387997 831898630 832057655
1880.5H32057655j21117O4433L97026L77715J27077n8114M3630M31359N26249J21117
$$ 832057655 831936538 832000971 832397997 832775712 832902789 832844675 832888305 833319664 833845913 833967030
1900.9H33967030k50339j24813K49505L45767Q2433k03311k09332J23680M07994J19090
$$ 833967030 833716691 833591878 833841383 834187150 834269583 834066272 833856940 833980620 834388614 834507704
1921.3H34507704j95623M9532M08947M24266Q6725k47300j48117K48551L03090r2805
$$ 834507704 834312081 834361613 834770560 835194826 835281551 835034251 834886134 835134685 835437775 835344970
1941.7H35344970k68936M8995M26531M82619J49250j85132j00613K70546M48167K17676
$$ 835344970 835076034 835125029 835551560 836034179 836183429 835998297 835897684 836168230 836616397 836834073
1962.1H36834073j52290j95205K02298M70996K24054j46449j38223J89722L52144J50621
$$ 836834073 836681783 836486578 836688876 837159872 837383926 837237477 837099254 837288976 837641120 837791741
1982.5H37791741j60337k28047j1861J59144J10507o3240j54972M0352K52187Q4818
$$ 837791741 837631404 837403357 837391496 837550640 837661147 837597907 837442935 837483287 837735474 837820292
2002.9H37820292k45035l17395r3460P3195r7096m48466n60999l23653j46031l61324
$$ 837820292 837575257 837257862 837164402 837237597 837140501 836692035 836131036 835807383 835661352 835300028
2023.3H35300028o32345l93749O6996J75834o8367l96609n10574l20792m7207k5451
$$ 835300028 834667683 834273934 834340930 834516764 834448397 834051788 833541214 833220422 833173215 833147764
2043.7H33147764k71559m07934k06113Q1063Q7499j41918k45512l9041K12371J79470
$$ 833147764 832876205 832468271 832262158 832343221 832430720 832288802 832043290 832004249 832216620 832396090
2064.1H32396090m1366j31130J7345K17915K04324k8491j89781n2690K21073K56420
$$ 832396090 832354724 832223594 832240939 832458854 832663178 832634687 832444906 832392216 832613289 832869709
2084.5H32869709J0073j57595j252K65897K94685P6890p4029M1962K62916K76863O9917
$$ 832869709 832879782 832722187 832720935 832986832 833281517 833358407 833284378 833326340 833589256 833866119 833936036
2106.9H33936036q3924l2305J54376K29537O6996j03593n9426R1136J31309K3484r5308
$$ 833936036 833852112 833819807 833974183 834203720 834270716 834167123 834107697 834198833 834330142 834353626 834258318
2129.4H34258318o9141O8068J30653K7895j13129j10030O3061J99497J03057q1778
$$ 834258318 834189177 834257245 834387898 834415793 834302664 834192634 834255695 834455192 834558249 834476471
2149.8H34476471p7903J17659K46525J84834P7963J03533K35379L09050K48849J74225
$$ 834476471 834398568 834516227 834762752 834947586 835025549 835129082 835364461 835673511 835922360 836096585
2170.2H36096585K42710L77118M28439L83138K78354K08676K76208L81052L60906K58923
$$ 836096585 836339295 836716413 837144852 837527990 837806344 838015020 838291228 838672280 839033186 839292109
2190.6H39292109K04086K48373L31282L32296K11239J14322K00570L64422L88205K77639
$$ 839292109 839496195 839744568 840075850 840408146 840619385 840733707 840934277 841298699 841686904 841964543
2211H41964543J98006K23101K93791K90215K08676J31547J26779K39909L12090J99497
$$ 841964543 842162549 842385650 842679441 842969656 843178332 843309879 843436658 843676567 843988657 844188154
2231.4H44188154O2704O2406J61409K40743J89484P5280N8055J15395J48833J39176
$$ 844188154 844250858 844313264 844474673 844715416 844904900 844980180 845038235 845153630 845302463 845441639
2251.8H45441639Q0884K9564J14500K60413K31266P1526K7716J14679K00689K11179
$$ 845441639 845522523 845552087 845666587 845927000 846158266 846229792 846257508 846372187 846572876 846784055
2272.2H46784055J21296M1365Q2493J70708J94251J21415K1040J4186J03414J52290
$$ 846784055 846905351 846946716 847029209 847199917 847394168 847515583 847536623 847550809 847654223 847806513
2292.5H47806513O8188o3956q6486Q225Q0347L9161n1022o1035J1504N6266l576j38342
$$ 847806513 847874701 847810745 847724259 847732484 847812831 847851992 847800970 847739935 847751439 847807705 847804129 847665787
2317H47665787k12491j53541k3306M3869l0637j94549k72453j74403j47283k66850
$$ 847665787 847453296 847299755 847276449 847320318 847289681 847095132 846822679 846648276 846500993 846234143
2337.4H46234143k86222j46448j9193M2379K4974j10566k16663j76549j29044j74225
$$ 846234143 845947921 845801473 845782280 845824659 845849633 845739067 845522404 845345855 845216811 845042586
2357.8H45042586k55942k95937j57952P808o1035k14696j69099M2618J44362K2054
$$ 845042586 844786644 844490707 844332755 844340563 844279528 844064832 843895733 843938351 844082713 844104767
2378.2H44104767j11938p6711L4392P5698r656j95503k90513j77801n2452j22309l02911
$$ 844104767 843992829 843916118 843950510 844026208 844016552 843821049 843530536 843352735 843300283 843177974 842875063
2400.6H42875063l50654k20477j03951j54555l52084m85838l61442j87159k45154m39822
$$ 842875063 842524409 842303932 842199981 842045426 841693342 841207504 840846062 840658903 840413749 839973927
2421H39973927n20409l95000k35974k58506m45366n72621m88162l27051l37243n03004
$$ 839973927 839453518 839058518 838822544 838564038 838118672 837546051 837057889 836730838 836393595 835890591
2441.4H35890591n84483m79102l09765k81990m43995o01172n38111l24309k67089m36127
$$ 835890591 835306108 834827006 834517241 834235251 833791256 833190084 832651973 832327664 832060575 831624448
2461.8H31624448n66125m94778l13222j94073k86639m96328n20467l28839k11895l26335
$$ 831624448 831058323 830563545 830250323 830056250 829769611 829273283 828752816 828423977 828212082 827885747
2482.2H27885747n08666m86016k59340j21653k32518m27127m32551k41995j01983j70648
$$ 827885747 827377081 826891065 826631725 826510072 826277554 825850427 825417876 825175881 825073898 824903250
2502.6H24903250l52741l93509j97173k6404j36376l72469m40002k85446j58966l00944
$$ 824903250 824550509 824157000 823959827 823933423 823797047 823424578 822984576 822699130 822540164 822239220
2523H22239220n26905n20945l36706k32697l14295n04434o19173n19514l39627l64900
$$ 822239220 821712315 821191370 820854664 820621967 820307672 819803238 819184065 818664551 818324924 817960024
2543.4H17960024n79059o72400n03540k69890k72215n18381o86944n64456l30627l08573
$$ 817960024 817380965 816708565 816205025 815935135 815662920 815144539 814457595 813893139 813562512 813253939
2563.8H13253939n06341o27518n00441k96771k86520m87208o56128n71072l22998k37524
$$ 813253939 812747598 812120080 811619639 811322868 811036348 810549140 809893012 809321940 808998942 808761418
2584.2H08761418m12703n63562m26948j81317j57297l46541n08010m56810k73288k17199
$$ 808761418 808348715 807785153 807358205 807176888 807019591 806673050 806165040 805708230 805434942 805217743
2604.6H05217743l80993n79655n58138l81470l77416o14703q27611q01861o21319n50925
$$ 805217743 804836750 804257095 803698957 803317487 802940071 802325368 801497757 800695896 800074577 799523652
2625G99523652p15495r36210r52303p74562o57082p87258j014531j010477p90239o72877
$$ 799523652 798808157 797871947 796919644 796145082 795488000 794700742 793686211 792675734 791885495 791212618
2645.4G91212618q17179j024485j006544p78257o19293p15375r30428r78112p96318
$$ 791212618 790395439 789370954 788364410 787586153 786966860 786251485 785321057 784342945 783546627
2663.7G83546627o25909o83963q50201q37385o56844n56409o31571p71880q16941o91712
$$ 783546627 782920718 782236755 781386554 780549169 779892325 779335916 778704345 777932465 777115524 776423812
2684.1G76423812n16117n64277p95960q45552o53922n20170o48439r15051j021146
$$ 776423812 775907695 775343418 774547458 773701906 773047984 772527814 771879375 770964324 769943178
2702.5G69943178q76010p17044p48574r04560r56357q02279o24656o48141q22961q72255
$$ 769943178 769067168 768350124 767601550 766696990 765740633 764938354 764313698 763665557 762842596 761970341
2722.9G61970341p11143n50389n74470p21573p71225o14226m29630m47750o05643p15435
$$ 761970341 761259198 760708809 760134339 759412766 758641541 758027315 757597685 757149935 756544292 755828857
2743.3G55828857o57320m76122m14967n60343o70910n63443l67761l18169m55916n83410
$$ 755828857 755171537 754695415 754280448 753720105 753049195 752485752 752117991 751799822 751343906 750760496
2763.7G50760496n24462l88026m03464n74708o84082o16551n22375n78046p67290r10580
$$ 750760496 750236034 749848008 749444544 748869836 748185754 747569203 747046828 746468782 745701492 744790912
2784.1G44790912q50559p23302p81059r85682j105488j084029j058221j129508j257777
$$ 744790912 743940353 743217051 742435992 741450310 740344822 739260793 738202572 737073064 735815287
2802.4G35815287j364708j413405j378000j332819j437367j643598j698911j595318
$$ 735815287 734450579 733037174 731659174 730326355 728888988 727245390 725546479 723951161
2818.8G23951161j581669j719177j863897j935243j936615j929164k006769k153992
$$ 723951161 722369492 720650315 718786418 716851175 714914560 712985396 710978627 708824635
2835.1G08824635k240181k268911k407789k656281k847731k911031k877176k766550
$$ 708824635 706584454 704315543 701907754 699251473 696403742 693492711 690615535 687848985
2851.4F87848985k593934k424956k304733k288937k489090k857387l242910l626287
$$ 687848985 685255051 682830095 680525362 678236425 675747335 672889948 669647038 666020751
2867.7F66020751l922701m044592m180312m359901m275561l861844l328204k784610
$$ 666020751 662098050 658053458 653873146 649513245 645237684 641375840 638047636 635263026
2884F35263026k252519j716733j203657p95126n44309m88758n49495n83649o36757
$$ 635263026 633010507 631293774 630090117 629294991 628750682 628261924 627712429 627128780 626492023
2902.4F26492023q48233j164377j427889j641452j972318k488494k943575l100693
$$ 626492023 625643790 624479413 623051524 621410072 619437754 616949260 614005685 610904992
2918.7F10904992l022969k794624k389729j791834j047790k81334N12540J423657K369285
$$ 610904992 607882023 605087399 602697670 600905836 599858046 599576712 600089252 601512909 603882194
2937F03882194L199279L816426M209280M439056M532277M558146M595518M557669M435480
$$ 603882194 607081473 610897899 615107179 619546235 624078512 628636658 633232176 637789845 642225325
2955.4F42225325M383624M379809M270196L962934L535628L220856L076732L023207
$$ 642225325 646608949 650988758 655258954 659221888 662757516 665978372 669055104 672078311
2971.7F72078311K987624K882421K807915K793908K622962K321661K088844J921714
$$ 672078311 675065935 677948356 680756271 683550179 686173141 688494802 690583646 692505360
2988F92505360J781344J578689J244306R68933P73430N26369K97248P5877j43766k59758
$$ 692505360 694286704 695865393 697109699 698078632 698852062 699378431 699675679 699751556 699607790 699348032
3008.4F99348032l25262n20945q96215j249194j401961j428545j460433j560330j701117
$$ 699348032 699022770 698501825 697605610 696356416 694954455 693525910 692065477 690505147 688804030
3026.8F88804030j744330j674175j626730j766801k022683k019823j815379j832365
$$ 688804030 687059700 685385525 683758795 681991994 679969311 677949488 676134109 674301744
3043.1F74301744k097667k300977k242744k145052k201379k243161k275824k326668
$$ 674301744 672204077 669903100 667660356 665515304 663313925 661070764 658794940 656468272
3059.4F56468272k247453k103388k034366k145648k382755k429724k213657j990795
$$ 656468272 654220819 652117431 650083065 647937417 645554662 643124938 640911281 638920486
3075.7F38920486j991034k223193k377153k325415k313435k328039k321541k416491
$$ 638920486 636929452 634706259 632329106 630003691 627690256 625362217 623040676 620624185
3092.1F20624185k438486k276838k144694k196253k324044k278984k085864k058745
$$ 620624185 618185699 615908861 613764167 611567914 609243870 606964886 604879022 602820277
3108.4F02820277k256870k267659j987517j888096k079308k350092k542555k448857
$$ 602820277 600563407 598295748 596308231 594420135 592340827 589990735 587448180 584999323
3124.7E84999323k181411k047002k126336k244532k133012j865626j839816k126873
$$ 584999323 582817912 580770910 578644574 576400042 574267030 572401404 570561588 568434715
3141E68434715k289772k163648k009213j857519j739502j871527k103388k133787k040267
$$ 568434715 566144943 563981295 561972082 560114563 558375061 556503534 554400146 552266359 550226092
3159.4E50226092j944601j879871j862288j814305j775504j811206j820803j753747
$$ 550226092 548281491 546401620 544539332 542725027 540949523 539138317 537317514 535563767
3175.7E35563767j704872j718282j746953j709640j606643j539529j579046j648128
$$ 535563767 533858895 532140613 530393660 528684020 527077377 525537848 523958802 522310674
3192E22310674j640916j614690j588284j523018j467348j429140j385629j393616j434327
$$ 522310674 520669758 519055068 517466784 515943766 514476418 513047278 511661649 510268033 508833706
3210.3E08833706j404941j322925j271069j278281j314282j338304j324474j263619
$$ 508833706 507428765 506105840 504834771 503556490 502242208 500903904 499579430 498315811
3226.7D98315811j146853r96977r90212j209766j353949j260042j164109j091241r22025
$$ 498315811 497168958 496171981 495181769 493972003 492618054 491358012 490193903 489102662 488180637
3245D88180637q88377j081914j121253r34422q46058r42945r93461q89510q10503q10117
$$ 488180637 487292260 486210346 485089093 484154671 483308613 482365668 481372207 480482697 479672194 478862077
3265.4D78862077o94752m96536n80758q89540j024842r64820q28416p10070p16239
$$ 478862077 478167325 477670789 477090031 476200491 475175649 474210829 473382413 472672343 471956104
3283.8D71956104p68840p03573n34088m84645o48558q63374r83566q91328o14553m15057
$$ 471956104 471187264 470483691 469949603 469464958 468816400 467953026 466969460 466078132 465463579 465048522
3304.2D65048522n20408q72076j153290j174510j043617r60649r43481q96067p97510
$$ 465048522 464528114 463656038 462502748 461328238 460284621 459323972 458380491 457484424 456686914
3322.5D56686914p59810r39042j138001j093269r41872q07405p20233q46236j067907
$$ 456686914 455927104 454988062 453850061 452756792 451814920 451007515 450287282 449441046 448373139
3340.9D48373139j116812j103133j033217q67069r63181j296103j375496j130701r10550
$$ 448373139 447256327 446153194 445119977 444252908 443289727 441993624 440618128 439487427 438576877
3359.2D38576877r34809r73076p76231o75112r74179j363098j372546j078040r08672
$$ 438576877 437642068 436668992 435892761 435217649 434243470 432880372 431507826 430429786 429521114
3377.6D29521114r13471r37581q50499o61284m47810k22682l03478p07179p81864l38197
$$ 429521114 428607643 427670062 426819563 426158279 425710469 425487787 425184309 424477130 423695266 423357069
3398D23357069o8664m77374r25541p27921l65675k61664k68787m19796n71281m34905
$$ 423357069 423288405 422811031 421885490 421157569 420791894 420530230 420261443 419841647 419270366 418835461
3418.4D18835461k02685j07766k3603J57684K62171J54495J60605L19689J75447j82569
$$ 418835461 418632776 418525010 418501407 418659091 418921262 419075757 419236362 419556051 419731498 419548929
3438.8D19548929k20657P5311L59833M83871M39643M06146M54396N28843O79999P75904
$$ 419548929 419328272 419403583 419763416 420247287 420686930 421093076 421547472 422076315 422756314 423532218
3459.2D23532218O35504O50347J042157J206786P71701K56956L02732O80863R58115
$$ 423532218 424167722 424818069 425860226 427067012 427838713 428095669 428398401 429079264 430037379
3477.5D30037379R42409O71059O68168R49770R50039P74264Q40217R97335J055240
$$ 430037379 430979788 431650847 432319015 433268785 434218824 434993088 435833305 436830640 437885880
3495.9D37885880J024992R94265J004815Q99136P41720Q16763J107067J367032J306653
$$ 437885880 438910872 439905137 440909952 441809088 442550808 443367571 444474638 445841670 447148323
3514.2D47148323J010060R38654J161486J363337J233906R62496J023173J310587J453221
$$ 447148323 448158383 449097037 450258523 451621860 452855766 453818262 454841435 456152022 457605243
3532.6D57605243J482814J412094J283944J379251J529902J475573J322150J341522
$$ 457605243 459088057 460500151 461784095 463163346 464693248 466168821 467490971 468832493
3548.9D68832493J495987J618296J696348J784682J927555J940042J637518J451850
$$ 468832493 470328480 471946776 473643124 475427806 477355361 479295403 480932921 482384771
3565.2D82384771K119631K880871K727509K406567K423674K567291K758622K933443
$$ 482384771 484504402 487385273 490112782 492519349 494943023 497510314 500268936 503202379
3581.5E03202379K828240K522588K635121L169716L150582K931058L134251L408194
$$ 503202379 506030619 508553207 511188328 514358044 517508626 520439684 523573935 526982129
3597.9E26982129L406524L401220L318489K960384K890527L226697L462375L543555
$$ 526982129 530388653 533789873 537108362 540068746 542959273 546185970 549648345 553191900
3614.2E53191900L321588L258765L847361L917932L202081K436578K606988L855825
$$ 553191900 556513488 559772253 563619614 567537546 570739627 573176205 575783193 579639018
3630.5E79639018M030644L614724L398180L229559L092467K917946K521217K106845
$$ 579639018 583669662 587284386 590682566 593912125 597004592 599922538 602443755 604550600
3646.8F04550600K664745L927112L791153L122330L271460L456176K943694K457738
$$ 604550600 607215345 611142457 614933610 618055940 621327400 624783576 627727270 630185008
3663.1F30185008K286434J923681J688241K191365K159894J964688K739787L021240
$$ 630185008 632471442 634395123 636083364 638274729 640434623 642399311 645139098 648160338
3679.4F48160338K686739K340734J972616J661837J665890K098322K343953K154410
$$ 648160338 650847077 653187811 655160427 656822264 658488154 660586476 662930429 665084839
3695.8F65084839J728773J283407J252055J615405J541138R61661O15061J232564K041638
$$ 665084839 666813612 668097019 669349074 670964479 672505617 673467278 674082339 675314903 677356541
3714.1F77356541J876295J327753R58383Q32915Q97050J157165J324892R51648M02390
$$ 677356541 679232836 680560589 681518972 682351887 683248937 684406102 685730994 686682642 687085032
3732.5F87085032M80772J358687J774073J110017P9394J2457Q87573O34253M47512
$$ 687085032 687565804 688924491 690698564 691808581 691887975 691900432 692788005 693422258 693869770
3750.8F93869770J526832J871407J223505Q48353J060307R59515O30558O43253P36296
$$ 693869770 695396602 697268009 698491514 699339867 700400174 701359689 701990247 702633500 703369796
3769.2G03369796R35674J117706R17554N98550N18143O65963O72698O91950Q42035
$$ 703369796 704305470 705423176 706340730 706939280 707457423 708123386 708796084 709488034 710330069
3787.5G10330069P98822N79416L24071J85311K27332P2717K40028Q79467Q23438P67887
$$ 710330069 711128891 711708307 712032378 712217689 712445021 712517738 712757766 713637233 714460671 715228558
3807.9G15228558R88304P00414O2585p8916L02314L15488P25627J083731O85692M03464
$$ 715228558 716216862 716917276 716979861 716900945 717203259 717518747 718244374 719328105 720013797 720417261
3828.3G20417261L32296L11852L04102K1637L099N94676R95815J124799Q84056J53661
$$ 720417261 720749557 721061409 721365511 721387148 721390247 721984923 722980738 724105537 724989593 725143254
3848.7G25143254q13544j181364N24402J735985J189291L60132q7083J57058L62933
$$ 725143254 724329710 723148346 723672748 725408733 726598024 726958156 726871073 727028131 727391064
3867.1G27391064J21176L25740P20978P89403N54503P3313J51754M48107L73304M12286
$$ 727391064 727512240 727837980 728558958 729348361 729902864 729976177 730127931 730576038 730949342 731361628
3887.5G31361628K36570J22548N07593N07831l2961l71754j75476K82108P86901R10640
$$ 731361628 731598198 731720746 732228339 732736170 732703209 732331455 732155979 732438087 733224988 734135628
3907.9G34135628N86211K35200J6928l8326J16945K68459K17140J95682L07798J85549
$$ 734135628 734721839 734957039 734973967 734935641 735052586 735321045 735538185 735733867 736041665 736227214
3928.3G36227214k5689J40667L94880L27945J39773L9399J07109K63572J80185K3723
$$ 736227214 736201525 736342192 736737072 737065017 737204790 737244189 737351298 737614870 737795055 737818778
3948.7G37818778J40488L06487L15368K41578J73330J38640J94669K22623R5666K1338
$$ 737818778 737959266 738265753 738581121 738822699 738996029 739134669 739329338 739551961 739647627 739668965
3969.1G39668965P0155J10626J10328R3341J24455K57313L08216J70886O9797P7367
$$ 739668965 739739120 739849746 739960074 740053415 740177870 740435183 740743399 740914285 740984082 741061449
3989.5G41061449Q3745O1571O5208J21891
$$ 741061449 741145194 741206765 741271973 741393864
3997.6G41393864
$$ 741393864
##END=$$ End of the data block
