##TITLE=$$ Begin of the data block
##JCAMP-DX=5.00 $$ ACD/SpecManager v 10.08
##SPECTROMETER/DATA SYSTEM=Alpha
##DATE=22 Dec 2014 10:36:42
##DATA TYPE=INFRARED SPECTRUM
##DATA CLASS=XYDATA
##ORIGIN=
##OWNER=
##NPOINTS=1765
##FIRSTX=399.76428223
##LASTX=3997.64306641
##MAXX=3997.64306641
##MINX=399.76428223
##MAXY=0.84936023
##MINY=0.36637467
##XFACTOR=1.0000000000
##YFACTOR=1.000000000000000e-9
##FIRSTY=0.63668466
##DELTAX=2.03961372
##XUNITS=1/CM
##YUNITS=ARBITRARY UNITS
##XYDATA=(X++(Y..Y))
$$ plain form
399.8 636684656 632499874 627828002 626086056 628054321 630344510 630116284 628964067 629377306 631263137
418.1 631263137 632085741 630086243 627212465 626120448 626016140 623703480 619125009 615584671 615309715
436.5 615309715 617110312 618742287 620115817 623178422 628494442 633413076 635073304 634072304
452.8 634072304 633572340 635027885 636198342 634345055 630683541 628258467 627444506 625722885 621612787
471.2 621612787 616874933 614624321 614742756 614494383 612539709 610460460 610401273 611886203 612375140
489.5 612375140 610737681 608618438 607847989 607811689 606592119 603540838 600276351 598390222 597084582
507.9 597084582 594534099 590388954 586222529 583255172 580655217 577110589 573210359 570633113
524.2 570633113 570005178 570476115 570811510 570959806 572473049 576562345 582164705 587097049 590493679
$$ packed form
399.8F36684656m184782m671872j741946J968265K290189k28226j152217M13239J885831
418.1F31263137Q22604j999498k873778j092017j04308k312660m578471l540338k74956
436.5F15309715J800597J631975J373530L062605N316020M918634J660228j001000
452.8F34072304m99964J455545J170457j853287l661514k425074q13961j721621m110098
471.2F21612787m737854k250612J18435k48373j954674k079249n9187J484930M88937
489.5F12375140j637459k119243p70449l6300j219570l051281l264487j886129j305640
507.9E97084582k550483m145145m166425k967357k599955l544628l900230k577246
524.2E70633113o27935M70937L35395J48296J513243M089296N602360M932344L396630
$$ plain form
542.5 590493679 593117476 595457852 596601307 595675826 593369782 591136336 589294672 586685479 582416654
560.9 582416654 577041268 571743131 566678226 561126530 555437446 551408648 550563216 552854300 556852698
579.3 556852698 561428964 566864729 573574483 580385447 585146964 587261856 588220954 589418292 590583682
597.6 590583682 590655327 589650631 588841677 589147747 590168655 590909958 591274858 592301309 594743013
616 594743013 598073065 601096928 603662431 606813371 610915244 614832401 617312372 618638635 620285094
634.3 620285094 622816503 625088513 626000404 626066566 626782119 628624678 630390644 630886018 630769610
652.7 630769610 631643653 633607209 635203481 635547817 635475397 636089146 637682259 639591396 640340030
671 640340030 640828967 642420948 645011485 647005856 647506237 647594392 648762941 650704145 651656508
$$ packed form
542.5E90493679K623797K340376J143455r25481k306044k233446j841664k609193m268825
560.9E82416654n375386n298137n064905n551696n689084m028798q45432K291084L998398
579.3E56852698M576266N435765O709754O810964M761517K114892R59098J197338J165390
597.6E90583682P1645j004696q08954L06070J020908P41303L64900J026451K441704
616E94743013L330052L023863K565503L150940M101873L917157K479971J326263J646459
634.3F20285094K531409K272010R11891O6162P15553J842559J765966M95374j16408
652.7F30769610Q74043J963556J596272L44336p2420O13749J593113J909137P48634
671F40340030M88937J591981K590537J994371N00381Q8155J168549J941204R52363
$$ plain form
689.4 651656508 650787830 649241865 648396850 647803009 645839572 642184258 638591886 636950850 637147665
707.7 637147665 637603641 637768149 638982356 642585218 647879958 652909517 656845748 660916030 666468263
726.1 666468263 672678232 677360296 679834306 681737661 684738636 688128173 689665854 688623071
742.4 688623071 686716437 685613990 684572279 681487322 676125765 670731962 667153120 664692998
758.7 664692998 661511958 657614946 655309737 656542301 660627067 665313423 669671416 675035357
775.1 675035357 682778955 691688538 698829234 703200996 706914246 712005794 717629075 721407056
791.4 721407056 722925186 724631608 728713274 734116733 737912893 739161551 740042567 742730200 746203542
809.7 746203542 747643411 746510386 745382011 746381581 748345673 748402178 745736539 742531478 740803540
$$ packed form
689.4F51656508q68678j545965q45015n93841j963437l655314l592372j641036J96815
707.7F37147665M55976J64508J214207L602862N294740N029559L936231M070282N552233
726.1F66468263O209969M682064K474010J903355L000975L389537J537681j042783
742.4F88623071j906634j102447j041711l084957n361557n393803l578842k460122
758.7F64692998l181040l897012k305209J232564M084766M686356M357993N363941
775.1F75035357P743598Q909583P140696M371762L713250N091548N623281L777981
791.4G21407056J518130J706422M081666N403459L796160J248658Q81016K687633L473342
809.7G46203542J439869j133025j128375R99570J964092N6505k665639l205061j727938
$$ plain form
828.1 740803540 739490926 735877633 729606748 723437130 719621658 717184663 713596642 708350837
844.4 708350837 703596354 701099932 699745059 696831584 691633165 686333179 683372498 683346331 685472846
862.8 685472846 689354062 695884109 705772221 717261612 726737440 732224464 735196412 737811983
879.1 737811983 739387035 737478852 731793165 725184262 720393479 716931105 712441087 706370413
895.4 706370413 700680614 697058260 694453657 690236807 683510959 675941110 669219077 662770629
911.7 662770629 654713929 644794106 635256827 628503561 624645472 621915400 619236112 617522717
928 617522717 618095994 620614767 623293459 625183821 627475858 631720662 637135148 640592635 639681339
946.4 639681339 634892285 627970874 619283974 607950091 593925536 578813016 564142406 549647152
$$ packed form
828.1G40803540j312614l613293o270885o169618l815472k436995l588021n245805
844.4G08350837m754483k496422j354873k913475n198419n299986k960681k6167K126515
862.8F85472846L881216O530047R888112J1489391R475828N487024K971948K615571
879.1G37811983J575052j908183n685687o608903m790783l462374m490018o070674
895.4G06370413n689799l622354k604603m216850o725848p569849o722033o448448
911.7F62770629q056700r919823r537279o753266l858089k730072k679288j713395
928F17522717N73277K518773K678692J890362K292037M244804N414486L457487r11296
946.4F39681339m789054o921411q686900j1333883j4024555j5112520j4670610j4495254
$$ plain form
962.7 549647152 533974528 516639709 498620003 480999082 463795722 446461231 429136962
977 429136962 413029164 399419576 388643533 380223095 373703957 369149506 366810888 366374671
993.3 366374671 366907924 367607594 368415087 369675815 371266574 372409284 372477174 371743739 371086657
1011.6 371086657 371119171 371714771 372522175 373679399 375706017 378843307 382670045 386421055 389747173
1030 389747173 393011034 396446258 399422407 401121050 401650727 401986152 402932048 404412925 405990988
1048.4 405990988 407954484 411323756 416726261 423712850 431351721 439322054 448139787 457765907
1064.7 457765907 465990514 468993753 464639395 455125600 445220739 438177586 434349090 432967305
1081 432967305 433734626 436642110 441139102 446261972 451473922 456880510 462557375 467824578 471519768
$$ packed form
962.7E49647152j5672624j7334819j8019706j7620921j7203360j7334491j7324269
977D29136962j6107798j3609588j0776043q420438o519138m554451k338618m36217
993.3C66374671N33253O99670Q07493J260728J590759J142710O7890p33435o57082
1011.6C71086657L2514N95600Q07404J157224K026618L137290L826738L751010L326118
1030C89747173L263861L435224K976149J698643N29677L35425R45896J480877J578063
1048.4D05990988J963496L369272N402505O986589P638871P970333Q817733R626120
1064.7D57765907Q224607L003239m354358r513795r904861p043153l828496j381785
1081D32967305P67321K907484M496992N122870N211950N406588N676865N267203L695190
$$ plain form
1099.4 471519768 473141313 473569125 474387616 476481885 479508400 482761860 486118197 489815772 493581682
1117.7 493581682 496522129 498162836 499260902 501171947 504523277 508761823 512753963 515651166
1134 515651166 517023861 516291022 512762308 506521463 498794168 491165549 484574378 478995919 474162132
1152.4 474162132 470375597 468279511 468103766 469424754 471807659 475522041 481319159 489508957
1168.7 489508957 499502033 510351002 521607876 533433080 545919418 558484614 570153713
1183 570153713 580516756 589925945 598582149 605886102 611070395 614245474 616430044 618567824
1199.3 618567824 620732784 622466564 623851240 625781059 628978074 633141160 637362659 641165733
1215.6 641165733 644750834 648262680 651126742 652504861 652321041 651399612 650549293 649747014 648453176
$$ packed form
1099.4D71519768J621545M27812Q18491K094269L026515L253460L356337L697575L765910
1117.7D93581682K940447J640707J098066J911045L351330M238546L992140K897203
1134E15651166J372695p32839l528714o240845p727295p628619o591171n578459m833787
1152.4D74162132l786535k096086j75745J320988K382905L714382N797118Q189798
1168.7D89508957R993076J0848969J1256874J1825204J2486338J2565196J1669099
1183E70153713J0363043R409189Q656204P303953N184293L175079K184570K137780
1199.3F18567824K164960J733780J384676J929819L197015M163086M221499L803074
1215.6F41165733L585101L511846K864062J378119j83820r21429q50319q02279j293838
$$ plain form
1234 648453176 646617115 644941628 644061506 643888652 643958926 644172490 644971848 646685421 648892403
1252.3 648892403 650763869 651931763 652764738 653811395 655113339 656292498 657298386 658622026
1268.6 658622026 660569608 662650704 664001405 664305806 664044201 663816094 663641274 663135231 662195802
1287 662195802 661193132 660412788 659607589 658309400 656422436 654372454 652630389 651200891 649685681
1305.4 649685681 647870541 646095932 644785225 643869460 642912686 641629636 640147030 638586819 636545300
1323.7 636545300 633437514 629224062 624514222 620049536 616224051 613043427 610505342 608968139
1340 608968139 608659863 609062076 609508693 609651148 609518826 609334528 609079003 608548164 607644439 606456876
1360.4 606456876 605342686 604717731 604349315 603961408 603784919 604036272 604808688 605813980 606632233
$$ packed form
1234F48453176j836061j675487q80122j72854P0274K13564P99358J713573K206982
1252.3F48892403J871466J167894Q32975J046657J301944J179159J005888J323640
1268.6F58622026J947582K081096J350701L04401k61605k28107j74820n06043r39429
1287F62195802j002670p80344q05199j298189j886964k049982j742065j429498j515210
1305.4F49685681j815140j774609j310707r15765r56774j283050j482606j560211k041519
1323.7F36545300l107786m213452m709840m464686l825485l180624k538085j537203
1340F08968139l08276M02213M46617J42455j32322j84298k55525n30839r03725j187563
1360.4F06456876j114190o24955l68416l87907j76489K51353P72416J005292Q18253
$$ plain form
1378.8 606632233 607316554 608335912 610280991 613492489 617172897 619984984 621686578 622485578 622496426
1397.1 622496426 621901035 621081412 620059967 618702769 617189348 615532935 613828421 612361729 611080110
1415.5 611080110 609728217 608722150 608627021 609064221 609766304 610587656 611512840 612725973 614048481
1433.9 614048481 615471363 617280126 619065225 620593309 621804953 622481167 622470260 621888697 620907187
1452.2 620907187 619511068 617356956 615551889 615563750 616412401 618137419 621212244 624989867 629537046
1470.6 629537046 636295557 644537389 652214766 658979237 665117681 670978904 676273167 681017637
1486.9 681017637 685729563 690600872 694783390 698340714 702019751 705618858 708576083 710720241
1503.2 710720241 712412775 715015829 718274474 720809162 722758889 724476278 726301193 727936447
$$ packed form
1378.8F06632233O84321J019358J945079L211498L680408K812087J701594P99000J0848
1397.1F22496426n95391q19623j021445j357198j513421j656413j704514j466692j281619
1415.5F11080110j351893j006067r5129M37200P02083Q21352R25184J213133J322508
1433.9F14048481J422882J808763J785099J528084J211644O76214j0907n81563r81510
1452.2F20907187j396119k154112j805067J1861Q48651J725018L074825L777623M547179
1470.6F29537046O758511Q241832P677377O764471O138444N861223N294263M744470
1486.9F81017637M711926M871309M182518L557324L679037L599107K957225K144158
1503.2G10720241J692534K603054L258645K534688J949727J717389J824915J635254
$$ plain form
1519.5 727936447 729467750 731380105 733443975 735533416 737179637 738108933 738990784 740213454 740942240
1537.9 740942240 741058886 741664112 742931306 744317889 745270491 745568395 745405674 744949222 744155943
1556.2 744155943 742938042 742603958 742917359 742515981 741633415 740483284 739158452 737936378 736260056
1574.6 736260056 734285474 733138740 732037187 730235338 728219092 726437569 724820077 723023653
1590.9 723023653 720877707 718623817 716672778 714948714 712938368 710511565 708032906 705741763
1607.2 705741763 703493536 701084733 698329389 694901705 691441774 689310610 687276006 684388161
1623.5 684388161 681604266 679336071 677559316 676213503 674616396 672862589 672595918 673365355 674057901
1641.9 674057901 674303949 674450219 675710499 677489460 679128706 681912661 685047507 687770367 690591931
$$ packed form
1519.5G27936447J531303J912355K063870K089441J646221R29296Q81851J222670P28786
1537.9G40942240J16646O05226J267194J386583R52602K97904j62721m56452p93279
1556.2G44155943j217901l34084L13401m01378q82566j150131j324832j222074j676322
1574.6G36260056j974582j146734j101553j801849k016246j781523j617492j796424
1590.9G23023653k145946k253890j951039j724064k010346k426803k478659k291143
1607.2G05741763k248227k408803k755344l427684l459931k131164k034604k887845
1623.5F84388161k783895k268195j776755j345813j597107j753807k66671P69437O92546
1641.9F74057901K46048J46270J260280J778961J639246K783955L134846K722860K821564
$$ plain form
1660.3 690591931 693825126 697163582 699869931 702596545 706406355 710332513 713968873 717764199
1676.6 717764199 721392930 724711478 728056371 732484877 736916423 740604997 744321883 747497439
1692.9 747497439 749935031 752043843 754351497 757645667 760626376 762569726 764223397 765905917
1709.2 765905917 767569780 768953264 769769371 770588756 772324085 774382949 776192605 777630508 778534353
1727.6 778534353 779172957 779932559 781210423 783018827 784395695 785527170 787131727 789049685 790640950
1745.9 790640950 791763425 793175042 795516014 797923386 799719632 801049650 802251637 803887784
1762.2 803887784 805831909 807221830 807832479 808151066 809088945 810829937 812275469 812961400 813394547
1780.6 813394547 814216495 815385520 816382825 816745043 816661358 817176461 818465948 819467962 819790840
$$ packed form
1660.3F90591931L233195L338456K706349K726614L809810L926158L636360L795326
1676.6G17764199L628731L318548L344893M428506M431546L688574L716886L175556
1692.9G47497439K437592K108812K307654L294170K980709J943350J653671J682520
1709.2G65905917J663863J383484Q16107Q19385J735329K058864J809656J437903R03845
1727.6G78534353O38604P59602J277864J808404J376868J131475J604557J917958J591265
1745.9G90640950J122475J411617K340972K407372J796246J330018J201987J636147
1762.2H03887784J944125J389921O10649L18587R37879J740992J445532O85931M33147
1780.6H13394547Q21948J169025R97305L62218q3685N15103J289487J002014L22878
$$ plain form
1799 819790840 820020914 820850909 822005868 822803736 823029518 823160887 823763669 824704826 825443864 825722396
1819.4 825722396 825749040 825935245 826509178 827032983 827136993 827350378 827979386 828707874 829249799 829344273
1839.8 829344273 828992128 828794777 829395533 830167592 830417037 830329537 830431044 830880046 831264377 831255317
1860.2 831255317 831055164 831028521 831154346 831279278 831460118 831651151 831905723 832401514 832909524 833037257
1880.5 833037257 832906604 832984746 833383143 833772063 833917439 833858252 833916426 834381938 834904134 834998667
1900.9 834998667 834762752 834679067 834943295 835270524 835343301 835172296 835008979 835120082 835455894 835546613
1921.3 835546613 835381806 835458338 835866034 836267829 836353779 836148083 836033821 836269081 836551964 836475313
1941.7 836475313 836236656 836303949 836731374 837201655 837342322 837159276 837082624 837392092 837830722 837975442
$$ packed form
1799H19790840K30074Q29995J154959P97868K25782J31369O02782R41157P39038K78532
1819.4H25722396K6644J86205N73933N23805J04010K13385O29008P28488N41925R4474
1839.8H29344273l52145j97351O00756P72059K49445q7500J01507M49002L84331r060
1860.2H31255317k00153k6643J25825J24932J80840J91033K54572M95791N08010J27733
1880.5H33037257j30653P8142L98397L88920J45376n9187N8174M65512N22196R4533
1900.9H34998667k35915q3685K64228L27229P2777j71005j63317J11103L35812R0719
1921.3H35546613j64807P6532M07696M01795Q5950k05696j14262K35260K82883p6651
1941.7H36475313k38657O7293M27425M70281J40667j83046p6652L09468M38630J44720
$$ plain form
1962.1 837975442 837767661 837593138 837852120 838326573 838499427 838333011 838222027 838428259 838763893 838875771
1982.5 838875771 838688135 838481128 838532865 838746369 838864625 838791132 838633478 838663161 838890731 838959396
2002.9 838959396 838715613 838408887 838341713 838447094 838366330 837925196 837375820 837055683 836886168 836494207
2023.3 836494207 835859179 835471988 835533917 835705638 835639894 835272551 834822118 834547162 834481835 834383786
2043.7 834383786 834059596 833670080 833514512 833614826 833695889 833560824 833320200 833242893 833396196 833562255
2064.1 833562255 833568335 833505630 833562315 833775163 833958507 833924770 833752513 833727777 833968997 834210038 834183812
2086.6 834183812 834018350 834033847 834302843 834581196 834643364 834568262 834615171 834868073 835130334 835197389
2106.9 835197389 835118353 835111916 835298598 835535347 835596442 835485339 835421920 835538805 835710406 835721374 835563719
$$ packed form
1962.1H37975442k07781j74523K58982M74453J72854j66416j10984K06232L35634J11878
1982.5H38875771j87636k07007N1737K13504J18256p3493j57654K9683K27570O8665
2002.9H38959396k43783l06726o7174J05381q0764m41134n49376l20137j69515l91961
2023.3H36494207o35028l87191O1929J71721o5744l67343m50433k74956o5327r8049
2043.7H34383786l24190l89516j55568J00314Q1063j35065k40624p7307J53303J66059
2064.1H33562255O080o2705N6685K12848J83344l3737j72257k4736K41220K41041k6226
2086.6H34183812j65462J5497K68996K78353O2168p5102M6909K52902K62261O7055
2106.9H35197389p9036o437J86682K36749O1095j11103o3419J16885J71601J0968j57655
$$ plain form
2129.4 835563719 835460126 835533917 835681379 835732400 835641026 835553050 835627437 835804224 835878968 835803270 835741341
2151.8 835741341 835863650 836120903 836318374 836395144 836461186 836659193 836997628 837297201 837477326 837697506
2172.2 837697506 838063419 838514626 838914394 839164853 839333117 839593410 839997411 840385914 840646207 840848684
2192.6 840848684 841112375 841477334 841850579 842101812 842249095 842457473 842793822 843145192 843408287 843602717
2213 843602717 843808293 844079971 844366670 844580889 844727755 844892681 845159173 845466256 845661521 845731080
2233.4 845731080 845796824 845957279 846187353 846347511 846397996 846465051 846596897 846743882 846891761 846996725
2253.8 846996725 847041428 847148478 847375751 847586215 847666979 847696483 847796559 847992063 848208010 848310471
2274.2 848310471 848322034 848418951 848631442 848853111 848985553 848994613 848979652 849053025 849191129 849272847 849228978
$$ packed form
2129.4H35563719j03593P3791J47462N1021r1374q7976P4387J76787P4744p5698o1929
2151.8H35741341J22309K57253J97471P6770O6042J98007L38435K99573J80125K20180
2172.2H37697506L65913M51207L99768K50459J68264K60293M04001L88503K60293K02477
2192.6H40848684K63691L64959L73245K51233J47283K08378L36349L51370K63095J94430
2213H43602717K05576K71678K86699K14219J46866J64926K66492L07083J95265O9559
2233.4H45731080O5744J60455K30074J60158N0485O7055J31846J46985J47879J04964
2253.8H46996725M4703J07050K27273K10464Q0764K9504J00076J95504K15947J02461
2274.2H48310471J1563R6917K12491K21669J32442R060j4961P3373J38104Q1718m3869
$$ plain form
2296.6 849228978 849155486 849177361 849284649 849356532 849308670 849221408 849221468 849311888 849360228 849225819 848983943
2319.1 848983943 848887980 848972082 849033713 848979175 848796725 848520756 848287225 848097622 847860813 847607374
2339.5 847607374 847403169 847307801 847364843 847441733 847368777 847206891 847117245 847003698 846719563 846427262
2359.9 846427262 846250832 846131563 846060038 845986426 845804572 845625103 845618844 845722914 845763922 845717788 845671833
2382.3 845671833 845668852 845695734 845649660 845432043 845155001 844977081 844883859 844742358 844465494 844155729
2402.7 844155729 843976080 843896210 843719780 843340874 842859149 842473209 842243671 842003465 841584802 841064990
2423.1 841064990 840678394 840460181 840192318 839731812 839169800 838688195 838366508 838050067 837536991 836904645
2443.5 836904645 836397111 836093783 835818827 835370600 834775805 834265709 833968639 833702266 833242834 832640469
$$ packed form
2296.6H49228978p3492K1875J07288P1883m7862q7262O0R0420M8340j34409k41876
2319.1H48983943r5963Q4102O1631n4538j82450k75969k33531j89603k36809k53439
2339.5H47607374k04205r5368N7042P6890p2956j61886q9646j13547k84135k92301
2359.9H46427262j76430j19269p1525p3612j81854j79469o259J04070M1008m6134m5955
2382.3H45671833k981K6882m6074k17617k77042j77920r3222j41501k76864l09765
2402.7H44155729j79649p9870j76430l78906m81725l85940k29538k40206m18663n19812
2423.1H41064990l86596k18213k67863m60506n62012m81605l21687l16441n13076o32346
2443.5H36904645n07534l03328k74956m48227n94795n10096k97070k66373m59432o02365
$$ plain form
2463.9 832640469 832142591 831898212 831752479 831407845 830839634 830331445 830051005 829841018 829451382 828881919
2484.3 828881919 828411877 828222215 828164160 827943861 827476978 827022552 826818347 826764762 826605678 826236606
2504.7 826236606 825825393 825623930 825612009 825496793 825115681 824653447 824361265 824190140 823899865 823428750
2525.1 823428750 822939038 822583318 822341383 822025061 821462989 820792377 820305467 819999695 819617033 819033384
2545.5 819033384 818391681 817917585 817670286 817402601 816858232 816161990 815607786 815256774 814920783 814415693
2565.8 814415693 813780844 813268602 813005388 812757611 812264025 811607718 811085582 810795009 810519338 810062826
2586.2 810062826 809498012 809076250 808909714 808792353 808474660 807962716 807473898 807175577 806963325 806576967
2606.6 806576967 805975199 805404961 805024147 804669976 804085076 803265452 802456617 801831067 801276147 800539970
$$ packed form
2463.9H32640469m97878k44379j45733l44634n68211n08189k80440k09987l89636n69463
2484.3H28881919m70042j89662n8055k20299m66883m54426k04205n3585j59084l69072
2504.7H26236606m11213k01463j1921j15216l81112m62234k92182j71125k90275m71115
2525.1H23428750m89712l55720k41935l16322n62072o70612m86910l05772l82662n83649
2545.5H19033384o41703m74096k47299k67685n44369o96242n54204l51012l35991n05090
2565.8H14415693o34849n12242k63214k47777m93586o56307n22136k90573k75671m56512
2586.2H10062826n64814m21762j66536j17361l17693n11944m88818k98321k12252l86358
2606.6H06576967o01768n70238l80814l54171n84900q19624q08835o25550n54920p36177
$$ plain form
2627 800539970 799589694 798642039 797874689 797229350 796445906 795430779 794415057 793592632 792878151 792059422
2647.4 792059422 791082919 790120721 789361477 788748324 788018823 787064016 786071599 785283685 784679413 784000874
2667.8 784000874 783136487 782287240 781637430 781109333 780514777 779754341 778918922 778214157 777693450 777125835
2688.2 777125835 776330411 775479972 774817944 774303615 773670554 772777021 771798491 770947397 770205915 769434929
2708.6 769434929 768535435 767582834 766766310 766115248 765469909 764691293 763832390 763087451 762516499 761928022
2729 761928022 761176884 760401011 759816945 759407461 758963943 758367121 757685959 757080615 756607831 756143868
2749.4 756143868 755545378 754859686 754306436 753961086 753651679 753200829 752619624 752093911 751704931 751293123
2769.8 751293123 750719130 750048757 749437809 748902380 748302460 747525096 746620655 745778799 745063782 744292080
$$ packed form
2627H00539970r50276r47655p67350o45339p83444j015127j015722q22425p14481q18729
2647.4G92059422r76503r62198p59244o13153p29501r54807r92417p87914o04272o78539
2667.8G84000874q64387q49247o49810n28097n94556p60436q35419p04765n20707n67615
2688.2G77125835p95424q50439o62028n14329o33061q93533r78530q51094p41482p70986
2708.6G69434929q99494r52601q16524o51062o45339p78616q58903p44939n70952n88477
2729G61928022p51138p75873n84066m09484m43518n96822o81162o05344m72784m63963
2749.4G56143868n98490o85692n53250l45350l09407m50850n81205n25713l88980m11808
2769.8G51293123n73993o70373o10948n35429n99920p77364r04441q41856p15017p71702
$$ plain form
2790.2 744292080 743291676 742156208 741084099 740058839 738917232 737621307 736239791 734855831
2806.5 734855831 733542979 732233226 730755329 729069412 727358580 725780427 724220276 722484767
2822.8 722484767 720569670 718602002 716659367 714730799 712745965 710637927 708440542 706171453
2839.1 706171453 703745782 701098323 698246777 695302546 692379296 689571619 686964095 684517622
2855.5 684517622 682174265 679882586 677424788 674569905 671283305 667626560 663692653 659585297
2871.8 659585297 655316949 650934219 646696687 642883182 639577091 636763155 634448051 632679522
2888.1 632679522 631464601 630700946 630223274 629805326 629288673 628685176 627972484 627046764 625870585
2906.5 625870585 624457538 622793794 620790243 618311226 615383208 612274945 609227896 606395125
$$ packed form
2790.2G44292080j000404j135468j072109j025260j141607j295925j381516j383960
2806.5G34855831j312852j309753j477897j685917j710832j578153j560151j735509
2822.8G22484767j915097j967668j942635j928568j984834k108038k197385k269089
2839.1G06171453k425671k647459k851546k944231k923250k807677k607524k446473
2855.5F84517622k343357k291679k457798k854883l286600l656745l933907m107356
2871.8F59585297m268348m382730m237532l813505l306091k813936k315104j768529
2888.1F32679522j214921p63655m77672m17948n16653o03497p12692r25720j176179
2906.5F25870585j413047j663744k003551k479017k928018l108263l047049k832771
$$ plain form
2922.8 606395125 603987575 602220595 601206124 600937545 601453543 602870882 605223715 608420312 612266541
2941.1 612266541 616513550 620950639 625477016 630075276 634715915 639297783 643758357 648160100
2957.4 648160100 652538657 656794012 660761535 664353073 667612255 670674562 673707724 676745474
2973.8 676745474 679699659 682587028 685412467 688026011 690355599 692466855 694401383 696194410
2990.1 696194410 697794378 699070990 700084329 700888276 701415062 701723397 701826215 701671004 701385617
3008.4 701385617 701065183 700567484 699730873 698543429 697139621 695694625 694254756 692723513 691058755
3026.8 691058755 689336658 687632143 685972929 684198380 682184994 680172384 678310990 676422477
3043.1 676422477 674344778 672115266 669896722 667731464 665536404 663294137 660992086 658650815
$$ packed form
2922.8F06395125k407550j766980j014471k68579N15998J417339K352833L196597L846229
2941.1F12266541M247009M437089M526377M598260M640639M581868M460574M401743
2957.4F48160100M378557M255355L967523L591538L259182L062307L033162L037750
2973.8F76745474K954185K887369K825439K613544K329588K111256J934528J793027
2990.1F96194410J599968J276612J013339Q03947N26786L08335J02818j55211k85387
3008.4G01385617l20434m97699q36611j187444j403808j444996j439869j531243j664758
3026.8F91058755j722097j704515j659214j774549k013386k012610j861394j888513
3043.1F76422477k077699k229512k218544k165258k195060k242267k302051k341271
$$ plain form
3059.4 658650815 656404138 654308081 652257323 650067508 647674084 645282567 643091977 641063988
3075.7 641063988 639009714 636768401 634402394 632060051 629735231 627406538 625070393 622649968
3092.1 622649968 620213866 617927134 615760922 613525212 611169815 608900249 606833637 604771376
3108.4 604771376 602489829 600206733 598228097 596335411 594212115 591831505 589314699 586875141
3124.7 586875141 584644437 582525074 580347359 578124642 576051116 574188113 572288930 570085168
3141 570085168 567730427 565561712 563601613 561768115 560015142 558120668 555977881 553830385 551833332
3159.4 551833332 549911439 547993362 546105564 544292748 542483151 540643156 538848102 537136495
3175.7 537136495 535452187 533730209 531986237 530261397 528573394 526924074 525286436 523634493
$$ packed form
3059.4F58650815k246677k096057k050758k189815k393424k391517k190590k027989
3075.7F41063988k054274k241313k366007k342343k324820k328693k336145k420425
3092.1F22649968k436102k286732k166212k235710k355397k269566k066612k062261
3108.4F04771376k281547k283096j978636j892686k123296k380610k516806k439558
3124.7E86875141k230704k119363k177715k222717k073526j863003j899183k203762
3141E70085168k354741k168715j960099j833498j752973j894474k142787k147496j997053
3159.4E51833332j921893j918077j887798j812816j809597j839995j795054j711607
3175.7E37136495j684308j721978j743972j724840j688003j649320j637638j651943
$$ plain form
3192 523634493 522006035 520447612 518941879 517447352 515964866 514509618 513069093 511622310 510188460
3210.3 510188460 508804142 507464468 506149769 504828393 503483534 502127469 500802040 499585062
3226.7 499585062 498493940 497496933 496504396 495300442 493901074 492590338 491444737 490400016 489448249
3245 489448249 488484293 487356365 486182004 485222459 484418660 483529836 482595086 481752425 480938822 480086505
3265.4 480086505 479332954 478790998 478194356 477307916 476289332 475339741 474528551 473802000 473053694
3283.8 473053694 472270668 471558958 471007526 470499426 469846398 469011545 468071312 467204988 466571093 466097295
3304.2 466097295 465515256 464619279 463472813 462304831 461273193 460333884 459400952 458505929 457731813
3322.5 457731813 457000583 456043422 454877764 453800023 452867955 452025294 451271564 450414181 449327976
$$ packed form
3192E23634493j628458j558423j505733j494527j482486j455248j440525j446783j433850
3210.3E10188460j384318j339674j314699j321376j344859j356065j325429j216978
3226.7D99585062j091122r97007r92537j203954j399368j310736j145601j044721r51767
3245D89448249r63956j127928j174361r59545q03799q88824r34750q42661q13603q52317
3265.4D80086505p53551n41956n96642q86440j018584r49591q11190p26551p48306
3283.8D73053694p83026p11710n51432n08100o53028q34853r40233q66324o33895m73798
3304.2D66097295n82039q95977j146466j167982j031638r39309r32932q95023p74116
3322.5D57731813p31230r57161j165658j077741r32068q42661p53730q57383j086205
$$ plain form
3340.9 449327976 448164642 446988046 445916653 445117384 444262981 443003774 441639066 440545321 439633071
3359.2 439633071 438648790 437638372 436865926 436222762 435268998 433895767 432507694 431438893 430566132
3377.6 430566132 429660797 428682864 427809417 427150309 426699638 426491320 426219672 425532281 424736798 424361914
3398 424361914 424281687 423810124 422863036 422137409 421858341 421661437 421354175 420899630 420347035 419931263
3418.4 419931263 419734716 419618070 419567227 419680446 419907361 420076668 420298755 420701176 420924336 420715928
3438.8 420715928 420437425 420476258 420823276 421264499 421659887 422083795 422580630 423142314 423820466 424572825
3459.2 424572825 425227016 425899148 426910907 428084105 428864062 429140121 429419428 430050403 430990160
3477.5 430990160 431954771 432642847 433302909 434233785 435155779 435930640 436791271 437785834 438856691
$$ packed form
3340.9D49327976j163334j176596j071393p99269q54403j259207j364708j093745r12250
3359.2D39633071r84281j010418p72446o43164r53764j373231j388073j068801q72761
3377.6D30566132r05335r77933q73447o59108m50671k08318k71648o87391p95483l74884
3398D24361914q0227m71563r47088p25627k79068j96904l07262m54545n52595m15772
3418.4D19931263j96547j16646n0843J13219K26915J69307K22087M02421K23160k08408
3438.8D20715928k78503L8833L47018M41223L95388M23908M96835N61684O78152P52359
3459.2D24572825O54191O72132J011759J173198P79957K76059K79307O30975R39757
3477.5D30990160R64611O88076O60062R30876R21994P74861Q60631R94563J070857
$$ plain form
3495.9 438856691 439902395 440892577 441920847 442857057 443616241 444441736 445564806 446958423 448249519
3514.2 448249519 449223071 450143933 451271564 452625304 453898430 454889208 455910534 457199275 458635271
3532.6 458635271 460143626 461612105 462933153 464344114 465960741 467524469 468832314 470131218
3548.9 470131218 471639216 473258913 474948376 476777107 478757799 480711043 482332379 483770281
3565.2 483770281 485879242 488748282 491491199 493924230 496344239 498897910 501686633 504671931
3581.5 504671931 507537782 510094881 512740731 515896618 519066930 522056878 525266230 528777242
3597.9 528777242 532267451 535623729 538818955 541753411 544753790 548080206 551526725 555006981
3614.2 555006981 558339000 561650097 565502346 569421530 572648883 575167120 577899814 581696630
$$ packed form
3495.9D38856691J045704R90182J028270R36210P59184Q25495J123070J393617J291096
3514.2D48249519R73552R20862J127631J353740J273126R90778J021326J288741J435996
3532.6D58635271J508355J468479J321048J410961J616627J563728J307845J298904
3548.9D70131218J507998J619697J689463J828731J980692J953244J621336J437902
3565.2D83770281K108961K869040K742917K433031K420009K553671K788723K985298
3581.5E04671931K865851K557099K645850L155887L170312K989948L209352L511012
3597.9E28777242L490209L356278L195226K934456L000379L326416L446519L480256
3614.2E55006981L332019L311097L852249L919184L227353K518237K732694L796816
$$ plain form
3630.5 581696630 585555017 589113057 592541695 595794380 598901272 601825833 604377568 606593013
3646.8 606593013 609352410 613212407 616854668 619896889 623223424 626773775 629759729 632231057
3663.1 632231057 634516239 636429608 638128102 640343010 642538190 644517958 647191942 650147974
3679.4 650147974 652831018 655188799 657171488 658873856 660553455 662581563 664884567 667048693
3695.8 667048693 668802679 670136511 671424508 673014939 674552321 675584137 676260948 677471697
3712.1 677471697 679485798 681357205 682631493 683516562 684366047 685339928 686536789 687875152 688831985
3730.4 688831985 689196169 689627767 690973639 692715108 693786323 693905234 694004655 694869816 695499301
3748.8 695499301 696070075 697604418 699360192 700542927 701426625 702512860 703495324 704108715 704636395
$$ packed form
3630.5E81696630L858387L558040L428638L252685L106892K924561K551735K215445
3646.8F06593013K759397L859997L642261L042221L326535L550351K985954K471328
3663.1F32231057K285182J913369J698494K214908K195180J979768K673984K956032
3679.4F50147974K683044K357781J982689J702368J679599K028108K303004K164126
3695.8F67048693J753986J333832J287997J590431J537382J031816O76811J210749
3712.1F77471697K014101J871407J274288Q85069Q49485R73881J196861J338363R56833
3730.4F88831985L64184M31598J345872J741469J071215J18911R9421Q65161O29485
3748.8F95499301N70774J534343J755774J182735Q83698J086235R82464O13391N27680
$$ plain form
3767.1 704636395 705274165 706234336 707428277 708388686 709009230 709554970 710223854 710873365 711526573
3785.5 711526573 712307036 713074863 713705957 714105129 714335620 714589298 714679122 714928210 715767264 716528535
3805.9 716528535 717340410 718429863 719197392 719319880 719251335 719504297 719741642 720364690 721428692
3824.3 721428692 722168267 722619951 722976506 723288774 723600090 723663867 723677516 724225283 725170553 726247847
3844.6 726247847 727136254 727393448 726710796 725517333 725935698 727693558 728908777 729226351 729134679
3863 729134679 729345798 729732871 729820788 730065703 730730534 731502593 732010305 732054353 732269764 732806265
3883.4 732806265 733232021 733673275 733930945 734035552 734475315 734937966 734955370 734680355 734499991 734749138
3903.8 734749138 735575497 736500204 737051070 737258255 737255454 737175643 737276554 737576127 737815022 737960935
$$ packed form
3767.1G04636395O37770R60171J193941R60409O20544N45740O68884O49511O53208
3785.5G11526573P80463P67827O31094L99172K30491K53678Q9824K49088Q39054P61271
3805.9G16528535Q11875J089453P67529J22488o8545K52962K37345O23048J064002
3824.3G21428692P39575M51684L56555L12268L11316O3777J3649N47767R45270J077294
3844.6G26247847Q88407K57194o82652j193463M18365J757860J215219L17574r1672
3863G29134679K11119L87073Q7917K44915O64831P72059N07712M4048K15411N36501
3883.4G32806265M25756M41254K57670J04607M39763M62651J7404k75015j80364K49147
3903.8G34749138Q26359R24707N50866K07185k801p9811J00911K99573K38895J45913
$$ plain form
3924.2 737960935 738177657 738374949 738411665 738536835 738912344 739248395 739369035 739380538 739469767 739739418
3944.6 739739418 740036547 740219891 740340352 740482986 740689695 740913808 741102457 741286039 741539240 741786718
3965 741786718 741867304 741854727 741901696 742026150 742194891 742362440 742531240 742751539 742987871 743152380
3985.4 743152380 743233383 743297517 743355513 743366838 743400156 743534565
3997.6 743534565
$$ packed form
3924.2G37960935K16722J97292L6716J25170L75509L36051J20640J1503Q9229K69651
3944.6G39739418K97129J83344J20461J42634K06709K24113J88649J83582K53201K47478
3965G41786718Q0586j2577M6969J24454J68741J67549J68800K20299K36332J64509
3985.4G43152380Q1003O4134N7996J1325L3318J34409
3997.6G43534565
##END=$$ End of the data block
