##TITLE=5-5M-18 $$ Begin of the data block
##JCAMP-DX=5.00 $$ ACD/SpecManager v 10.08
##SPECTROMETER/DATA SYSTEM=Alpha
##DATE=02 Jun 2015 08:56:44
##DATA TYPE=INFRARED SPECTRUM
##DATA CLASS=XYDATA
##ORIGIN=
##OWNER=
##NPOINTS=1765
##FIRSTX=399.76428223
##LASTX=3997.64306641
##MAXX=3997.64306641
##MINX=399.76428223
##MAXY=1.00158501
##MINY=0.74485856
##XFACTOR=1.0000000000
##YFACTOR=0.000000010000000
##FIRSTY=1.00000000
##DELTAX=2.03961372
##XUNITS=1/CM
##YUNITS=ARBITRARY UNITS
##XYDATA=(X++(Y..Y))
399.8A00000000j67209N3752j08701k30825k039K641j74195K9737J86562j49095j78826
$$ 100000000 99832791 99886543 99777842 99547017 99544978 99547619 99373424 99403161 99589723 99440628 99261802
422.2I9261802P0346p7689k03854L8129L3808j91647m3136R5445j16241j10370R6053
$$ 99261802 99332148 99254459 99050605 99088734 99122542 98930895 98887759 98983204 98866963 98756593 98852646
444.6I8852646n9491j91116P9602J21849j08766q11R5880j70773j73247R9540Q923
$$ 98852646 98793155 98602039 98681641 98803490 98694724 98693913 98789793 98619020 98445773 98545313 98554236
467.1I8554236j63734P3188J23412j73754r8890J21099l2812j10370J02299O6817j17046
$$ 98554236 98390502 98463690 98587102 98413348 98314458 98435557 98402745 98292375 98394674 98461491 98344445
489.5I8344445J1218Q6480j40011j23239J03683j0342j71619J7964M8548j87808j20062
$$ 98344445 98355663 98442143 98302132 98178893 98282576 98272234 98100615 98118579 98167127 97979319 97859257
511.9I7859257P9740n3263j51926L0618P731j65325l9929P2467j17010j41477N9270
$$ 97859257 97938997 97885734 97733808 97764426 97772157 97606832 97566903 97639370 97522360 97380883 97440153
534.4I7440153k086j59800k4164O5965r1982r6619L5357n7375j51128n698J7953j39600
$$ 97440153 97438067 97278267 97254103 97320068 97228086 97131467 97166824 97109449 96958321 96952623 96970576 96830976
558.9I6830976p1102P6830m7469j36131J9961L4208r6179j1807R0962m2045r2715N3442
$$ 96830976 96759874 96836704 96789235 96653104 96673065 96707273 96611094 96599287 96690249 96648204 96555489 96608931
583.3I6608931L2854r7483K890R9606m2147o4367R3591M7511o6978N6315J06734n2351
$$ 96608931 96641785 96544302 96547192 96646798 96604651 96540284 96633875 96681386 96614408 96670723 96777457 96725106
607.8I6725106k2983J36745N1307o5750N7090J10644O747P6163J88923O0451n305J51825
$$ 96725106 96702123 96838868 96890175 96824425 96881515 96992159 96998906 97075069 97263992 97324443 97319138 97470963
632.3I7470963J37448k6035N2118J73319M8434N168J54120J15311k4378P0947J50174
$$ 97470963 97608411 97582376 97634494 97807813 97856247 97861415 98015535 98130846 98106468 98177415 98327589
654.7I8327589O640j2994J21343O3116j0652J81377K11680r8592l0714J49691P0810
$$ 98327589 98334229 98321235 98442578 98505694 98495042 98676419 98888099 98789507 98758793 98908484 98979294
677.2I8979294k9152Q9907J06293m6235j4097R5749r465p7712N4103N4848q0013k5738
$$ 98979294 98950142 99040049 99146342 99100107 99086010 99181759 99172294 99094582 99148685 99203533 99123520 99097782
701.6I9097782P8899j3524n5272P2176O6095m7344J5587R8610r787n2166O2179M0329
$$ 99097782 99176681 99163157 99107885 99180061 99246156 99198812 99214399 99313009 99303222 99251056 99313235 99353564
726.1I9353564n7894J7929Q1408l1406n1391O4612L0648o7496Q494P0679k2501k6476
$$ 99353564 99295670 99313599 99395007 99363601 99312210 99376822 99407470 99339974 99348468 99419147 99396646 99370170
750.6I9370170P4690K9427m9704L3658O7837l9381k8545P4494K0301n6761K6881N9909
$$ 99370170 99444860 99474287 99424583 99458241 99526078 99486697 99458152 99532646 99552947 99496186 99523067 99582976
775.1I9582976l2961j1218P7522J6588m2027M8536O9135k9522o163P3677O002m2045
$$ 99582976 99550015 99538797 99616319 99632907 99590880 99639416 99708551 99679029 99672866 99746543 99752545 99710500
799.5I9710500N1677O3467k8836M256Q0323J1533l3325N3943N5289l5626j419O4254
$$ 99710500 99762177 99825644 99796808 99801064 99881387 99892920 99859595 99913538 99968827 99933201 99931782 99996036
824I9996036o830m4793L4398K1189n5486p188N7387p427l3831M0096K5332m1926O860
$$ 99996036 99989206 99944413 99978811 100000000 99944514 99937326 99994713 99987286 99953455 99993551 100018883 99976957 99983817
850.5I9983817M7320l0159m4805L3480J0347n2226o532L0046l9506m9233R745k3931
$$ 99983817 100031137 100000978 99956173 99989653 100000000 99947774 99941242 99971288 99931782 99882549 99892294 99868363
875I9868363o6429M595L6556l2735k8133L1930j0997o3831n662K4438l1150j5342M6146
$$ 99868363 99801934 99806529 99843085 99810350 99782217 99814147 99803150 99739319 99733657 99758095 99726945 99711603 99757749
901.5I9757749Q458l1364K3156K8944l9184k3800K5445k2167n3447M351O616m6986
$$ 99757749 99766207 99734843 99757999 99786943 99747759 99723959 99749404 99727237 99673790 99678141 99684757 99637771
926I9637771j7268K9320j8138m7129O967J0884m0161k1625J0103l6395n8543j3334
$$ 99637771 99620503 99649823 99631685 99584556 99591523 99602407 99562246 99540621 99550724 99514329 99455786 99442452
950.5I9442452k4652p7486n6136l0434p4798q2427l4905m6968q5604n4771l1775p7302
$$ 99442452 99417800 99340314 99284178 99253744 99178946 99096519 99061614 99014646 98929042 98874271 98842496 98765194
974.9I8765194q6325m6819o5506r7710o1530m1014p3164o2758k2209l8337o3158l6621
$$ 98765194 98678869 98632050 98566544 98468834 98407304 98366290 98293126 98230368 98208159 98169822 98106664 98070043
999.4I8070043k9260o0981n0390j9586m1753o4194m0221l5584n9504m1175j1170l8081
$$ 98070043 98040783 97979802 97929412 97909826 97868073 97803879 97763658 97728074 97668570 97627395 97616225 97578144
1023.9I7578144o1274l2573k6370n3250m3810k2888l6895l4595l695j4341m5264k4336
$$ 97578144 97516870 97484297 97457927 97404677 97360867 97337979 97301084 97266489 97262794 97248453 97203189 97178853
1048.4I7178853Q869P730J5593L5870J8978o854J0281K6882L010r984M060o116k4694
$$ 97178853 97187722 97195452 97211045 97246915 97265893 97259039 97269320 97296202 97299212 97289228 97293288 97287172 97262478
1074.9I7262478o020J6314J2213J5521K8205J7535P367K6465L6079J7964J0735J4031
$$ 97262478 97256458 97272772 97284985 97300506 97328711 97346246 97353613 97380078 97416157 97434121 97444856 97458887
1099.4I7458887J109r150k825p301k3246j7387M95p27P92K3312K9635J1862N388J9151
$$ 97458887 97459996 97450846 97448021 97440720 97417474 97400087 97400582 97399855 97400647 97423959 97453594 97465456 97470844 97489995
1127.9I7489995M7582Q0204R4468Q0162N4556M6360M6611K6697Q011J2273J0413m375
$$ 97489995 97537577 97617781 97712249 97792411 97846967 97893327 97939938 97966635 97974646 97986919 97997332 97992957
1152.4I7992957p671p773j7792j9562l725R000J1206K5290M8733N8180O1017O8378
$$ 97992957 97985286 97977513 97959721 97940159 97936434 97945434 97956640 97981930 98030663 98088843 98149860 98218238
1176.9I8218238O7330N6702N4419N4478M1712L1376L1024J7416m565o348Q52m005o158
$$ 98218238 98285568 98342270 98396689 98451167 98492879 98524255 98555279 98572695 98568130 98561782 98562634 98558629 98552471
1203.4I8552471N776J1134O974J2284J7375J0342O127R131K039j2189j4204j1861j6129
$$ 98552471 98558247 98569381 98576355 98588639 98606014 98616356 98622483 98631614 98633653 98621464 98607260 98595399 98579270
1229.9I8579270j5849j0050j0657j8662j9324j3393j7369k1136j5235j7094k8265l0976
$$ 98579270 98563421 98553371 98542714 98524052 98504728 98491335 98473966 98452830 98437595 98420501 98392236 98361260
1254.4I8361260k7776l3313l9911l6347l5519m0984l5232k3830j9658r298P904M744
$$ 98361260 98333484 98300171 98260260 98223913 98188394 98147410 98112178 98088348 98068690 98059392 98067296 98072040
1278.8I8072040j4514j8942q804j144N537K2030M0233M6581M5854M0329K4926J1117
$$ 98072040 98057526 98038584 98029780 98028636 98034173 98056203 98096436 98143017 98188871 98229200 98254126 98265243
1303.3I8265243J0198O616n865p582J699O103J0407J8883J9431R257O568J3984O699
$$ 98265243 98275441 98282057 98276192 98268610 98270309 98276412 98286819 98305702 98325133 98334390 98340958 98354942 98361641
1329.8I8361641r185k772J5474R399j8060k8115j8978j6725j3727j1182k0403k0444
$$ 98361641 98352456 98349684 98365158 98374557 98356497 98328382 98309404 98292679 98278952 98267770 98247367 98226923
1354.3I8226923q548L70M303j5270n8866p4529n9432l2020j7190n3203q2731q3637
$$ 98226923 98218375 98218745 98223048 98207778 98148912 98074383 98014951 97982931 97965741 97912538 97829807 97746170
1378.8I7746170j21862j15484M1401J81085J34748P3135Q3667M7052q821k7937m4292
$$ 97746170 97624308 97508824 97550225 97731310 97866058 97939193 98022860 98069912 98061091 98033154 97988862
1401.2I7988862k7651m983j9997l7319l2258k729L6478M9454j9128q6057o8497k2543
$$ 97988862 97961211 97956228 97936231 97898912 97866654 97863925 97900403 97949857 97930729 97844672 97776175 97753632
1425.7I7753632L3355L5095k706M6194Q7022k5153p7575m602L1710L0482J9085j2910
$$ 97753632 97786987 97822082 97819376 97865570 97952592 97927439 97849864 97845262 97876972 97907454 97926539 97913629
1450.2I7913629q011P8911J24686p2175j82271k8813Q4550M2784P0500K06840K03413
$$ 97913629 97905618 97984529 98109215 98037040 97854769 97825956 97910506 97953290 98023790 98230630 98434043
1472.6I8434043K6023m7612k7484j7005Q786P1365J06465N6678l5536m2373L0929M9502
$$ 98434043 98460066 98412454 98384970 98367965 98376751 98448116 98554581 98611259 98575723 98533350 98564279 98613781
1497.1I8613781j6201l6138P4762K31230J03754j82325j48207j913P2581O6733O9147
$$ 98613781 98597580 98561442 98636204 98867434 98971188 98788863 98640656 98638743 98711324 98778057 98847204
1519.5I8847204K6232r0432r3585n8657l8093J9586K1559O991J09065J39058p4071
$$ 98847204 98873436 98783004 98689419 98630762 98592669 98612255 98633814 98640805 98749870 98888928 98814857
1542I8814857k10077j87283q3375j5372q095M9508J73056J37586k36744k96349j30277
$$ 98814857 98604780 98417497 98334122 98318750 98310655 98360163 98533219 98670805 98434061 98137712 98007435
1564.4I8007435n3192k1535p0005j04481m7231r2399k06208k03109j52505j28251j61260
$$ 98007435 97954243 97932708 97862703 97758222 97710991 97618592 97412384 97209275 97056770 96928519 96767259
1586.8I6767259j98412j99825k13891k60389k74771k59108k79569l06195k89244k89339
$$ 96767259 96568847 96369022 96155131 95894742 95619971 95360863 95081294 94775099 94485855 94196516
1607.2I4196516l39591l48664k78383k65932l65323l09515j71524j80054k07055j67274
$$ 94196516 93856925 93508261 93229878 92963946 92598623 92289108 92117584 91937530 91730475 91563201
1627.6I1563201j47998m3583J55586J96409L8969N7781K16502L54552M41873L93349
$$ 91563201 91415203 91371620 91527206 91723615 91762584 91820365 92036867 92391419 92833292 93226641
1648I3226641L52788M84807M13435J48619J88064L34996M07052L36421K86251L54856
$$ 93226641 93579429 94064236 94477671 94626290 94814354 95149350 95556402 95892823 96179074 96533930
1668.4I6533930L31849K23625K14958K03878J81323K47341L44062K64597M2945L5304
$$ 96533930 96865779 97089404 97304362 97508240 97689563 97936904 98280966 98545563 98588508 98623812
1688.8I8623812J22339J83940K18707J95163J56266K1368p3462j5897k8282o5899L010
$$ 98623812 98746151 98930091 99148798 99343961 99500227 99521595 99448133 99432236 99403954 99338055 99341065
1711.3I9341065J02645J29676K6822j11479j11580n2052K938N9992R4873J30087J17219
$$ 99341065 99443710 99573386 99600208 99488729 99377149 99325097 99328035 99388027 99482900 99612987 99730206
1733.7I9730206k1500m2951L2061L8553K0170M6986R1225M8387n9926m9627K0236J8221
$$ 99730206 99708706 99665755 99697816 99736369 99756539 99803525 99894750 99943137 99883211 99833584 99853820 99872041
1758.2I9872041J3047Q917k1720J180O2043R1481J0514r4080o2805k039k473p934j722
$$ 99872041 99885088 99894005 99872285 99873465 99935508 100026989 100037503 99943423 99880618 99878579 99876106 99868172 99866450
1784.7I9866450j3387K0015P6067J6928p3558l3909K6399j770m5300k5302M333L433
$$ 99866450 99853063 99873078 99949145 99966073 99892515 99858606 99885005 99883235 99837935 99812633 99816966 99820399
1809.2I9820399o693j4824k0820j5598M363J8125K0582K2918L0577M41o0129m9114
$$ 99820399 99813706 99798882 99778062 99762464 99766827 99784952 99805534 99828452 99859029 99859470 99799341 99750227
1833.6I9750227j4127j8352P022O4772M0013n1183n8317k9653k8074j1617Q392l952
$$ 99750227 99736100 99717748 99724770 99789542 99829555 99778372 99720055 99690402 99662328 99650711 99659103 99655151
1858.1I9655151j6379J13J9032L1763K3723k8890o3807m1050o735m578j9544r811Q440
$$ 99655151 99638772 99638885 99657917 99689680 99713403 99684513 99620706 99579656 99572921 99568343 99548799 99538988 99547428
1884.6I9547428P462N01q547j9354k8115k2936q971j2934j5199q41o13j5760j5521
$$ 99547428 99554890 99555391 99546844 99527490 99499375 99476439 99467468 99454534 99439335 99438494 99437881 99422121 99406600
1911.1I9406600m351J353K020o675j8871k9641k4242r775j8126k3043p868r399j9503
$$ 99406600 99402249 99403602 99405622 99398947 99380076 99350435 99326193 99316418 99298292 99275249 99267381 99257982 99238479
1937.7I9238479J854J6647j6218l5030j9502j8132k2882r269k891j4740j4484l606
$$ 99238479 99240333 99256980 99240762 99205732 99186230 99168098 99145216 99135947 99133056 99118316 99103832 99100226
1962.1I9100226p754j6791j4371j3989k1565j7941p087j3739k2495j0120m36r793r226
$$ 99100226 99092472 99075681 99061310 99047321 99025756 99007815 99000728 98986989 98964494 98954374 98953938 98944145 98934919
1988.7I8934919M7j7178l2687j5956m977j3959j4341p308j2654j6218n341j168r275
$$ 98934919 98934966 98917788 98885101 98869145 98864168 98850209 98835868 98828560 98815906 98799688 98794347 98793179 98783904
2015.2I8783904j6814l4720o3491q3697n8454K4116P0220M4758J7762K509l081L480
$$ 98783904 98767090 98732370 98668879 98585182 98526728 98550844 98621064 98665822 98683584 98686093 98683012 98686492
2039.6I8686492p86j0884q714n526j0240q577J472J628n305k009J365l713l165K253
$$ 98686492 98685706 98674822 98666108 98660582 98650342 98641765 98643237 98644865 98639560 98637551 98638916 98635203 98632038 98634291
2068.2I8634291j943q208l630r00o056j442J0651Q726J14L242O109k3Q46O223L153
$$ 98634291 98632348 98624140 98620510 98619610 98613554 98612112 98622763 98631489 98631603 98634845 98640954 98640931 98641777 98648000 98651153
2098.8I8651153J258O204M804k878j878M292J049n424l493k396m977j270J878k033
$$ 98651153 98652411 98658615 98663419 98660541 98658663 98662955 98664004 98658580 98655087 98652691 98647714 98646444 98648322 98646289
2127.3I8646289m828l201k646m917m554n377j2070j3238k485R590J6928K6566L6907
$$ 98646289 98641461 98638260 98635614 98630697 98626143 98620766 98608696 98595458 98592973 98602563 98619491 98646057 98682964
2153.9I8682964M1795M0561L3897K6250J4817P2l100J0479J9997J4049Q923Q017O097
$$ 98682964 98724759 98765320 98799217 98825467 98840284 98840356 98837256 98847735 98867732 98881781 98890704 98898721 98904818
2180.4I8904818P582Q857O116O145R006N681J13J549M197P15k641M00M35n466k736
$$ 98904818 98912400 98921257 98927373 98933518 98942524 98948205 98948318 98949867 98954064 98954779 98952138 98952538 98952973 98947507 98944771
2211I8944771L952J371l111l237l791l642J175M476K849J73j419l785l057L868L499
$$ 98944771 98948723 98950094 98946983 98943746 98939955 98936313 98937488 98941964 98944813 98944986 98943567 98939782 98936725 98940593 98944092
2241.6I8944092n311m899K759J008l821K438Q678M321o19j187k932m304j233l6l415
$$ 98944092 98938781 98933882 98936641 98937649 98933828 98936266 98944944 98949265 98948646 98947459 98944527 98940223 98938990 98938954 98935539
2272.2I8935539l517j657n514p194J383P027N329Q655J1479P725J0699J9956K2215
$$ 98935539 98932022 98930365 98924851 98917657 98919040 98926067 98931396 98940051 98951530 98959255 98969954 98989910 99012125
2298.7I9012125K0086K3419L1263L5518L7742M0221L2014K4724M1705O6817O7609N1028
$$ 99012125 99032211 99055630 99086893 99122411 99160153 99200374 99232388 99257112 99298817 99365634 99433243 99484271
2323.1I9484271M7147M7892L5578J5796K098q05L707J2631L969m6408j11437q5997
$$ 99484271 99531418 99579310 99614888 99630684 99632782 99631977 99635684 99648315 99652284 99605876 99494439 99408442
2347.6I9408442K7692J29032J66291J46365R3514K8664k0909o0994q5228j05948j29014
$$ 99408442 99436134 99565166 99731457 99877822 99971336 100000000 99979091 99918097 99832869 99726921 99597907
2370.1I9597907j38378j29491j20247j15227j03987q1527n3280k8819j2386k933J341
$$ 99597907 99459529 99330038 99209791 99094564 98990577 98909050 98855770 98826951 98814565 98811632 98812973
2392.5I8812973J950K670M518L457Q82l63k409m643k223J651M77TL379J896j759k718
$$ 98812973 98814923 98817593 98822111 98825568 98826450 98826087 98823678 98819035 98816812 98818463 98818940 98819417 98822796 98824692 98822933 98820215
2425.1I8820215m1R77j073J741M083K44M65M697K354l493l171N43j13j97N400N788
$$ 98820215 98820174 98821151 98820078 98821819 98825902 98826146 98826611 98831308 98833662 98830169 98826998 98827541 98827428 98827231 98832631 98838419
2457.8I8838419p63l028k378m089j902M673M578K62Q59M11l499j675L553J639k671
$$ 98838419 98837656 98834628 98832250 98828161 98826259 98830932 98835510 98835772 98836631 98837042 98833543 98831868 98835421 98837060 98834389
2488.3I8834389k50J961j043l0M310J573n048k516L159n30l749N9L076L117N818N507
$$ 98834389 98834139 98836100 98835057 98835027 98839337 98840910 98835862 98833346 98836505 98835975 98832226 98832285 98835361 98838478 98844296 98849803
2521I8849803l302o097j562k897m101K927L958l934k343M453J263k730O02L58l242
$$ 98849803 98846501 98840404 98838842 98835945 98831844 98834771 98838729 98834795 98832452 98836905 98838168 98835438 98836040 98836398 98833156
2551.6I8833156L16M273l87l547J538J413m697r78O020L106M59L284K09p809n823K897
$$ 98833156 98833472 98837745 98837358 98833811 98835349 98836762 98832065 98831087 98837107 98840213 98840672 98843956 98844165 98836356 98830533 98833430
2584.2I8833430J997k253Q94K384k265q76M834K20n585j37L678k730n806q70r66m410
$$ 98833430 98835427 98833174 98834068 98836452 98834187 98833311 98838145 98838365 98832780 98832643 98836321 98833591 98827785 98826915 98825949 98821539
2616.8I8821539q05K104l135l511M488L380m435k974j544p218m947L988K616n811p892
$$ 98821539 98820734 98822838 98819703 98816192 98820680 98824060 98819625 98816651 98815107 98807889 98802942 98806930 98809546 98803735 98795843
2647.4I8795843n484l790r48n72m000k897L255L344k319q76N340K474p057p665p16
$$ 98795843 98790359 98786569 98785621 98785049 98781049 98778152 98781407 98784751 98782432 98781556 98786896 98789370 98782313 98774648 98773932
2678I8773932j972o450j43L475l350m905l237p373o443O56L51k443q29l213j0126r865
$$ 98773932 98771960 98765510 98765367 98768842 98765492 98760587 98757350 98749977 98743534 98744190 98744541 98742098 98741269 98738056 98727930 98718065
2710.7I8718065p39K390k396j061K855k497n573m77m637j2446m280O778O85q845k557
$$ 98718065 98717326 98719716 98717320 98716259 98719114 98716617 98711044 98710567 98705930 98693484 98689204 98695982 98696667 98687822 98685265
2741.2I8685265N078J371m8k110j4377j4162L684M971j1218j1587k718p236p462M834
$$ 98685265 98690343 98691714 98691666 98689556 98675179 98661017 98664701 98669672 98658454 98646867 98644149 98636913 98629451 98634285
2769.8I8634285N567m351o211o241j3411j2868p75L445j711l439r149j9771j3381j14
$$ 98634285 98639852 98635501 98629290 98623049 98609638 98596770 98595995 98599440 98597729 98594290 98585141 98565370 98551989 98551875
2798.4I8551875q505k3300j8662r692j5092j9198j2463j5086k4116j4896p504k1613
$$ 98551875 98543370 98520070 98501408 98491716 98476624 98457426 98444963 98429877 98405761 98390865 98383361 98361748
2822.8I8361748k4384j1039j7666l4351k8365j7000k6494m5764n8222o5190o8611o4081
$$ 98361748 98337364 98326325 98308659 98274308 98245943 98228943 98202449 98156685 98098463 98033273 97964662 97900581
2847.3I7900581o3663o7085m3983l665J2093M453J538r36j2529j4728k539L999o169
$$ 97900581 97836918 97769833 97725850 97722185 97734278 97738731 97740269 97739333 97726804 97712076 97709537 97713536 97707367
2873.8I7707367j4913j0866j0204j0163k748p891k3818k4969j8853k3025k7537k6626
$$ 97707367 97692454 97681588 97671384 97661221 97658473 97650582 97626764 97601795 97582942 97559917 97532380 97505754
2898.3I7505754k8431k7490j8006j6416k6327k2328j2272l4738o6954o4850m9031l7717
$$ 97505754 97477323 97449833 97431827 97415411 97389084 97366756 97354484 97319746 97252792 97187942 97138911 97101194
2922.8I7101194r609L4023N6237M5794M1616N3441N5010N6272O9517O7061L9000J2815
$$ 97101194 97091585 97125608 97181845 97227639 97269255 97322696 97377706 97433978 97503495 97570556 97609556 97622371
2947.2I7622371Q3o801q630p594o974j442J2809K1416J7297K1881L9255M9156M7553
$$ 97622371 97622454 97615653 97607023 97599429 97592455 97591013 97603822 97625238 97642535 97664416 97703671 97752827 97800380
2973.8I7800380M9263N9635N9324M6164L9625L3784K6339L6234L9274J3446J270L832
$$ 97800380 97849643 97909278 97968602 98014766 98054391 98088175 98114514 98150748 98190022 98203468 98204738 98208570
2998.2I8208570p617q821M506Q648J0604K2554K2453o985l3671k9492j9032k0069j6636
$$ 98208570 98200953 98192132 98196638 98205286 98215890 98238444 98260897 98253912 98220241 98190749 98171717 98151648 98135012
3024.7I8135012q893o240n347k479j2172l0130j6701J0914q94l3105l6436k0141k0939
$$ 98135012 98126119 98119879 98114532 98112053 98099881 98069751 98053050 98063964 98063070 98029965 97993529 97973388 97952449
3051.3I7952449k6840j9067k3437l4791k1571l207o157k0861l2139l6311k7132J66
$$ 97952449 97925609 97906542 97883105 97848314 97826743 97823536 97817379 97796518 97764379 97728068 97700936 97701102
3075.7I7701102J4502j2010l6812l2514l7551m4847l0970k8509m2176l6657j5283j6045
$$ 97701102 97715604 97703594 97666782 97634268 97596717 97551870 97520900 97492391 97450215 97413558 97398275 97382230
3100.2I7382230l8809m3029k4747k2173l5519k8348r358r793k6405n4949q1313p0566
$$ 97382230 97343421 97300392 97275645 97253472 97217953 97189605 97180247 97170454 97144049 97089100 97007787 96937221
3124.7I6937221l9881l4458m6825m8822m3142l9184l8356m7987o2114o2460m8870l5167
$$ 96937221 96897340 96862882 96816057 96767235 96724093 96684909 96646553 96598566 96536452 96473992 96425122 96389955
3149.2I6389955l6311n8454p8863q1438p7540o8789o1524o7878p6657p3380p0548p8040
$$ 96389955 96353644 96295190 96216327 96134889 96057349 95988560 95927036 95859158 95782501 95709121 95638573 95560533
3173.6I5560533q0359p9334q4561q6486q4442r1189j01299r7787r0188r5766j05805
$$ 95560533 95480174 95400840 95316279 95229793 95145351 95054162 94952863 94855076 94764888 94669122 94563317
3196.1I4563317j05625j02878j06102j05029r8795r8699j00351r6959j01971j14441
$$ 94563317 94457692 94354814 94248712 94143683 94044888 93946189 93845838 93748879 93646908 93532467
3216.5I3532467j15228j12849j18971j18792j08183j03873j01953r7877j13321j35189
$$ 93532467 93417239 93304390 93185419 93066627 92958444 92854571 92752618 92654741 92541420 92406231
3236.9I2406231j32418j12801r8491r6422j03617j14477j12295r4467q1742q3763r1302
$$ 92406231 92273813 92161012 92062521 91966099 91862482 91748005 91635710 91541243 91459501 91375738 91284436
3259.3I1284436r1398q2385p4977o4403m9943o3520r8586j10281j01614r9313r9623
$$ 91284436 91193038 91110653 91035676 90971273 90921330 90857810 90759224 90648943 90547329 90448016 90348393
3281.7I0348393r6298r9277r8109q1677q1610j16784j47330j49668j40577j25849j14137
$$ 90348393 90252095 90152818 90054709 89973032 89891422 89774638 89627308 89477640 89337063 89211214 89097077
3304.2H9097077j34909j87177k19476k08569j96051k05791k11335k06023k05642k16681
$$ 89097077 88962168 88774991 88555515 88346946 88150895 87945104 87733769 87527746 87322104 87105423
3324.6H7105423k43228k66868k66499k53224k44516k48701k70003k91806l00813l11065
$$ 87105423 86862195 86595327 86328828 86075604 85831088 85582387 85312384 85020578 84719765 84408700
3345H4408700l10963k97677l16924l55625l61407l45385l38084l44223l47888l33160
$$ 84408700 84097737 83800060 83483136 83127511 82766104 82420719 82082635 81738412 81390524 81057364
3365.4H1057364l19678l39264l76707l78090l41165l13324l04061k91556k67226k46757
$$ 81057364 80737686 80398422 80021715 79643625 79302460 78989136 78685075 78393519 78126293 77879536
3385.7G7879536k28786j98269j97011k35659k36440j80221j51705j93793k28894k04086
$$ 77879536 77650750 77452481 77255470 77019811 76783371 76603150 76451445 76257652 76028758 75824672
3406.1G5824672j71047j56653j49006j53112j51533j27328j05780r8634q7166o1458
$$ 75824672 75653625 75496972 75347966 75194854 75043321 74915993 74810213 74711579 74624413 74562955
3426.5G4562955l3009k2823j1503R113n13j8364L070M1377O6758P6407P8130Q7142
$$ 74562955 74529946 74507123 74495620 74504733 74504220 74485856 74488926 74530303 74597061 74673468 74751598 74838740
3451G4838740J00314J14000J33711J46109J41269J47325J78802J93566J60640J23805
$$ 74838740 74939054 75053054 75186765 75332874 75474143 75621468 75800270 75993836 76154476 76278281
3471.4G6278281J32728J63352J84346J80912J58447J59788J80596J77598J65892J77687
$$ 76278281 76411009 76574361 76758707 76939619 77098066 77257854 77438450 77616048 77781940 77959627
3491.8G7959627J97339K07460K07257K07162K04319J83034J73002J92368K09719K17122
$$ 77959627 78156966 78364426 78571683 78778845 78983164 79166198 79339200 79531568 79741287 79958409
3512.2G9958409K13146J97482J99402K28101K53868K44605K22600K14547K11710K25496
$$ 79958409 80171555 80369037 80568439 80796540 81050408 81295013 81517613 81732160 81943870 82169366
3532.6H2169366K49690K45523K30700K54095K85500K75963K38359K24674K41250K47627
$$ 82169366 82419056 82664579 82895279 83149374 83434874 83710837 83949196 84173870 84415120 84662747
3553H4662747K47467K62064K79742K87932K97273L17221L15136K69908K47550K73448
$$ 84662747 84910214 85172278 85452020 85739952 86037225 86354446 86669582 86939490 87187040 87460488
3573.4H7460488L05551L26223L42005L58546L82376L94713L55924L01176L08424L46023
$$ 87460488 87766039 88092262 88434267 88792813 89175189 89569902 89925826 90227002 90535426 90881449
3593.8I0881449L57437L58135L54045L33941L30067L55285L68435L43549L23558L18938
$$ 90881449 91238886 91597021 91951066 92285007 92615074 92970359 93338794 93682343 94005901 94324839
3614.2I4324839L12948L09039K68828K24609K54273L19427L10821J89340J28448J53553
$$ 94324839 94637787 94946826 95215654 95440263 95694536 96013963 96324784 96514124 96642572 96796125
3634.6I6796125J63526J62065J71482J87570K26217K70957K18404N3966p445M9686
$$ 96796125 96959651 97121716 97293198 97480768 97706985 97977942 98196346 98250312 98242867 98292553
3655I8292553P4661N4831N0616O2483R4885J37705J38700Q3649N9604K0558o9135o4129
$$ 98292553 98367214 98422045 98472661 98535144 98630029 98767734 98906434 98990083 99049687 99070245 99001110 98936981
3679.4I8936981M196O6054J33884J76638R6399k9391l9184J2392N4043P1615M3476
$$ 98936981 98941177 99007231 99141115 99317753 99414152 99384761 99345577 99357969 99412012 99483627 99527103
3701.9I9527103N060L3724R2733Q9985o425p4971l6728K3866N4633M5336J2248o413
$$ 99527103 99532163 99565887 99658620 99748605 99742180 99667209 99630481 99654347 99708980 99754316 99766564 99760151
3726.4I9760151J4204O4778J00303O0564m2003p8810k294P1901M0662N042L9465j2648
$$ 99760151 99774355 99839133 99939436 100000000 99957997 99879187 99876893 99948794 99989456 99994498 100033963 100021315
3750.8A00021315j10299p9947q816k116k5040q893J5241J9866N925l5280m5002M894
$$ 100021315 99911016 99831069 99822253 99820137 99795097 99786204 99801445 99821311 99827236 99791956 99746954 99751848
3775.3I9751848M8751K4622k6595k6983j5611k3663j2988J8114M5467N4335N7680N5909
$$ 99751848 99800599 99825221 99798626 99771643 99756032 99732369 99719381 99737495 99782962 99837297 99894977 99950886
3799.8I9950886k933m9835l1871m6277n0771J5259P3695O3228M0323J4812o2675p4636
$$ 99950886 99947953 99898118 99866247 99819970 99769199 99784458 99858153 99921381 99961704 99976516 99913841 99839205
3824.3I9839205k2579K438K0081M1151O3431N6273p206n8902o4158n4973r239P6878
$$ 99839205 99816626 99819064 99839145 99880296 99943727 100000000 99992794 99933892 99869734 99814761 99805522 99882400
3848.7I9882400J47736Q2982j05107j25677k8854L6418M4132J2117Q047K0468j5056
$$ 99882400 100030136 100113118 100008011 99882334 99853480 99889898 99934030 99946147 99954194 99974662 99959606
3871.2I9959606n1218m2659l46L8826L9727K8771l296l4094q780o020k9117R036O6275
$$ 99959606 99908388 99865729 99865383 99904209 99943936 99972707 99969411 99935317 99926537 99920517 99891400 99900436 99966711
3897.7I9966711P1376K6107l5119p6747o7967k5505J9926M4978L1751j132j2499J01
$$ 99966711 100038087 100064194 100029075 99952328 99884361 99858856 99878782 99923760 99955511 99954379 99941880 99941981
3922.1I9941981Q374Q875J2064Q518j0228k3663p767K0927K8843J1420O56J2040J2624
$$ 99941981 99950355 99959230 99971294 99979812 99969584 99945921 99938154 99959081 99987924 99999344 100000000 100012040 100024664
3948.7A00024664o926j2719o80P844Q655P200K885K14O187J4890J4794P557L756O854
$$ 100024664 100017738 100005019 100004339 100012183 100020838 100028038 100030923 100031137 100037324 100052214 100067008 100074565 100078321 100085175
3977.2A00085175J2791J4126R954n24q798M626K2447J3554k62N412
$$ 100085175 100097966 100112092 100122046 100121522 100112724 100117350 100139797 100153351 100153089 100158501
3997.6A00158501
$$ 100158501
##END=$$ End of the data block
