##TITLE=$$ Begin of the data block
##JCAMP-DX=5.00 $$ ACD/SpecManager v 10.08
##SPECTROMETER/DATA SYSTEM=16PC
##DATE=18 Jun 2013 15:21:48
##DATA TYPE=INFRARED SPECTRUM
##DATA CLASS=XYDATA
##ORIGIN=
##OWNER=
##NPOINTS=3601
##FIRSTX=400.00000000
##LASTX=4000.00000000
##MAXX=4000.00000000
##MINX=400.00000000
##MAXY=84.47300720
##MINY=32.84972000
##XFACTOR=1.0000000000
##YFACTOR=0.000000100000000
##FIRSTY=46.46684265
##DELTAX=1.00000000
##XUNITS=1/CM
##YUNITS=TRANSMITTANCE
##XYDATA=(X++(Y..Y))
$$ plain form
400 464668427 579633293 672233124 734816666 768323364 780298996 780810242 778398514 777813416
408 777813416 780051575 783966064 788115311 791796646 795019608 797909851 800258942 801612015 801742249
417 801742249 801037292 800417404 800794525 802455673 804819565 806754761 807257690 806053314 803746338
426 803746338 801458054 800198364 800355301 801568832 802996063 803772964 803405685 801935349 799861755
435 799861755 797917480 796806183 796977844 798480606 800930252 803615646 805745850 806758270 806563034
444 806563034 805587540 804580536 804248657 804903564 806288757 807666779 808119354 806912460 803777084
453 803777084 799013748 793412170 788038483 783960342 781976013 782414627 785060196 789241714 794073334
462 794073334 798758240 802827606 806202469 809051971 811544189 813642578 815084686 815557098 814955597
$$ packed form
400D64668427J14964866R2599831O2583542L3506698J1975632N11246k411728n85098
408G77813416K238159L914489M149247L681335L222962K890243K349091J353073J30234
417H01742249p04957o19888L77121J661148K363892J935196N02929j204376k306976
426H03746338k288284j259690J56937J213531J427231P76901l67279j470336k073594
435G99861755j944275j111297J71661J502762K449646K685394K130204J012420j95236
444H06563034r75494j007004l31879O54907J385193J378022M52575j206894l135376
453H03777084m763336n601578n373687m078141j984329M38614K645569M181518M831620
462G94073334M684906M069366L374863K849502K492218K098389J442108M72412o01501
$$ plain form
471 814955597 813555298 811964798 810869446 810703354 811435394 812597656 813537521 813753662 813138428
480 813138428 812005539 810907211 810354614 810582428 811464157 812591934 813462830 813682709 813110962 811906967
490 811906967 810473404 809309387 808807983 809058685 809728699 810107498 809332657 806739960 802194214
499 802194214 796213684 789783096 783891983 779000320 774723053 769950562 763423996 754531708 743929749
508 743929749 733629303 726420975 724837799 730106430 741571808 756872330 772794571 786418839
516 786418839 796051636 801569443 804099884 805276260 806453705 808236008 810454559 812498322 813766785
525 813766785 814003525 813387985 812403183 811594772 811345749 811755524 812641373 813637772 814344177 814464874
535 814464874 813898468 812743225 811218796 809538193 807798767 805951767 803878632 801533051 799076920
$$ packed form
471H14955597j400299j590500j095352j66092P32040J162262R39865K16141o15234
480H13138428j132889j098328n52597K27814Q81729J127777Q70896K19879n71747j203995
490H11906967j433563j164017n01404K50702O70014L78799p74841k592697m545746
499H02194214n980530o430588n891113m891663m277267m772491o526566q892288j0601959
508G43929749j0300446p208328j583176N268631J1465378J5300522J5922241J3624268
516G86418839R632797N517807K530441J176376J177445J782303K218551K043763J268463
525H13766785K36740o15540r84802q08411k49023M09775Q85849R96399P06405J20697
535H14464874n66406j155243j524429j680603j739426j847000k073135k345581k456131
$$ plain form
544 799076920 796914597 795595322 795614929 797205505 800212250 804113693 808174515 811668930 814084244
553 814084244 815245056 815322571 814741974 814024124 813609390 813714752 814276886 814996109 815478516 815421371
563 815421371 814763184 813730392 812752304 812275162 812563934 813576736 814978180 816281052 817052460
572 817052460 817094574 816519241 815690460 815060501 814973526 815515900 816478119 817440567 817954102 817736969
582 817736969 816805115 815480042 814260483 813615875 813788757 814694443 815962601 817105408 817728195
591 817728195 817694092 817166901 816521530 816166534 816359863 817099228 818127975 819050369 819506760 819330139
601 819330139 818623886 817724304 817061996 816979218 817579422 818677292 819871979 820717010 820910263 820420761
611 820420761 819492340 818529510 817917938 817862396 818313751 819009476 819598770 819795151 819488602 818778763
$$ packed form
544G99076920k162323j319275J9607J590576L006745L901443M060822L494415K415314
553H14084244J160812P7515n80597p17850m14734J05362N62134P19223M82407n7145
563H15421371o58187j032792r78088m77142K88772J012802J401444J302872P71408
572H17052460M2114n75333q28781o29959q6975N42374R62219R62448N13535k17133
582H17736969r31854j325073j219559o44608J72882R05686J268158J142807O22787
591H17728195l4103n27191o45371l54996J93329P39365J028747R22394M56391j76621
601H19330139p06253q99582o62308q2778O00204J097870J194687Q45031J93253m89502
611H20420761r28421r62830o11572n5542M51355O95725N89294J96381l06549p09839
$$ plain form
621 818778763 817928696 817258072 817028275 817350540 818152618 819213715 820251846 821035080 821473312 821648483
631 821648483 821769028 822063599 822660980 823513412 824403915 825038071 825183411 824787827 824022598 823225250
641 823225250 822763748 822881393 823588104 824650421 825682297 826305161 826310730 825752411 824927521 824251633
651 824251633 824072495 824508667 825388031 826317291 826863632 826761475 826050034 825069656 824309616 824176331
661 824176331 824789810 825906906 827014999 827555237 827174377 825893707 824114532 822463379 821537476
670 821537476 821659470 822739105 824291306 825602570 825985260 825028610 822763519 819679260 816585007
679 816585007 814350510 813614349 814562302 816864777 819807968 822573471 824550858 825549927 825818787
688 825818787 825859528 826141052 826854706 827831650 828660431 828928146 828445129 827340622 825981674 824781570
$$ packed form
621H18778763q50067o70624k29797L22265Q02078J061097J038131P83234M38232J75171
631H21648483J20545K94571N97381Q52432Q90503O34156J45340l95584p65229p97348
641H23225250m61502J17645P06711J062317J031876O22864N569n58319q24890o75888
651H24251633j79138M36172Q79364R29260N46341j02157p11441r80378p60040j33285
661H24176331O13479J117096J108093N40238l80860j280670j779175j651153r25903
670H21537476J21994J079635J552201J311264L82690r56650k265091l084259l094253
679H16585007k234497p36161R47953K302475K943191K765503J977387R99069K68860
688H25818787M0741K81524P13654R76944Q28781K67715m83017j104507j358948j200104
$$ plain form
698 824781570 824008942 823696518 823677139 823696976 823528137 823032303 822166214 820969315 819553680 818074036
708 818074036 816646500 815199509 813320770 810224991 804953232 796807861 785867615 773310318
716 773310318 761301880 752389145 748585052 750539474 757191620 766104050 774369202 779698868 781228180
725 781228180 779695969 776964493 775132980 775655746 778844147 783913040 789487228 794289551 797682266
734 797682266 799833145 801468277 803367310 805868988 808650818 810897675 811771393 810921783 808715744
743 808715744 805999222 803450317 800849152 796712952 788615417 774191360 752440338 724714890
751 724714890 694852448 668263550 650276718 644402084 651217957 668321762 691300735 715264053
759 715264053 736304626 752368011 763340073 770500412 775690613 780560608 786111069 792582703
$$ packed form
698H24781570p72628l12424j9379J9837j68839m95834q66089j196899j415635j479644
708H18074036j427536j446991j878739l095779n271759q145371j0940246j2557297
716G73310318j2008438q912735l804093J954422O652146Q912430Q265152N329666J529312
725G81228180j532211k731476j831513N22766L188401N068893N574188M802323L392715
734G97682266K150879J635132J899033K501678K781830K246857Q73718q49610k206039
743H08715744k716522k548905k601165m136200q097535j4424057k1751022k7725448
751G24714890k9862442k6588898j7986832n874634O815873J7103805K2978973K3963318
759G15264053K1040573J6063385J0972062P160339N190201M869995N550461O471634
$$ plain form
767 792582703 799608917 806504593 812576294 817371902 820808487 823157425 824896469 826488876 828189087
776 828189087 829955750 831512375 832518311 832752762 832226181 831171036 829925995 828790970 827912827
785 827912827 827250137 826615448 825766449 824509048 822780991 820689468 818489075 816497192 814974365
794 814974365 814012222 813491135 813133087 812633667 811813965 810713348 809577103 808747787 808517914 809012680
804 809012680 810151825 811689682 813306427 814708862 815717926 816319504 816662369 816987610 817497177
813 817497177 818209229 818884506 819104614 818493576 816987991 814978867 813198090 812357025 812727280 813916168
823 813916168 815017395 815059052 813470612 810212631 805419159 798744431 788893127 773813477 751697922
832 751697922 722416534 688617401 655748901 630714951 619589615 625355301 646709976 678518448
$$ packed form
767G92582703P026214O895676O071701M795608L436585K348938J739044J592407J700211
776H28189087J766663J556625J005936K34451n26581j055145j245041j135025q78143
785H27912827o62690o34689q48999j257401j728057k091523k200393j991883j522827
794H14974365r62143n21087l58048m99420q19702j100617j136245q29316k29873M94766
804H09012680J139145J537857J616745J402435J009064O01578L42865L25241N09567
813H17497177P12052O75277K20108o11038j505585k009124j780777q41065L70255J188888
823H13916168J101227M1657j588440l257981m793472o674728r851304j5079650k2115555
832G51697922k9281388l3799133l2868500k5033950j1125336N765686K1354675L1808472
$$ plain form
840 678518448 713700943 745695114 770411682 786934586 796890030 803017578 807747574 812405777
848 812405777 817208328 821776123 825712738 828899460 831447296 833479462 834981613 835841751 836023254
857 836023254 835712585 835308838 835249023 835783157 836841812 838077774 839051437 839447250 839208450 838535614
867 838535614 837771988 837248001 837157898 837505798 838126602 838761292 839156036 839161530 838793182 838232727 837756653
878 837756653 837613983 837907639 838533173 839212723 839616394 839512253 838876266 837912445 836971512 836410141
888 836410141 836452942 837110443 838182449 839340057 840252380 840710602 840704575 840423584 840178070 840264511
898 840264511 840835266 841821594 842955780 843883209 844319229 844178085 843611374 842939529 842508163 842535400
908 842535400 843021088 843757629 844424133 844730072 844535980 843909149 843095322 842417755 842147217 842389755
$$ packed form
840F78518448L5182495L1994171K4716568J6522904R955444O127548M729996M658203
848H12405777M802551M567795L936615L186722K547836K032166J502151Q60138J81503
857H36023254l10669m03747n9815N34134J058655J235962R73663L95813k38800o72836
867H38535614p63626n23987r0103L47900O20804O34690L94744N494l68348n60455m76074
878H37756653j42670K93656O25534O79550M03671j04141o35987r63821r40933n61371
888H36410141M2801O57501J072006J157608R12323M58222o027k80991k45514Q6441
898H40264511N70755R86328J134186R27429M36020j41144n66711o71845m31366K7237
908H42535400M85688P36541O66504L05939j94092o26831q13827o77567k70538K42538
$$ plain form
918 842389755 843040619 843820496 844386826 844477997 844026337 843191833 842298584 841693726 841595001 841994324
928 841994324 842659912 843238602 843410339 843026199 842169342 841118164 840226440 839774017 839853516 840332718
938 840332718 840914383 841262360 841146545 840542603 839642029 838770142 838240662 838215027 838631973 839233246
948 839233246 839680176 839700089 839196701 838282242 837215576 836288223 835707092 835522537 835623016 835792236
958 835792236 835799942 835495758 834873047 834077759 833361053 832978821 833078995 833622818 834380112 835011978
968 835011978 835208740 834821167 833924789 832782440 831726303 831018295 830751114 830828476 831018677 831048050
978 831048050 830695724 829863052 828607712 827139740 825764923 824779129 824330978 824315262 824365845 823989487
988 823989487 822804642 820758743 818178177 815570221 813238831 810913696 807648163 802119904 793277435
$$ packed form
918H42389755O50864P79877N66330R1171m51660q34504q93249o04858r8725L99323
928H41994324O65588N78690J71737l84140q56857j051178q91724m52423P9499M79202
938H40332718N81665L47977j15815o03942r00574q71887n29480k5635M16946O01273
948H39233246M46930J9913n03388r14459j066666r27353n81131j84555J00479J69220
958H35792236P706l04184o22711p95288p16706l82232J00174N43823P57294O31866
968H35011978J96762l87573q96378j142349j056137p08008k67181P7362J90201K9373
978H31048050l52326q32672j255340j467972j374817r85794m48151j5716N0583l76358
988H23989487j184845k045899k580566k607956k331390k325135l265533n528259q842469
$$ plain form
997 793277435 781044388 766717606 752799988 742264328 737521820 739524536 747368698 758550110
1005 758550110 769741516 777772522 780475693 777162704 768674774 757080231 745137634 735650940
1013 735650940 730826340 731753235 738151855 748491287 760485611 771821594 780849991 786969604
1021 786969604 790561981 792546005 793808975 794802094 795480957 795560379 794871674 793581161 792134018
1030 792134018 790979004 790267944 789728622 788796158 786914062 783813019 779606247 774663239 769368820
1039 769368820 763943176 758446426 752955933 747789917 743603973 741270065 741570892 744857559 750842590
1048 750842590 758631287 766979904 774661026 780789337 784994125 787403107 788479080 788795090 788835068
1057 788835068 788876801 788978119 789034805 788862000 788235397 786865463 784324036 780002670 773197174 763366547
$$ packed form
997G93277435j2233047j4326782j3917618j0535660m742508K002716P844162J1181412
1005G58550110J1191406Q031006K703171l312989q487930j1594543j1942597r486694
1013G35650940m824600R26895O398620J0339432J1994324J1335983R028397O119613
1021G86969604L592377J984024J262970R93119O78863P9422o88705j290513j447143
1030G92134018j155014p11060n39322r32464j882096l101043m206772m943008n294419
1039G69368820n425644n496750n490493n166016m185944k333908L00827L286667N985031
1048G50842590P788697Q348617P681122O128311M204788K408982J075973L16010L9978
1057G88835068M1733J01318N6686j72805o26603j369934k541427m321366o805496r830627
$$ plain form
1067 763366547 750514069 735533829 720309753 707424927 699503708 698392563 704512253 716666565
1075 716666565 732414703 748860016 763527908 774977798 782941666 788013077 791110001 792999649
1083 792999649 794080582 794452133 794140320 793298569 792250290 791367722 790870361 790676270 790385971 789418259
1093 789418259 787236481 783582687 778636551 773046036 767807770 764020004 762564621 763819199 767511673
1102 767511673 772788849 778498001 783578644 787400818 789906082 791492233 792715912 793973541 795328064
1111 795328064 796554565 797358017 797615280 797497482 797399292 797730179 798693085 800176773 801814117 803155060
1121 803155060 803848267 803735275 802827072 801216049 799004288 796304703 793310547 790366898 787970047
1130 787970047 786668854 786892014 788794556 792194595 796634445 801532593 806346054 810675278 814281311
$$ packed form
1067G63366547j2852478j4980240j5224076j2884826p921219j111145O119690J2154312
1075G16666565J5748138J6445313J4667892J1449890P963868N071411L096924J889648
1083G92999649J080933L71551l11813q41751j048279q82568m97361j94091k90299r67712
1093G89418259k181778l653794m946136n590515n238266l787766j455383J254578L692474
1102G67511673N277176N709152N080643L822174K505264J586151J223679J257629J354523
1111G95328064J226501Q03452K57263j17798r8190L30887R62906J483688J637344J340943
1121H03155060O93207j12992r08203j611023k211761k699585k994156k943649k396851
1130G87970047j301193K23160J902542L400039M439850M898148M813461M329224L606033
$$ plain form
1139 814281311 817040787 818897934 819854889 820004730 819569931 818889008 818335190 818180389 818479843 819037628
1149 819037628 819493332 819492187 818866806 817737656 816478577 815564423 815365753 815987701 817223206 818634186
1159 818634186 819728851 820149384 819802551 818881531 817777786 816917343 816589432 816824188 817373428 817803192
1169 817803192 817661896 816660919 814783630 812273560 809499741 806770706 804189301 801636429 798898773
1178 798898773 795878754 792768097 790078354 788492661 788596268 790613480 794277954 798893661 803546600
1187 803546600 807364273 809709015 810249710 808934784 805932541 801599655 796484375 791320343 786947632
1196 786947632 784146500 783426132 784865952 788097839 792449188 797186966 801747818 805845184 809425888
1205 809425888 812520447 815096970 817014923 818098679 818286209 817750626 816907196 816290207 816349258
$$ packed form
1139H14281311K759476J857147R56955J49841m34799o80923n53818j54801K99454N57785
1149H19037628M55704j145o25381j129150j259079r14154j98670O21948J235505J410980
1159H18634186J094665M20533l46833r21020j103745q60443l27911K34756N49240M29764
1169H17803192j41296j000977j877289k510070k773819k729035k581405k552872k737656
1178G98898773l020019l110657k689743j585693J03607K017212L664474M615707M652939
1187H03546600L817673K344742N40695j314926l002243m332886n115280n164032m372711
1196G86947632k801132p20368J439820L231887M351349M737778M560852M097366L580704
1205H09425888L094559K576523J917953J083756J87530n35583q43430o16989N9051
$$ plain form
1214 816349258 817267075 818890381 820803680 822513733 823656998 824134598 824126892 823986053 824062729 824546738
1224 824546738 825385361 826308975 826951065 827005463 826359100 825145645 823696136 822411804 821604843 821378479
1234 821378479 821593399 821937332 822068558 821773529 821067657 820197067 819534149 819415054 819983139 821109695
1244 821109695 822426147 823454056 823780441 823203125 821792984 819839706 817720490 815735474 813986816
1253 813986816 812344513 810513382 808172150 805133286 801461563 797510376 793851242 791113663 789777679
1262 789777679 789982300 791425552 793406143 795020370 795471573 794382553 791993866 789143372 787008972
1271 787008972 786695480 788819733 793270645 799247208 805561752 811080475 815107040 817555847 818856735
1280 818856735 819665756 820530701 821674881 822973099 824103088 824766617 824856110 824497528 823962708 823521729
$$ packed form
1214H16349258R17817J623306J913299J710053J143265M77600p706j40839P6676M84009
1224H24546738Q38623R23614O42090N4398o46363j213455j449509j284332q06961k26364
1234H21378479K14920L43933J31226k95029p05872q70590o62918j19095N68085J126556
1244H21109695J316452J027909L26385n77316j410141j953278k119216j985016j748658
1253H13986816j642303j831131k341232l038864l671723l951187l659134k737579j335984
1262G89777679K04621J443252J980591J614227M51203j089020k388687k850494k134400
1271G87008972l13492K124253M450912N976563O314544N518723M026565K448807J300888
1280H18856735Q09021Q64945J144180J298218J129989O63529Q9493l58582n34820m40979
$$ plain form
1290 823521729 823317108 823316727 823357773 823247528 822863007 822213745 821441956 820772095 820428162 820550079 821132889
1301 821132889 822011719 822899170 823470383 823470078 822806244 821591110 820112228 818741379 817807922 817493286
1311 817493286 817776794 818460922 819259262 819914093 820294876 820439453 820518494 820738983 821228027 821950073
1321 821950073 822697754 823168716 823094330 822365341 821089478 819551239 818090210 816952057 816185684
1330 816185684 815633926 815021439 814095306 812752457 811094894 809393921 807979050 807102737 806830444
1339 806830444 806993790 807222824 807047501 806038361 803946304 800796127 796892090 792726974 788815231
1348 788815231 785514755 782912750 780833130 778971558 777099991 775242462 773732376 773107071 773884430
1357 773884430 776314697 780230103 785061493 790022202 794378815 797691345 799921188 801370163 802489853
$$ packed form
1290H23521729k04621l81M1046j10245l84521o49262p71789o69861l43933J21917N82810
1301H21132889Q78830Q87451N71213l05o63834j215134j478882j370849r33457l14636
1311H17493286K83508O84128P98340O54831L80783J44577P9041K20489M89044P22046
1321H21950073P47681M70962p4386p28989j275863j538239j461029j138153p66373
1330H16185684n51758o12487r26133j342849j657563j700973j414871q76313k72293
1339H06830444J63346K29034j75323j009140k092057l150177l904037m165116l911743
1348G88815231l300476k602005k079620j861572j871567j857529j510086o25305P77359
1357G73884430K430267L915406M831390M960709M356613L312530K229843J448975J119690
$$ plain form
1366 802489853 803652802 804991379 806363678 807449036 807914734 807568588 806435547 804733658 802778625
1375 802778625 800871582 799221954 797927017 797005005 796444168 796244125 796432037 797051697 798135986
1384 798135986 799671478 801563263 803617020 805548401 807040176 807837143 807850723 807224426 806313248
1393 806313248 805569153 805374832 805893860 807013016 808392868 809600601 810253677 810112610 809105682
1402 809105682 807303009 804871979 802024460 798930511 795583649 791647949 786386566 778788452 767956390
1411 767956390 753662338 736836472 719700165 705360336 696927643 696470184 704246979 718571320
1419 718571320 736380081 754263992 769515228 780761871 788005829 792153091 794349442 795453873
1427 795453873 795830307 795445023 794104462 791662445 788106918 783547516 778179855 772273026 766178665
$$ packed form
1366H02489853J162949J338577J372299J085358M65698l46146j133041j701889j955033
1375H02778625j907043j649628j294937r22012n60837k00043J87912O19660J084289
1384G98135986J535492J891785K053757J931381J491775P96967J3580o26297r11178
1393H06313248p44095j94321N19028J119156J379852J207733O53076j41067j006928
1402H09105682j802673k431030k847519l093949l346862l935700n261383p598114j0832062
1411G67956390j4294052j6825866j7136307j4339829q432693m57459P776795J4324341
1419G18571320J7808761J7883911J5251236J1246643P243958M147262K196351J104431
1427G95453873L76434l85284j340561k442017l555527m559402n367661n906829o094361
$$ plain form
1436 766178665 760311050 755067139 750706558 747248535 744437332 741774063 738570862 733981857 727022476
1445 727022476 716659317 702062988 683034973 660480347 636668816 615034485 599412727 592888145
1453 592888145 596660347 609421539 627585106 646361237 661305008 669725647 671382523 668197632
1461 668197632 663142395 658827515 656444550 655519485 654549103 652152557 648138885 643931122 642129440
1470 642129440 645408859 655290222 671366577 691349030 711901093 729864349 743331833 752132416
1478 752132416 757591171 761759338 766505432 772853546 780780792 789454422 797716599 804577484 809533157
1487 809533157 812646561 814420624 815554657 816680679 818160934 820003586 821918411 823488693 824396515
1496 824396515 824597855 824369354 824191513 824524841 825584412 827227936 829012375 830391922 830956650
$$ packed form
1436G66178665n867615n243911m360581l458023k811203k663269l203201m589005o959381
1445G27022476j0363159j4596329j9028015k2554626k3811531k1634331j5621758o524582
1453E92888145L772202J2761192J8163567J8776131J4943771Q420639J656876l184891
1461F68197632n055237m314880k382965r25065r70382k396546m013672m207763j801682
1470F42129440L279419R881363J6076355J9982453K0552063J7963256J3467484Q800583
1478G52132416N458755M168167M746094O348114P927246Q673630Q262177O860885M955673
1487H09533157L113404J774063J134033J126022J480255J842652J914825J570282R07822
1496H24396515K01340k28501j77841L33328J059571J643524J784439J379547N64728
$$ plain form
1505 830956650 830596619 829529114 828184891 827029114 826397476 826409607 826971741 827844925 828736191 829385452
1515 829385452 829628448 829431915 828894806 828213577 827617645 827290268 827305069 827607422 828044891 828437576
1525 828437576 828655090 828668137 828560257 828494339 828656158 829189606 830143585 831440430 832879639 834178314
1535 834178314 835048599 835289917 834863586 833916702 832733536 831631699 830840530 830418701 830251465 830126648
1545 830126648 829860001 829407501 828908768 828640213 828890686 829811554 831307678 833019409 834415207
1554 834415207 834970016 834365082 832629318 830157471 827584229 825554733 824478760 824377518 824886398
1563 824886398 825426102 825460129 824727631 823340988 821709747 820331421 819555130 819430923 819711990 819995728
1573 819995728 819924927 819346008 818353653 817210541 816195602 815454330 814924774 814360657 813439941 811900406
$$ packed form
1505H30956650l60031j067505j344223j155777o31638J2131N62134Q73184Q91266O49261
1515H29385452K42996j96533n37109o81229n95932l27377J4801L02353M37469L92685
1525H28437576K17514J3047j07880o5918J61819N33448R53979J296845J439209J298675
1535H34178314Q70285K41318m26331r46884j183166j101837p91169m21829j67236j24817
1545H30126648k66647m52500m98733k68555K50473R20868J496124J711731J395798
1554H34415207N54809o04934j735764k471847k573242k029496j075973j01242N08880
1563H24886398N39704L4027p32498j386643j631241j378326p76291j24207K81067K83738
1573H19995728p0801n78919r92355j143112j014939p41272n29556n64117r20716j539535
$$ plain form
1583 811900406 809657135 806850204 803811111 800958176 798653717 797071609 796123962 795472412 794627838
1592 794627838 793093567 790500946 786682053 781658630 775578766 768652496 761138840 753398819 745975494
1601 745975494 739628296 735261536 733730545 735583267 740835800 748885574 758608704 768620148
1609 768620148 777604675 784611664 789224014 791566086 792176514 791798248 791158066 790787888 790923615
1618 790923615 791500931 792233658 792755051 792774963 792199783 791176910 790041580 789193954 788948669 789418030
1628 789418030 790469360 791771927 792909851 793524628 793440323 792729263 791699142 790794754 790442657
1637 790442657 790888977 792094955 793746262 795385284 796622925 797333679 797727203 798248444 799336166
1646 799336166 801155548 803453903 805627899 806990967 807116394 806075134 804442215 803055038 802639008
$$ packed form
1583H11900406k243271k806931l039093k852935k304459j582108r47647o51550q44574
1592G94627838j534271k592621l818893n023423o079864o926270p513656p740021p423325
1601G45975494o347198m366760j530991J852722N252533Q049774R723130J0011444
1609G68620148Q984527P006989M612350K342072O10428l78266o40182l70178J35727
1618G90923615N77316P32727N21393J9912n75180j022873j135330q47626k45285M69361
1628G89418030J051330J302567J137924O14777q4305p11060j030121r04388l52097
1637G90442657M46320J205978J651307J639022J237641P10754L93524N21241J087722
1646G99336166J819382K298355K173996J363068J25427j041260j632919j387177m16030
$$ plain form
1655 802639008 803491364 805372009 807654648 809641953 810884018 811339417 811325226 811301346 811625366 812399979
1665 812399979 813466492 814520569 815265045 815518494 815254211 814579010 813700027 812895279 812482071 812757416
1675 812757416 813899994 815864639 818332748 820768661 822591629 823400345 823143082 822149124 820988159
1684 820988159 820228195 820202332 820901947 822037354 823223343 824183273 824863358 825405273 826009216 826771622
1694 826771622 827597580 828230515 828382492 827890244 826811752 825417099 824081192 823132858 822734833
1703 822734833 822844849 823266754 823760376 824153061 824403381 824592056 824850845 825269089 825825882 826380997
1713 826380997 826727753 826685486 826181641 825287933 824194107 823134537 822311172 821842880 821764679 822058258
1723 822058258 822683487 823584518 824667587 825773468 826687546 827194290 827168732 826652679 825862961 825112915
$$ packed form
1655H02639008Q52356J880645K282639J987305J242065M55399j4191k3880L24020P74613
1665H12399979J066513J054077P44476K53449k64283o75201q78983q04748m13208K75345
1675H12757416J142578J964645K468109K435913J822968Q08716k57263r93958j160965
1684H20988159p59964k5863O99615J135407J185989R59930O80085N41915O03943P62406
1694H26771622Q25958O32935J51977m92248j078492j394653j335907r48334l98025
1703H22734833J10016M21905M93622L92685K50320J88675K58789M18244N56793N55115
1713H26380997L46756m2267n03845q93708j093826j059570q23365m68292p8201K93579
1723H22058258O25229R01031J083069J105881R14078N06744k5558n16053p89718p50046
$$ plain form
1733 825112915 824676437 824657898 824946289 825279007 825391769 825172958 824739151 824383774 824424438 825023804
1743 825023804 826083221 827264786 828134613 828358307 827851562 826817169 825653915 824785080 824487534
1752 824487534 824794693 825507050 826292496 826827545 826918182 826559906 825923004 825279312 824902802 824973831
1762 824973831 825521774 826414642 827402954 828201675 828587189 828472595 827934189 827175293 826443863 825934753
1772 825934753 825719147 825732269 825819397 825819397 825639801 825293732 824885178 824551926 824402008 824471207 824715042
1783 824715042 825035019 825315704 825461121 825417862 825183258 824804459 824367142 823973770 823711777 823619232
1793 823619232 823663559 823750763 823765869 823631821 823358688 823049850 822858658 822910156 823228531 823712997 824175262
1804 824175262 824427872 824377594 824071274 823675919 823394699 823367233 823604736 823987732 824330597 824473648
$$ packed form
1733H25112915m36478j8539K88391L32718J12762k18811m33807l55377M0664N99366
1743H25023804J059417J181565Q69827K23694n06745j034393j163254q68835k97546
1752H24487534L07159P12357P85446N35049R0637l58276o36902o43692l76510P1029
1762H24973831N47943Q92868R88312P98721L85514j14594n38406p58896p31430n09110
1772H25934753k15606J3122Q7128%j79596l46069m08554l33252j49918O9199K43835
1783H24715042L19977K80685J45417m3259k34604l78799m37317l93372k61993r2545
1793H23619232M4327Q7204J5106j34048k73133l08838j91192N1498L18375M84466M62265
1804H24175262K52610n0278l06320l95355k81220k7466K37503L82996L42865J43051
$$ plain form
1814 824473648 824359665 824058990 823734970 823571320 823692322 824112930 824732361 825370560 825832138 825973587
1824 825973587 825753021 825245132 824617310 824067917 823753433 823727875 823923721 824186325 824349976 824321289
1834 824321289 824128647 823911819 823849640 824063797 824542313 825130157 825588989 825703049 825378265 824687653
1844 824687653 823840561 823095398 822653351 822588806 822833405 823221970 823567886 823732452 823663940 823401337
1854 823401337 823045425 822721252 822540665 822573166 822829971 823257446 823748245 824168777 824399109 824375610
1864 824375610 824115829 823712616 823297119 822982483 822816010 822761307 822720871 822588882 822308044 821902618
1874 821902618 821469727 821136169 820997696 821075516 821304550 821562881 821724091 821709366 821518784 821224976
1884 821224976 820939331 820763550 820745850 820861740 821022873 821111069 821027222 820732193 820265427 819735031
$$ packed form
1814H24473648j13983l00675l24020j63650J21002M20608O19431O38199M61578J41449
1824H25973587k20566n07889o27822n49393l14484k5558J95846K62604J63651k8687
1834H24321289j92642k16828o2179K14157M78516N87844M58832J14060l24784o90612
1844H24687653q47092p45163m42047o4545K44599L88565L45916J64566o8512k62603
1854H23401337l55912l24173j80587L2501K56805M27475M90799M20532K30332k3499
1864H24375610k59781m03213m15497l14636j66473n4703m0436j31989k80838m05426
1874H21902618m32891l33558j38473P7820K29034K58331J61210j4725j90582k93808
1884H21224976k85645j75781j7700J15890J61133Q8196q3847k95029m66766n30396
$$ plain form
1894 819735031 819276123 818997879 818938065 819045410 819201813 819271927 819162292 818861694 818443375 818030548
1904 818030548 817737732 817619781 817649536 817732544 817750015 817608948 817272949 816764297 816136017 815435181
1914 815435181 814673615 813825150 812848282 811728134 810512161 809327774 808367233 807838898 807906036 808626328
1924 808626328 809921875 811587677 813340836 814898453 816053009 816726074 816979065 816977768 816925583 816991577
1934 816991577 817251892 817674561 818142929 818509140 818659363 818558731 818264923 817902679 817611923 817491837
1944 817491837 817562408 817760696 817971268 818076477 818007965 817773437 817450867 817153168 816977692 816965103
1954 816965103 817083130 817240219 817325897 817257156 817014465 816649475 816264496 815969772 815838013 815874252
1964 815874252 816014252 816152802 816188889 816069717 815812531 815497437 815232620 815107498 815156860 815347672
$$ packed form
1894H19735031m58908k78244n9814J07345J56403P0114j09635l00598m18319m12827
1904H18030548k92816j17951K9755Q3008J7471j41067l35999n08652o28280p00836
1914H15435181p61566q48465r76868j120148j215973j184387r60541n28335O7138P20292
1924H08626328J295547J665802J753159J557617J154556O73065K52991j297n2185O5994
1934H16991577K60315M22669M68368L66211J50223j00632k93808l62244k90756j20086
1944H17491837P0571J98288K10572J05209o8512k34528l22570k97699j75476j2589
1954H16965103J18027J57089Q5678o8741k42691l64990l84979k94724j31759L6239
1964H15874252J40000J38550L6087j19172k57186l15094k64817j25122M9362J90812
$$ plain form
1974 815347672 815593719 815793304 815868912 815796051 815610046 815389557 815224380 815181885 815280304 815482788 815708771
1985 815708771 815862045 815866623 815696106 815384521 815017319 814699173 814514008 814491348 814594269 814735413
1995 814735413 814813690 814758148 814559021 814271317 813989868 813807678 813772583 813866196 814009628 814099426 814052505
2006 814052505 813844147 813520737 813179932 812929535 812838821 812906952 813061600 813189545 813183594 812989349 812629547
2017 812629547 812193756 811803513 811561890 811514435 811633377 811832886 812006531 812070694 811995773 811815262
2027 811815262 811607590 811462631 811444168 811564713 811782150 812016373 812180939 812216415 812112503 811909714
2037 811909714 811684036 811514435 811453247 811503830 811619644 811722794 811736603 811617203 811376495 811077652
2047 811077652 810813370 810667877 810679398 810823288 811018677 811163101 811174698 811029739 810774307 810503235
$$ packed form
1974H15347672K46047J99585P5608p2861j86005k20489j65177m2495R8419K02484K25983
1985H15708771J53274M578j70517l11585l67202l18146j85165k2660J02921J41144
1995H14735413P8277n5542j99127k87704k81449j82190l5095R3613J43432Q9798m6921
2006H14052505k08358l23410l40805k50397r0714O8131J54648J27945n951j94245l59802
2017H12629547m35791l90243k41623m7455J18942J99509J73645O4163p4921j80511
2027H11815262k07672j44959j8463J20545K17437K34223J64566L5476j03912k02789
2037H11909714k25678j69601o1188N0583J15814J03150J3809j19400k40708k98843
2047H11077652k64282j45493J1521J43890J95389J44424J1597j44959k55432k71072
$$ plain form
2057 810503235 810318527 810284653 810397263 810586243 810747147 810786896 810664673 810410309 810109024 809866333
2067 809866333 809762726 809822693 810006790 810228195 810389709 810418930 810298080 810066833 809807129 809610901
2077 809610901 809545441 809625702 809808731 810009079 810132599 810115585 809952545 809701385 809461746 809333496
2087 809333496 809373093 809566345 809831390 810050964 810121689 809998779 809715729 809369125 809078979 808935547
2097 808935547 808963623 809113846 809288025 809382935 809336472 809152756 808899460 808676453 808573456 808632812 808828888
2108 808828888 809080200 809279480 809336166 809211349 808935089 808593292 808297195 808139343 808158035 808322906
2118 808322906 808547668 808726807 808778610 808678894 808470383 808241577 808089600 808077469 808207245 808420563
2128 808420563 808623886 808726883 808681564 808499222 808246307 808015442 807886505 807895050 808015900 808174515
$$ packed form
2057H10503235j84708l3874J12610J88980J60904L9749j22223k54364l01285k42691
2067H09866333j03607N9967J84097K21405J61514K9221j20850k31247k59704j96228
2077H09610901o5460Q0261J83029K00348J23520j7014j63040k51160k39639j28250
2087H09333496L9597J93252K65045K19574P0725j22910k83050l46604k90146j43432
2097H08935547K8076J50223J74179R4910m6463j83716k53296k23007j02997N9356J96076
2108H08828888K51312J99280N6686j24817k76260l41797k96097j57852J8692J64871
2118H08322906K24762J79139N1803r9716k08511k28806j51977j2131J29776K13318
2128H08420563K03323J02997m5319j82342k52915k30865j28937Q545J20850J58615
$$ plain form
2138 808174515 808276520 808247223 808063583 807766342 807445221 807203445 807115631 807194748 807384796 807582397
2148 807582397 807679291 807608261 807372742 807046814 806744843 806571960 806580276 806744766 806974716 807152100 807180634
2159 807180634 807026215 806728973 806385040 806105194 805969391 805995483 806136017 806298218 806385651 806334610
2169 806334610 806140823 805858688 805580750 805399857 805375671 805507736 805736847 805966568 806099319 806076202
2179 806076202 805901337 805640411 805395737 805262299 805288773 805455551 805682526 805863571 805911331 805795441
2189 805795441 805556717 805288467 805097733 805060501 805187149 805420303 805656586 805790405 805755615 805553894
2199 805553894 805253448 804962234 804784241 804776993 804927444 805156937 805351715 805408173 805274048 804970551
2209 804970551 804583435 804228210 804004288 803954391 804047241 804190750 804271545 804202957 803961868 803600998 803227158
$$ packed form
2138H08174515J02005k9297j83640k97241l21121k41776q7814P9117J90048J97601
2148H07582397R6894p1030k35519l25928l01971j72883Q316J64490K29950J77384K8534
2159H07180634j54419k97242l43933k79846j35803K6092J40534J62201Q7433n1041
2169H06334610j93787k82135k77938j80893k4186J32065K29111K29721J32751k3117
2179H06076202j74865k60926k44674j33438K6474J66778K26975J81045M7760j15890
2189H05795441k38724k68250j90734l7232J26648K33154K36283J33819l4790k01721
2199H05553894l00446k91214j77993p248J50451K29493J94778N6458j34125l03497
2209H04970551l87116l55225k23922m9897R2850J43509Q0795o8588k41089l60870l73840
$$ plain form
2220 803227158 802958603 802873840 802978363 803202209 803427658 803539429 803472748 803237839 802915573 802620468
2230 802620468 802450867 802447815 802577744 802748413 802847672 802791061 802557678 802200623 801826096 801554565 801473694
2241 801473694 801603241 801889572 802224960 802489243 802597733 802530899 802341003 802126007 801986847 801984253
2251 801984253 802113724 802308273 802470016 802511292 802392883 802139282 801829071 801560898 801413498 801414413 801528702
2262 801528702 801673431 801751175 801687164 801460800 801112747 800727997 800402374 800203857 800145493 800179749 800222626
2273 800222626 800187988 800028152 799756088 799441681 799184570 799072266 799143372 799368591 799658585 799897766
2283 799897766 799987030 799882278 799610596 799258118 798937073 798740616 798707581 798811874 798975830 799106979
2293 799106979 799138718 799057770 798909454 798775406 798738174 798844757 799085922 799398651 799690094 799872894
$$ packed form
2220H03227158k68555q4763J04523K23846K25449J11771o6681k34909l22266k95105
2230H02620468j69601l052J29929J70669R9259n6611k33383l57055l74527k71531q0871
2241H01473694J29547K86331L35388K64283J08490o6834j89896k14996j39160k594
2251H01984253J29471J94549J61743M1276j18409k53601l10211k68173j47400R15J14289
2262H01528702J44729P7744o4011k26364l48053l84750l25623j98517n8364L4256M2877
2273H00222626l4638j59836k72064l14407k57111j12304P1106K25219K89994K39181
2283G99897766Q9264j04752k71682l52478l21045j96457l3035J04293J63956J31149
2293G99106979L1739q0948j48316j34048l7232J06583K41165L12729K91443J82800
$$ plain form
2303 799872894 799897308 799768219 799539642 799293671 799107895 799029083 799059677 799161377 799273148 799330750 799285583
2314 799285583 799113770 798817902 798424072 797977676 797533264 797141724 796833038 796600189 796398163 796160049
2324 796160049 795830078 795395508 794900436 794428406 794059982 793828735 793701782 793601074 793452911 793232803
2334 793232803 792972717 792720032 792472076 792133102 791538239 790548325 789174728 787660751 786457748
2343 786457748 786081696 786904602 788973846 791950531 795203552 798022537 799853592 800459595 799946365
2352 799946365 798658905 797014389 795351181 793850937 792544479 791372452 790253983 789133682 787993698
2361 787993698 786849518 785738678 784714737 783840408 783174744 782751694 782560120 782542877 782613983 782698975
2371 782698975 782771072 782867584 783075867 783493118 784178772 785122910 786244431 787419052 788521347 789467239
$$ packed form
2303G99872894K4414j29089k28577k45971j85776p8812L0594J01700J11771N7602m5167
2314G99285583j71813k95868l93830m46396m44412l91540l08686k32849k02026k38114
2324G96160049l29971m34570m95072m72030l68424k31247j26953j00708j48163k20108
2334G93232803k60086k52685k47956l38974n94863r89914j373597j513977j203003
2343G86457748l76052Q22906K069244K976685L253021K818985J831055O06003n13230
2352G99946365j287460j644516j663208j500244j306458j172027j118469j120301j139984
2361G87993698j144180j110840j023941q74329o65664m23050j91574j7243P1106Q4992
2371G82698975P2097R6512K08283M17251O85654R44138J121521J174621J102295R45892
$$ plain form
2381 789467239 790233383 790853806 791392059 791906509 792420959 792915726 793335800 793620758 793734741 793687897 793539352
2392 793539352 793377228 793287430 793321915 793481140 793715820 793949051 794106750 794145813 794069595 793923340 793775787
2403 793775787 793690338 793701019 793797684 793930588 794029694 794034958 793920822 793710327 793466339 793265991 793168488
2414 793168488 793187790 793286972 793392868 793427277 793341370 793135223 792859344 792594147 792418594 792379913 792475662
2425 792475662 792656326 792842560 792955322 792944489 792807465 792588043 792360001 792198639 792148514 792208252
2435 792208252 792329712 792439346 792469940 792388153 792208786 791987762 791797485 791697235 791708145 791805801 791932526
2446 791932526 792020340 792020416 791922989 791759949 791592331 791483841 791471710 791548996 791664810 791744461 791720428 791564789
2458 791564789 791302032 791001587 790749588 790612259 790608139 790701523 790818558 790879593 790830994 790664062 790415039
$$ packed form
2381G89467239P66144O20423N38253N14450TM94767M20074K84958J13983m6844j48545
2392G93539352j62124q9798L4485J59225K34680K33231J57699L9063p6218j46255j47553
2403G93775787q5449J0681R6665J32904R9106N264j14136k10495k43988k00348r7503
2414G93168488J9302R9182J05896L4409q5907k06147k75879k65197j75553l8681R5749
2425G92475662J80664J86234J12762j0833j37024k19422k28042j61362n0125N9738
2435G92208252J21460J09634L0594q1787j79367k21024j90277j00250J0910R7656J26725
2446G91932526Q7814P6r7427j63040j67618j08490j2131P7286J15814P9651k4033j55639
2458G91564789k62757l00445k51999j37329m120R3384J17035O1035m8599j66932k49023
$$ plain form
2469 790415039 790146408 789921570 789782028 789735947 789758530 789805069 789827423 789790726 789687119 789536743 789382553
2480 789382553 789271851 789237061 789279175 789362946 789428406 789414825 789286118 789051056 788760910 788490677 788307495
2491 788307495 788243256 788280716 788363647 788421631 788401413 788289566 788114319 787931671 787797852 787744064 787763367
2502 787763367 787814407 787839279 787788010 787637787 787403717 787131729 786882095 786706696 786629257 786635818 786678772
2513 786678772 786693420 786623230 786440964 786161270 785836334 785535889 785320053 785215530 785204620 785232773 785230713
2524 785230713 785143890 784955215 784691544 784412079 784186096 784062119 784052124 784125290 784222336 784279099 784252167
2535 784252167 784135666 783962936 783789597 783669891 783630524 783658371 783705978 783711777 783631134 783458023 783229065
2546 783229065 783010330 782866135 782829971 782889709 782991486 783065796 783056870 782945404 782754745 782536926 782347870
$$ packed form
2469G90415039k68631k24838j39542m6081K2583M6539K2354l6697j03607j50376j54190
2480G89382553j10702l4790M2114Q3771O5460j3581j28707k35062k90146k70233j83182
2491G88307495o4239L7460Q2931N7984k0218j11847j75247j82648j33819n3788J9303
2502G87763367N1040K4872n1269j50223k34070k71988k49634j75399p7439O561M2954
2513G86678772J4648p0190j82266k79694l24936l00445k15836j04523j0910K8153k060
2524G85230713q6823j88675k63671k79465k25983j23977r995P3166R7046N6763k6932
2535G84252167j16501j72730j73339j19706l9367K7847M7607N799q0643j73111k28958
2546G83229065k18735j44195l6164N9738J01777P4310q926j11466j90659k17819j89056
$$ plain form
2557 782347870 782223740 782167587 782152252 782135391 782077255 781956711 781777344 781563644 781351242 781174545 781056976
2568 781056976 781004639 781006317 781038895 781074829 781091156 781078262 781040421 780992737 780953369 780932159 780924149 780907822
2580 780907822 780852051 780728912 780524521 780248795 779932098 779618378 779346771 779140167 778995438 778889160
2590 778889160 778786163 778657150 778490219 778295517 778100586 777936783 777824936 777766571 777742157 777719421
2600 777719421 777666550 777565536 777418900 777248383 777086182 776962357 776891098 776867523 776868362 776861954 776822281
2611 776822281 776738510 776620407 776494141 776390915 776333923 776326599 776350403 776370544 776349258 776259766 776098404
2622 776098404 775885696 775658722 775457764 775310364 775223465 775181351 775154190 775111465 775032883 774915695 774773407
2633 774773407 774627533 774498825 774398270 774323120 774260178 774190369 774098129 773976898 773833847 773688126 773566284
$$ packed form
2557G82347870j24130n6153j5335j6861n8136j20544j79367k13700k12402j76697j17569
2568G81056976n2337J678L2578L5934J6327j2894l7841m7684l9368k1210q010j6327
2580G80907822n5771j23139k04391k75726l16697l13720k71607k06604j44729j06278
2590G78889160j02997j29013j66931j94702j94931j63803j11847n8365k4414k2736
2600G77719421n2871j01014j46636j70517j62201j23825p1259k3575Q39o408l9673
2611G76822281q3771j18103j26266j03226n6992p324K3804K0141k1286q9492j61362
2622G76098404k12708k26974k00958j47400q6899m2114k7161m2725p8582j17188j42288
2633G74773407j45874j28708j00555p5150o2942o9809r2240j21231j43051j45721j21842
$$ plain form
2644 773566284 773492966 773482056 773529968 773615494 773705292 773766403 773777466 773736038 773658524 773572845 773504105 773465576
2656 773465576 773452988 773449326 773434601 773395615 773332825 773259354 773193436 773149338 773129883 773124008 773111115 773069153
2668 773069153 772981644 772845840 772672501 772484665 772310638 772174072 772087860 772047958 772035065 772021027 771979065
2679 771979065 771895752 771775436 771639862 771516571 771427917 771377335 771348801 771312256 771237411 771108017 770928421
2690 770928421 770721970 770519257 770344391 770204697 770088654 769973450 769836731 769666214 769465942 769253235
2700 769253235 769050293 768877335 768744278 768649445 768581924 768525620 768465271 768389359 768293076 768177338 768045959
2711 768045959 767903900 767753220 767592010 767415161 767216949 766995316 766754379 766504288 766257553 766023254
2721 766023254 765802383 765584564 765352402 765087967 764781418 764437561 764076691 763729324 763426514 763190231
$$ packed form
2644G73566284p3318j0910M7912Q5526Q9798O1111J1063m1428p7514q5679o8740l8529
2656G73465576j2588l662j4725l8986o2790p3471o5918m4098j9455n875j2893m1962
2668G73069153q7509j35804j73339j87836j74027j36566q6212l9902j2893j4038m1962
2679G71979065q3313j20316j35574j23291q8654n0582k8534l6545p4845j29394j79596
2690G70928421k06451k02713j74866j39694j16043j15204j36719j70517k00272k12707
2700G69253235k02942j72958j33057r4833o7521n6304o0349p5912r6283j15738j31379
2711G68045959j42059j50680j61210j76849j98212k21633k40937k50091k46735k34299
2721G66023254k20871k17819k32162k64435l06549l43857l60870l47367l02810k36283
$$ plain form
2731 763190231 763028107 762932587 762886047 762867050 762856903 762841721 762812271 762763824 762693481 762602234 762494812
2742 762494812 762377625 762258530 762142105 762028427 761913528 761793594 761669235 761547318 761437454 761348495
2752 761348495 761281128 761225586 761165771 761084747 760973740 760834045 760675125 760506516 760330353 760136108 759905090
2763 759905090 759616776 759259338 758836670 758367081 757875977 757385559 756905289 756428986 755939102 755418320
2773 755418320 754859848 754274368 753689728 753138809 752650299 752236099 751889496 751590958 751317520 751050873
2783 751050873 750780029 750499649 750202560 749877319 749509888 749087830 748607254 748074112 747500992 746900177
2793 746900177 746275864 745624847 744939194 744213257 743449097 742655945 741847458 741034775 740220947 739403076
2803 739403076 738573151 737723160 736849442 735951691 735032806 734093628 733130646 732134705 731091003 729983368
$$ packed form
2731G63190231j62124r5520m6540j8997j0147j5182k9450m8447p0343r1247j07422
2742G62494812j17187j19095j16425j13678j14899j19934j24359j21917j09864q8959
2752G61348495o7367n5542n9815q1024j11007j39695j58920j68609j76163j94245k31018
2763G59905090k88314l57438m22668m69589m91104m90418m80270m76303m89884n20782
2773G55418320n58472n85480n84640n50919m88510m14200l46603k98538k73438k66647
2783G51050873k70844k80380k97089l25241l67431m22058m80576n33142n73120o00815
2793G46900177o24313o51017o85653p25937p64160p93152q08487q12683q13828q17871
2803G39403076q29925q49991q73718q97751r18885r39178r62982r95941j043702j107635
$$ plain form
2813 729983368 728796158 727517624 726139297 724655304 723057556 721336212 719480438 717478638 715322495
2822 715322495 713001404 710499344 707788086 704826889 701567459 697960587 693958282 689508896 684540558
2831 684540558 678949890 672597504 665316391 656923141 647213287 635937881 622776146 607343788
2839 607343788 589282570 568448715 545159950 520401497 495872459 473784332 456416626 445553207
2847 445553207 441992531 445328102 454095917 466247826 479768372 493208237 505941658 518091698
2855 518091698 530196648 542793770 556092949 569851036 583446083 596075668 606970825 615549088
2863 615549088 621490974 624756813 625582924 624469566 622147064 619492798 617393112 616564941 617401466
2872 617401466 619888611 623634109 627995491 632260361 635815926 638257179 639411926 639301071 638066368
$$ packed form
2813G29983368j187210j278534j378327j483993j597748j721344j855774k001800k156143
2822G15322495k321091k502060k711258k961197l259430l606872m002305m449386m968338
2831F84540558n590668o352386p281113q393250r709854j1275406j3161735j5432358
2839F07343788j8061218k0833855k3288765k4758453k4529038k2088127j7367706j0863419
2847D45553207l560676L335571Q767815J2151909J3520546J3439865J2733421J2150040
2855E18091698J2104950J2597122J3299179J3758087J3595047J2629585J0895157Q578263
2863F15549088N941886L265839Q26111j113358k322502k654266k099686q28171Q36525
2872F17401466K487145L745498M361382M264870L555565K441253J154747j10855j234703
$$ plain form
2881 638066368 635899925 632998199 629538574 625671997 621519165 617165947 612662735 608029671 603270798
2890 603270798 598393364 593421822 588401680 583389206 578432808 573551292 568719673 563862114 558857117
2899 558857117 553545647 547742844 541245193 533834114 525275459 515318642 503706131 490200920
2907 490200920 474641380 457022171 437586174 416898422 395869026 375698051 357733116 343268394
2915 343268394 333328438 328497200 328839340 333931503 342986908 355031662 369076958 384250298
2923 384250298 399863091 415424080 430616760 445262909 459287720 472688141 485500908 497773666
2931 497773666 509534798 520774574 531440659 541450233 550714874 559168892 566792107 573618622
2939 573618622 579727402 585211754 590130157 594448204 597990837 600431709 601335106 600266647 596943893
$$ packed form
2881F38066368k166443k901726l459625l866577m152832m353218m503212m633064m758873
2890F03270798m877434m971542n020142n012474m956398m881516m831619m857559n004997
2899E58857117n311470n802803o497651p411079q558655r956817j1612511j3505211
2907D90200920j5559540j7619209j9435997k0687752k1029396k0170975j7964935j4464722
2915C43268394r939956m831238L42140N092163R055405J2044754J4045296J5173340
2923C84250298J5612793J5560989J5192680J4646149J4024811J3400421J2812767J2272758
2931D97773666J1761132J1239776J0666085J0009574R264641Q454018P623215O826515
2939E73618622O108780N484352M918403M318047L542633K440872R03397j068459l322754
$$ plain form
2948 596943893 591389732 584029160 575682983 567448959 560494270 555824471 554101982 555562439 560046082
2957 560046082 567116737 576206284 586742058 598216553 610200577 622326622 634266472 645728531
2965 645728531 656474228 666341934 675258484 683229141 690304108 696537857 701957550 706557236
2973 706557236 710318756 713251877 715433350 717028961 718282089 719472809 720854568 722595901 724741898
2982 724741898 727216492 729857025 732473984 734908600 737071075 738946991 740577240 742022552 743331757
2991 743331757 744525681 745599670 746538925 747337418 748007889 748582306 749101868 749603195 750108185 750619202
3001 750619202 751122284 751594925 752016296 752376251 752679520 752944412 753196793 753460846 753748093 754053879
3011 754053879 754358139 754633560 754858856 755027237 755151749 755259399 755378494 755526428 755699768 755875092
$$ packed form
2948E96943893n554161p360572q346177q234024o954689m669799j722489J460457M483643
2957E60046082P070655R089547J0535774J1474495J1984024J2126045J1939850J1462059
2965F45728531J0745697R867706Q916550P970657P074967O233749N419693M599686
2973G06557236L761520K933121K181473J595611J253128J190720J381759J741333K145997
2982G24741898K474594K640533K616959K434616K162475J875916J630249J445312J309205
2991G43331757J193924J073989R39255P98493O70471N74417N19562N01327N04990N11017
3001G50619202N03082M72641M21371L59955L03269K64892K52381K64053K87247L05786
3011G54053879L04260K75421K25296J68381J24512J07650J19095J47934J73340J75324
$$ plain form
3021 755875092 756019135 756104507 756122513 756090317 756042938 756021118 756053009 756143036 756270447 756399994 756497269
3032 756497269 756544113 756545486 756526108 756517563 756546249 756622009 756735229 756861572 756972122 757041626 757057953 757024231
3044 757024231 756958694 756888275 756840134 756830902 756858978 756900864 756918411 756873474 756743774 756536636 756288910
3055 756288910 756055603 755887375 755808640 755806885 755836182 755834961 755750809 755559692 755274506 754935989 754595566
3066 754595566 754294434 754050903 753857193 753691254 753530655 753369064 753224030 753131790 753134384 753260193
3076 753260193 753508224 753843307 754203339 754520340 754740906 754843826 754844818 754785843 754715500 754669495 754658966
3087 754658966 754669342 754674225 754649658 754590454 754514008 754456024 754455643 754539337 754709549 754939499 755183487 755389481
3099 755389481 755518875 755560684 755536194 755491409 755480194 755543976 755694046 755908279 756137390 756325150 756430054
$$ packed form
3021G55875092J44043Q5372J8006l2196m7379k1820L1891R0027J27411J29547R7275
3032G56497269M6844J373j9378q545K8686P5760J13220J26343J10550O9504J6327l3722
3044G57024231o5537p0419m8141r232K8076M1886J7547m4937j29700k07138k47726
3055G56288910k33307j68228p8735j755K9297j221q4152j91117k85186l38517l40423
3066G54595566l01132k43531j93710j65939j60599j61591j45034r2240K594J25809
3076G53260193K48031L35083L60032L17001K20566J02920R92n8975p0343m6005j0529
3087G54658966J0376M883k4567n9204p6446n7984l81Q3694J70212K29950K43988K05994
3099G55389481J29394M1809k4490m4785j1215O3782J50070K14233K29111J87760J04904
$$ plain form
3110 756430054 756442108 756387253 756316071 756282272 756319275 756423264 756551819 756641998 756633377 756497879 756252441
3121 756252441 755955429 755683899 755502472 755435562 755458832 755509262 755514679 755424271 755231018 754973145 754715805
3132 754715805 754521942 754426117 754420700 754461060 754486313 754442825 754306870 754090729 753836670 753599014 753423080
3143 753423080 753327332 753296738 753287506 753243179 753116150 752886581 752572632 752226028 751914825 751697617 751599045
3154 751599045 751599045 751637802 751637955 751534576 751300507 750958328 750569382 750210037 749938965 749775543 749693298 749634705
3166 749634705 749536743 749358749 749098587 748791046 748491516 748249512 748087234 747990036 747912140 747796402
3176 747796402 747598648 747306213 746944656 746565857 746228027 745969391 745792236 745661392 745519638 745312042
3186 745312042 745011902 744631805 744218903 743834915 743528442 743316879 743177795 743062057 742913361 742692032
$$ packed form
3110G56430054J2054n4855p1182l3799L7003J03989J28555R0179q621j35498k45438
3121G56252441k97012k71530j81427o6910K3270N0430N417r0408j93253k57873k57340
3132G54715805j93863r5825n417M0360K5253m3488j35955k16141k54059k37656j75934
3143G53423080r5748l0594r232m4327j27029k29569l13949l46604l11203k17208r8572
3154G51599045%L8757J53j03379k34069l42179l88946l59345k71072j63422q2245n8593
3166G49634705r7962j77994k60162l07541k99530k42004j62278r7198p7896j15738
3176G47796402j97754k92435l61557l78799l37830k58636j77155j30844j41754k07596
3186G45312042l00140l80097m12902l83988l06473k11563j39084j15738j48696k21329
$$ plain form
3196 742692032 742388000 742023773 741642227 741289673 740999527 740779724 740611877 740458221 740275269 740029907
3206 740029907 739710922 739335632 738942947 738579559 738281937 738060837 737895050 737739563 737541428 737261658
3216 737261658 736892624 736460266 736016464 735616684 735298004 735061798 734872589 734671478 734401169 734030609
3226 734030609 733569946 733066940 732588348 732191162 731898804 731691437 731515198 731306534 731019440 730643616
3236 730643616 730207520 729762955 729362183 729036331 728784714 728576508 728365021 728106003 727774963 727375488
3246 727375488 726938095 726510010 726136551 725844193 725628738 725453720 725263443 725005417 724650955 724211884
3256 724211884 723736801 723293610 722941895 722708130 722574921 722488327 722379150 722192612 721908264 721546402
3266 721546402 721158371 720803070 720522003 720324478 720182190 720042725 719851151 719571228 719202423 718778839
$$ packed form
3196G42692032l04032l64227l81546l52554k90146k19803j67847j53656j82952k45362
3206G40029907l18985l75290l92685l63388k97622k21100j65787j55487j98135k79770
3216G37261658l69034m32358m43802l99780l18680k36206j89209k01111k70309l70560
3226G34030609m60663n03006m78592l97186k92358k07367j76239k08664k87094l75824
3236G30643616m36096m44565m00772l25852k51617k08206k11487k59018l31040l99475
3246G27375488m37393m28085l73459k92358k15455j75018j90277k58026l54462m39071
3256G24211884m75083m43191l51715k33765j33209q6594j09177j86538k84348l61862
3266G21546402l88031l55301k81067j97525j42288j39465j91574k79923l68805m23584
$$ plain form
3276 718778839 718357086 717994080 717724152 717546158 717424469 717305374 717137833 716894150 716578140 716219940
3286 716219940 715859222 715528030 715235443 714967117 714693222 714382324 714017029 713601074 713157730 712720718
3296 712720718 712322311 711978836 711686554 711419754 711138763 710802917 710383606 709874649 709295197 708683014
3306 708683014 708081589 707524109 707021027 706557083 706098328 705608902 705065613 704469376 703846359 703234100
3316 703234100 702665939 702154617 701683807 701213989 700694962 700086670 699374924 698578491 697744598 696931458
3326 696931458 696187515 695532837 694952393 694400406 693820724 693169022 692430344 691624985 690796204 689990692
3336 689990692 689234009 688518600 687808456 687053680 686214371 685279160 684267654 683223877 682196884
3345 682196884 681223068 680315781 679464417 678643188 677821808 676976242 676094513 675178299 674241333 673303757
$$ packed form
3276G18778839m21753l63006k69928j77994j21689j19095j67541k43683l16010l58200
3286G16219940l60718l31192k92587k68326k73895l10898l65295m15955m43344m37012
3296G12720718l98407l43475k92282k66800k80991l35846m19311n08957n79452o12183
3306G08683014o01425n57480n03082m63944m58755m89426n43289n96237o23017o12259
3316G03234100n68161n11322m70810m69818n19027o08292p11746p96433q33893q13140
3326F96931458p43943o54678n80444n51987n79682o51702p38678q05359q28781q05512
3336F89990692p56683p15409p10144p54776q39309r35211j011506j043777j026993
3345F82196884r73816r07287q51364q21229q21380q45566q81729r16214r36966r37576
$$ plain form
3355 673303757 672385101 671497498 670638046 669787979 668917618 667996750 667007980 665957260 664872513 663794556
3365 663794556 662760086 661786652 660865173 659965439 659051666 658099823 657109299 656103210 655118637 654186249
3375 654186249 653318710 652502136 651702576 650879364 650002594 649063873 648082886 647098160 646156616 645294800
3385 645294800 644527588 643843307 643208237 642580338 641927032 641237106 640524445 639820633 639157028 638550148
3395 638550148 637991600 637452965 636900597 636312599 635692558 635067558 634475441 633947601 633492775 633094444
3405 633094444 632718468 632328911 631901169 631430244 630928497 630418434 629923477 629460831 629039307 628657532
3415 628657532 628306236 627970695 627635040 627289352 626933708 626580582 626250572 625963020 625725098 625527802
3425 625527802 625347710 625159416 624949074 624722900 624507484 624338303 624245377 624239998 624310646 624428291 624557343
$$ packed form
3355F73303757r18656q87603q59452q50067q70361r20868r88770j050720j084747j077957
3365F63794556j034470r73434r21479q99734r13773r51843r90524j006089r84573r32388
3375F54186249q67539q16574p99560q23212q76770r38721r80987r84726r41544q61816
3385F45294800p67212o84281o35070o27899o53306o89926p12661p03812o63605o06880
3395F38550148n58548n38635n52368n87998o20041o25000n92117n27840m54826l98331
3405F33094444l75976l89557m27742m70925n01747n10063m94957m62646m21524l81775
3415F28657532l51296l35541l35655l45688l55644l53126l30010k87552k37922j97296
3425F25527802j80092j88294k10342k26174k15416j69181r2926n379P0648J17645J29052
$$ plain form
3436 624557343 624667244 624740410 624773216 624774055 624758835 624745407 624750938 624787636 624860649 624968719 625105057 625263405
3448 625263405 625440674 625639496 625864830 626117554 626389313 626662216 626913567 627127037 627302895 627459984
3458 627459984 627631683 627852631 628144989 628510246 628929062 629369659 629799309 630195045 630550308 630874367
3468 630874367 631188240 631519814 631892662 632318993 632792969 633287697 633763466 634180069 634514313 634770889
3478 634770889 634982681 635197906 635458794 635784073 636161690 636557503 636935921 637278748 637594528 637913284
3488 637913284 638271065 638692665 639181862 639723015 640288239 640847702 641375961 641854248 642271957 642629013
3498 642629013 642938919 643228226 643530655 643874741 644270172 644704666 645148544 645572739 645965805 646341782
3508 646341782 646734543 647181168 647701263 648289566 648917389 649548569 650154648 650724716 651263428 651782608
$$ packed form
3436F24557343J09901P3166L2806Q39j5220j3428N531L6698P3013J08070J36338J58348
3448F25263405J77269J98822K25334K52724K71759K72903K51351K13470J75858J57089
3458F27459984J71699K20948K92358L65257M18816M40597M29650L95736L55263L24059
3468F30874367L13873L31574L72848M26331M73976M94728M75769M16603L34244K56576
3478F34770889K11792K15225K60888L25279L77617L95813L78418L42827L15780L18756
3488F37913284L57781M21600M89197N41153N65224N59463N28259M78287M17709L57056
3498F42629013L09906K89307L02429L44086L95431M34494M43878M24195L93066L75977
3508F46341782L92761M46625N20095N88303O27823O31180O06079N70068N38712N19180
$$ plain form
3518 651782608 652290192 652784348 653255234 653689957 654083405 654443741 654794388 655169525 655603561 656115799
3528 656115799 656699600 657319870 657927628 658483963 658984070 659468002 660003204 660650406 661424103 662273788
3538 662273788 663101196 663804245 664328690 664696045 664990768 665317383 665746307 666286697 666892853 667500000
3548 667500000 668066330 668590775 669104385 669647369 670249557 670930328 671712112 672626266 673696671 674905319
3558 674905319 676159744 677293396 678113556 678479614 678377228 677944870 677434387 677123108 677214355 677774124
3568 677774124 678723984 679886856 681061249 682090378 682907333 683549194 684138184 684839706 685798187
3577 685798187 687073212 688594513 690165329 691520309 692427292 692786865 692686615 692374039 692160110
3586 692160110 692296219 692880173 693836136 694965286 696040649 696896591 697474518 697820816 698051987 698309021
$$ packed form
3518F51782608N07584M94156M70886M34723L93448L60336L50647L75137M34036N12238
3528F56115799N83801O20270O07758N56335N00107M83932N35202O47202P73697Q49685
3538F62273788Q27408P03049N24445L67355K94723L26615M28924N40390O06156O07147
3548F67500000N66330N24445N13610N42984O02188O80771P81784R14154J070405J208648
3558F74905319J254425J133652Q20160L66058j02386m32358n10483l11279R1247N59769
3568F77774124R49860J162872J174393J029129Q16955O41861N88990P01522R58481
3577F85798187J275025J521301J570816J354980R06983L59573j00250l12576k13929
3586F92160110J36109N83954R55963J129150J075363Q55942N77927L46298K31171K57034
$$ plain form
3596 698309021 698721161 699382858 700335388 701554718 702946167 704356842 705609512 706555862 707129135
3605 707129135 707379227 707468796 707629013 708078003 708931808 710136871 711464310 712581787 713191910 713184662
3615 713184662 712731934 712261429 712295990 713217773 715059586 717439423 719681931 721086426 721221466
3624 721221466 720105515 718194580 716183929 714730835 714220581 714677887 715826035 717253189 718586731
3633 718586731 719617462 720343094 720937805 721671829 722803040 724459381 726548920 728735046 730511475
3642 730511475 731372681 731018448 729505310 727260971 724937897 723166351 722319183 722394485 723069763
3651 723069763 723881760 724446335 724608154 724470978 724313965 724450684 725099182 726307449 727948456 729769516
3661 729769516 731477966 732830124 733699951 734101410 734152679 733994522 733700409 733226852 732439957 731207733
$$ packed form
3596F98309021M12140O61697R52530J219330J391449J410675J252670R46350N73273
3605G07129135K50092Q9569J60217M48990Q53805J205063J327439J117477O10123p248
3615G13184662m52728m70505L4561R21783J841813K379837K242508J404495J35040
3624G21221466j115951j910935k010651j453094n10254M57306J148148J427154J333542
3633G18586731J030731P25632N94711P34024J131211J656341K089539K186126J776429
3642G30511475Q61206l54233j513138k244339k323074j771546q47168P5302O75278
3651G23069763Q11997N64575J61819j37176j57013J36719O48498J208267J641007J821060
3661G29769516J708450J352158Q69827M01459N1269j58157k94113m73557p86895j232224
$$ plain form
3671 731207733 729516220 727539215 725624084 724190140 723589554 723991547 725337830 727367096 729687500
3680 729687500 731860886 733476791 734221191 733939285 732686310 730742340 728563156 726665955 725482635
3689 725482635 725233917 725877457 727144547 728643646 729986496 730886612 731218185 731028824 730520401
3698 730520401 730000763 729799271 730157928 731123352 732487030 733822861 734623718 734501114 733357239
3707 733357239 731454391 729332581 727617187 726788101 727018814 728142166 729746246 731348114 732561340
3716 732561340 733196259 733267746 732932434 732404861 731890106 731557999 731543579 731942520 732778854 733952866
3726 733952866 735199738 736115341 736272659 735407715 733594131 731301880 729278030 728266754 728685226
3735 728685226 730416718 732837524 735086060 736445389 736644592 735923920 734832687 733883514 733264999
$$ packed form
3671G31207733j691513j977005j915131j433944o00586M01993J346283K029266K320404
3680G29687500K173386J615905P44400k81906j252975j943970k179184j897201j183320
3689G25482635k48718O43540J267090J499099J342850R00116L31573j89361n08423
3698G30520401n19638k01492L58657R65424J363678J335831Q00857j22604j143875
3707G33357239j902848k121810j715394q29086K30713J123352J604080J601868J213226
3716G32561340O34919P1487l35312n27573n14755l32107j4420L98941Q36334J174012
3726G33952866J246872R15603J57318q64944j813584k292251k023850j011276M18472
3735G28685226J731492K420806K248536J359329J99203p20672j091233r49173o18515
$$ plain form
3744 733264999 732774811 732004929 730655212 728779831 726813889 725362549 724880371 725430298 726657028
3753 726657028 727983093 728906631 729231796 729112930 728910980 728960648 729385300 730047913 730643997 730866699
3763 730866699 730551376 729739914 728652115 727596893 726868591 726656189 726991959 727742081 728647156 729407578
3773 729407578 729789734 729707870 729251785 728630295 728065948 727692108 727507095 727409210 727286606 727098618
3783 727098618 726906128 726830521 726981506 727400208 728054199 728872070 729785767 730737000 731651535 732407608
3793 732407608 732842407 732810364 732263794 731298599 730126343 728976135 727990112 727176285 726460342 725798264
3803 725798264 725270996 725089340 725487442 726565475 728182907 729974518 731489105 732379303 732527466
3812 732527466 732048340 731177673 730126801 728999710 727811890 726582413 725419235 724524460 724109726
$$ packed form
3744G33264999m90188p69882j349717j875381j965942j451340m82178N49927J226730
3753G26657028J326065R23538L25165j18866k01950M9668M24652O62613N96084K22702
3763G30866699l15323q11462j087799j055222p28302k12402L35770P50122R05075P60422
3773G29407578L82156q1864m56085o21490n64347l73840j85013r7885j22604j87988
3783G27098618j92490p5607J50985M18702O53991Q17871R13697R51233R14535P56073
3793G32407608M34799l2043n46570r65195j172256j150208r86023q13827p15943o62078
3803G25798264n27268j81656L98102J078033J617432J791611J514587Q90198J48163
3812G32527466m79126q70667j050872j127091j187820j229477j163178q94775m14734
$$ plain form
3821 724109726 724279251 724959030 725930557 726942825 727837448 728601608 729313965 730026093 730661316 731005554
3831 731005554 730808334 729930344 728451233 726661911 724944229 723608551 722788620 722455368 722536316
3840 722536316 723051071 724154434 726036682 728713989 731837158 734659729 736229630 735761490 733018188
3849 733018188 728510208 723388824 719048004 716605988 716500549 718372498 721287842 724169464 726230164
3858 726230164 727208557 727330170 727055054 726776962 726629257 726481705 726090698 725296173 724143677 722882004
3868 722882004 721849747 721327362 721432037 722093201 723102264 724195023 725129852 725733490 725921555
3877 725921555 725699158 725150528 724417877 723667755 723045120 722630539 722417984 722325821 722245865 722103806
3887 722103806 721913681 721787109 721892624 722372055 723251648 724389420 725492096 726201172 726220322 725425110
$$ packed form
3821G24109726J69525O79779R71527J012268Q94623P64160P12357P12128O35223L44238
3831G31005554j97220q77990j479111j789322j717682j335678q19931l33252Q0948
3840G22536316N14755J103363J882248K677307L123169K822571J569901m68140k743302
3849G33018188m507980n121384m340820k442016j05439J871949K915344K881622K060700
3858G26230164R78393J21613k75116k78092j47705j47552l91007p94525j152496j261673
3868G22882004j032257n22385J04675O61164J009063J092759R34829O03638J88065
3877G25921555k22397n48630p32651p50122o22635m14581k12555r2163p9956j42059
3887G22103806j90125j26572J05515M79431Q79593J137772J102676P09076J9150p95212
$$ plain form
3897 725425110 723913803 721973572 719982529 718292160 717141113 716619873 716691818 717237167 718096848
3906 718096848 719102554 720091095 720920563 721486206 721737289 721685410 721393280 720952530 720459442 719994278
3916 719994278 719612198 719341278 719185333 719129715 719151993 719232864 719360199 719518433 719670486 719745636 719652634
3927 719652634 719326859 718784637 718151703 717633286 717425079 717611618 718111649 718708725 719158707 719310379
3937 719310379 719169006 718867569 718569183 718368301 718254013 718147736 717979813 717742310 717483826 717261734
3947 717261734 717094803 716959229 716824722 716691437 716591721 716548843 716534348 716468124 716271820 715939255 715561371
3958 715561371 715274048 715161591 715186996 715212326 715097733 714806061 714427032 714096222 713872299 713677597
3968 713677597 713362656 712844620 712210083 711673431 711411209 711393204 711364975 711024475 710269241 709314957
$$ packed form
3897G25425110j511307j940231j991043j690369j151047n21240P1945N45349Q59681
3906G18096848J005706R88541Q29468N65643K51083n1879k92130m40750m93088m65164
3916G19994278l82080k70920j55945n5618K2278Q0871J27335J58234J52053P5150r3002
3927G19652634l25775n42222o32934n18417k08207J86539N00031N97076M49982J51672
3937G19310379j41373l01437k98386k00882j14288j06277j67923k37503k58484k22092
3947G17261734j66931j35574j34507j33285r9716m2878j4495o6224j96304l32565l77884
3958G15561371k87323j12457K5405K5330j14593k91672l79029l30810k23923j94702
3968G13677597l14941n18036o34537n36652k62222j8005k8229l40500p55234r54284
$$ plain form
3978 709314957 708557205 708249130 708244934 708047485 707172318 705578384 703795547 702561340 702170944 702039413
3988 702039413 700932083 697862244 693078690 688285675 685556946 685243530 684024277 674523544 647298431
3997 647298431 594711685 514987526 414341164
4000 414341164
$$ packed form
3978G09314957p57752l08075m196j97449q75167j593934j782837j234207l90396j31531
3988G02039413j107330l069839m783554m793015k728729l13416j219253r500733k7225113
3997F47298431n2586746p9724159j00646362
4000D14341164
##END=$$ End of the data block
