##TITLE=$$ Begin of the data block
##JCAMP-DX=5.00 $$ ACD/SpecManager v 10.08
##SPECTROMETER/DATA SYSTEM=Varian
##DATE=24 Apr 2013 09:18:26
##DATA TYPE=INFRARED SPECTRUM
##DATA CLASS=XYDATA
##ORIGIN=
##OWNER=
##NPOINTS=3735
##FIRSTX=399.26403809
##LASTX=4000.35498047
##MAXX=4000.35498047
##MINX=399.26403809
##MAXY=67.16749573
##MINY=13.00953484
##XFACTOR=1.0000000000
##YFACTOR=0.000000100000000
##FIRSTY=65.23219299
##DELTAX=0.96440572
##XUNITS=1/CM
##YUNITS=TRANSMITTANCE
##XYDATA=(X++(Y..Y))
$$ plain form
399.3 652321930 647373352 646758499 646234360 641557617 628485336 605673523 588097382 570521278
407 570521278 567484055 573644485 588776588 611057091 632914543 641161575 625351830 587507896
414.7 587507896 542489243 508101463 495315399 506846657 540527344 589417953 639154358
421.4 639154358 670812988 671674957 644275208 603652649 565852470 540129128 530528374 539582062
429.2 539582062 565898857 599051208 621880569 621790428 600224686 570378761 546284447 534766998
436.9 534766998 535896416 547044258 564191628 581074867 590564308 588589783 576363869 558546371
444.6 558546371 539803886 522782173 507394333 490601807 468252602 440087357 413963966
451.3 413963966 403015289 415805740 448337708 486269188 515143394 528418961 527244034 516020927
$$ packed form
399.3F52321930m948578o14853n24139m676743j3072281k2811813j7576141j7576104
407E70521278l037223O160430J5132103K2280503K1857452Q247032j5809745l7843934
414.7E87507896m5018653l4387780j2786064J1531258L3680687M8890609M9736405
421.4F39154358L1658630Q61969k7399749m0622559l7800179k5723342r600754R053688
429.2E39582062K6316795L3152351K2829361r0141k1565742k9845925k4094314j1517449
436.9E34766998J129418J1147842J7147370J6883239R489441j974525j2225914j7817498
444.6E58546371j8742485j7021713j5387840j6792526k2349205k8165245k6123391
451.3D13963966j0948677J2790451L2531968L7931480K8874206J3275567j174927j1223107
$$ plain form
459.1 516020927 500581436 489048233 490124969 507487068 535965919 564656410 584317551 592016602
466.8 592016602 590341415 584743652 582187042 589432259 608736992 634000931 653040924 656065979
474.5 656065979 642830505 621594505 601767044 588219109 581593819 581214447 585543404 590587616
482.2 590587616 590630150 582486115 568891640 556677513 551220207 552763939 557617264 561725578
489.9 561725578 562533722 558404694 548072739 531729965 512250786 494102211 479857445 467084160
497.6 467084160 448712006 417551155 372427177 321665611 280790291 265045319 281344128
504.4 281344128 325070305 383572235 443129654 494239273 532737236 558262825 572771797
511.1 572771797 579899101 584120979 589115562 596277657 604571533 611625175 615050049 613405838
$$ packed form
459.1E16020927j5439491j1533203J076736J7362099K8478851K8690491J9661141P699051
466.8E92016602j675187n597763k556610P245217J9304733K5263939J9039993L025055
474.5F56065979j3235474k1236000j9827461j3547935o625290l79372M328957N044212
482.2E90587616M2534q144035j3594475j2214127n457306J543732M853325M108314
489.9E61725578Q08144m129028j0331955j6342774j9479179j8148575j4244766j2773285
497.6D67084160j8372154l1160851m5123978n0761566m0875320j5744972J6298809
504.4B81344128M3726177N8501930N9557419N1109619L8497963K5525589J4508972
511.1E72771797P127304M221878M994583P162095Q293876P053642L424874j644211
$$ plain form
518.9 613405838 606916962 597801895 589600182 585468750 586626396 592172813 600030174 607688789
526.6 607688789 612339668 611484337 604727745 595268440 588735733 589386292 596856689 606610527 613557701
535.2 613557701 615260468 612195625 606110687 599022827 593406181 591864090 595405388 602047882
543 602047882 607878342 609950981 608070297 603808250 598444290 592511978 587077484 584314919 585903130
551.6 585903130 590929642 596061554 598189430 596815186 593810043 591209641 589623337 588579559
559.4 588579559 587735100 587333832 587742920 589041901 591140900 593927765 597008896 599439583 600035210
568 600035210 598121147 594014015 588898849 584391823 582086220 582989922 586861801 591973076 595824814
576.7 595824814 596500473 593638115 588395386 582756386 578825531 578201332 581214333 586366005 590779762
$$ packed form
518.9F13405838o488876r115067q201713m131432J157646N546417P857361P658615
526.6F07688789M650879q55331o756592r459305o532707O50559P470397R753838O947174
535.2F13557701J702767l064843o084938p087860n616646j542091L541298O642494
543F02047882N830460K072639j880684m262047n363960n932312n434494k762565J588211
551.6E85903130N026512N131912K127876j374244l005143k600402j586304j043778
559.4E88579559q44459m01268M09088J298981K098999K786865L081131K430687N95627
568F00035210j914063m107132n115166m507026k305603R03702L871879N111275L851738
576.7E95824814O75659k862358n242729n639000l930855o24199L013001N151672M413757
$$ plain form
585.4 590779762 591799240 588593559 582424469 575543747 569946976 566918449 567051773 570031700 574361267
594.1 574361267 577873383 579078598 578157234 576538010 575550346 575611992 576543694 578138657 580046463
602.8 580046463 581358185 580976067 578774605 576175575 575119514 576289177 578470497 579721603 579032097
611.4 579032097 576787262 573912621 571014366 568465004 566946106 567386131 570134697 574287529 577968979
620.1 577968979 579347000 577508316 572669830 565917358 558874168 553388252 551081352 552761383
627.8 552761383 557984695 565088387 571756859 575889740 576411667 573693161 569408760 565867462 565066376
636.5 565066376 567843552 573497734 580081062 585274887 587423286 586172447 582411804 577695465
644.2 577695465 573606148 571351318 571512070 573803558 577009811 579429474 579791298 578011856 575122948
$$ packed form
585.4E90779762J019478l205681o169090o880722n596771l028527J33324K979927M329567
594.1E74361267L512116J205215r21364j619224r87664O1646R31702J594963J907806
602.8E80046463J311722l82118k201462k599030j056061J169663K181320J251106o89506
611.4E79032097k244835k874641k898255k549362j518898M40025K748566M152832L681450
620.1E77968979J378021j838684m838486o752472p043190n485916k306900J680031
627.8E52761383N223312P103692O668472M132881N21927k718506m284401l541298q01086
636.5E65066376K777176N654182O583328N193825K148399j250839l760643m716339
644.2E77695465m089317k254830J60752K291488L206253K419663L61824j779442k888908
$$ plain form
652.9 575122948 572414169 570580330 569577789 569081268 568869286 568784561 568594322 568154564 567665863
661.6 567665863 567456779 567311859 566195183 563058968 558163605 553445129 551229134 552362747 555574150
670.3 555574150 558641472 560102844 559897614 558726807 557251053 555982666 555502434 556222038 557785950
678.9 557785950 558977051 558468246 555674820 550865936 544720078 538111572 532155113 527655449 523778381
687.6 523778381 517482681 505474854 487977524 470819435 462869186 469978180 490375099 515632248
695.3 515632248 536391144 547875328 550952454 549071884 544896317 539556046 533852196 528763313
703.1 528763313 524274902 518416595 508688545 495230217 482456093 476800957 482033653 496251450
710.8 496251450 513216743 526653633 533677940 534971924 532643623 528325768 522800865 516405220
$$ packed form
652.9E75122948k708779j833839j002541m96521k11982q4725j90239m39758m88701
661.6E67665863k09084j44920j116676l136215m895363m718476k215995J133613L211403
670.3E55574150L067322J461372k05230j170807j475754j268387m80232P19604J563912
678.9E57785950J191101n08805k793426m808884o145858o608506n956459m499664l877068
687.6E23778381o295700j2007827j7497330j7158089p950249P108994K0396919K5257149
695.3E15632248K0758896J1484184L077126j880570m175567n340271n703850n088883
703.1E28763313m488411n858307r728050j3458328j2774124n655136N232696J4217797
710.8D96251450J6965293J3436890P024307J293984k328301m317855n524903o395645
$$ plain form
718.5 516405220 509097786 500297546 489370613 476876945 465422401 458897934 460268745 469480171
726.2 469480171 483117981 496171913 504694290 507523041 505993690 502129784 496920891 489947357
733.9 489947357 480141296 466429634 447556801 421814499 387851067 346494446 302082100 261965523
741.6 261965523 234447803 226479664 241902599 280091991 335115471 396533699 452717667 495456696
749.3 495456696 522836418 538290596 546854057 551812363 554039001 553529167 550976448 547957764
757.1 547957764 546034966 545893097 547162628 548819122 549790459 549482918 548007278 545991249 544114189
765.7 544114189 542711449 541687889 540690994 539363556 537567291 535516853 533703308 532562904 532115822
774.4 532115822 531917725 531376686 530108452 528034286 525308266 522324028 519745140 518256950 518045959
$$ packed form
718.5E16405220p307434q800240j0926933j2493668j1454544o524467J370811R211426
726.2D69480171J3637810J3053932Q522377K828751j529351l863906n208893o973534
733.9D89947357r806061j3711662j8872833k5742302l3963432m1356621m4412346m0116577
741.6B61965523k7517720p968139J5422935L8189392N5023480O1418228N6183968M2739029
749.3D95456696K7379722J5454178Q563461M958306K226638n09834k552719l018684
757.1E47957764j922798j41869J269531J656494R71337l07541j475640k016029j877060
765.7E44114189j402740j023560r96895j327438j796265k050438j813545j140404m47082
774.4E32115822j98097n41039j268234k074166k726020k984238k578888j488190k10991
$$ plain form
783.1 518045959 518513260 518657074 517833405 516140251 514091530 512056808 510106125 508269348 506697655
791.8 506697655 505469284 504367065 503011742 501219940 499141655 497049332 495095177 493300896
799.5 493300896 491643486 490006638 488106461 485672684 482826080 480188789 478451996 477751732 477475815
808.2 477475815 476674004 474645119 471207619 466599159 461264343 455681953 450192032 444827614 439284973
816.9 439284973 433083954 425745850 416801720 405677032 391652260 374011688 352375603 327207565
824.6 327207565 300390205 275393047 256385899 246304951 245052795 249421654 255132904 259531364
832.3 259531364 262855968 267325172 275141487 287068863 302240982 318731728 334279137 347013893
840 347013893 356122665 362053108 365942154 368661995 370348282 370763931 369917107 368170967 365862846
$$ packed form
783.1E18045959M67301J43814q23669j693154k048721k034722j950683j836777j571693
791.8E06697655j228371j102219j355323j791802k078285k092323j954155j794281
799.5D93300896j657410j636848j900177k433777k846604k637291j736793p00264k75917
808.2D77475815q01811k028885l437500m608460n334816n582390n489921n364418n542641
816.9D39284973o201019p338104q944130j1124688j4024772j7640572k1636085k5168038
824.6C27207565k6817360k4997158j9007148j0080948j252156M368859N711250M398460
832.3B59531364L324604M469204P816315J1927376J5172119J6490746J5547409J2734756
840C47013893R108772N930443L889046K719841J686287M15649q46824j746140k308121
$$ plain form
848.7 365862846 363089409 359967232 356909065 354393997 352454681 350575600 348190231 345182228
856.4 345182228 341815071 338295479 334624252 330893669 327504768 324873581 322940559 321128540
864.1 321128540 318854809 316018295 312964706 310097618 307650623 305776176 304643459 304316101 304599400
872.8 304599400 305143337 305735931 306448326 307488003 308982410 310929756 313277054 315935631 318733425
881.5 318733425 321471977 324119759 326919250 330222549 334183731 338616219 343142090 347463570
889.2 347463570 351531601 355555763 359907112 364932632 370707512 376881409 382814598 387968788
896.9 387968788 392227707 395858269 399200439 402445564 405696831 409120407 412898712 417003059
904.6 417003059 421099701 424775162 427879944 430625877 433340988 436161118 438966789 441574059
$$ packed form
848.7C65862846k773437l122177l058167k515068j939316j879081k385369l008003
856.4C45182228l367157l519592l671227l730583l388901k631187j933022j812019
864.1C21128540k273731k836514l053589k867088k446995j874447j132717l27358K83299
872.8C04599400N43937N92594P12395J039677J494407J947346K347298K658577K797794
881.5C18733425K738552K647782K799491L303299L961182M432488M525871M321480
889.2C47463570M068031M024162M351349N025520N774880O173897N933189N154190
896.9C87968788M258919L630562L342170L245125L251267L423576L778305M104347
904.6D17003059M096642L675461L104782K745933K715111K820130K805671K607270
$$ plain form
912.3 441574059 443927841 446106377 448186913 450150223 451903687 453368912 454543266 455508003 456389618
921 456389618 457291832 458239365 459190903 460121994 461082115 462132072 463212280 464116974 464648514 464794006
930.7 464794006 464704895 464490662 464086685 463385201 462473068 461649017 461149101 460886955 460526962 459805756
940.3 459805756 458719978 457370110 455696869 453477669 450622330 447419930 444425430 442053223
948 442053223 440228195 438375282 435757217 431963882 427272911 422619781 419102135 417296600 416924362
956.7 416924362 417186279 417480621 417824059 418592529 419914436 421383743 422360916 422479820 421828499
965.4 421828499 420700302 419260292 417446098 415092163 412077484 408387833 404116821 399415855
973.1 399415855 394372749 388884773 382672806 375467339 367191544 357945557 347832375 336848335
$$ packed form
912.3D41574059K353782K178536K080536J963310J753464J465225J174354R64737Q81615
921D56389618R02214R47533R51538R31091R60121J049957J080208R04694N31540J45492
930.7D64794006q9111k14233m03977p01484r12133q24051m99916k62146l59993p21206
940.3D59805756j085778j349868j673241k219200k855339l202400k994500k372207
948D42053223j825028j852913k618065l793335m690971m653130l517646j805535l72238
956.7D16924362K61917K94342L43438P68470J321907J469307R77173J18904o51321
965.4D21828499j128197j440010j814194k353935l014679l689651m271012m700966
973.1C99415855n043106n487976o211967p205467q275795r245987j0113182j0984040
$$ plain form
980.8 336848335 324959335 312238636 298908691 285336933 272144871 260390148 251506252 246759968
988.5 246759968 246444988 249438305 253651581 257325249 260445366 265288849 275459156 293666840
996.2 293666840 319472065 348541489 374209824 390602264 395384750 390394363 379944534 368247871
1004 368247871 357801018 349467163 343482819 340080414 339226913 340136757 341446419 342019882 341391411
1012.6 341391411 339136238 333861618 323457413 307315407 288987484 276489944 278891277 300999126
1020.3 300999126 339970093 386451187 429419861 461268311 480007782 488041687 489321060 487080688
1028.1 487080688 483112030 478147125 472465897 466209068 459410820 452000961 443925552 435311699
1035.8 435311699 426486168 417769966 409201126 400446205 390991287 380435295 368643570 355718269
$$ packed form
980.8C36848335j1889000j2720699j3329945j3571758j3192062j1754723q883896m746284
988.5B46759968l14980K993317M213276L673668L120117M843483J0170307J8207684
996.2B93666840K5805225K9069424K5668335J6392440M782486m990387j0449829j1696663
1004C68247871j0446853q333855n984344l402405q53501R09844J309662N73463o28471
1012.6C41391411k255173n274620j0404205j6142006j8327923j2497540K401333K2107849
1020.3C00999126L8970967M6481094M2968674L1848450J8739471Q033905J279373k240372
1028.1D87080688l968658m964905n681228o256829o798248p409859q075409q613853
1035.8D35311699q825531q716202q568840q754921r454918j0555992j1791725j2925301
$$ plain form
1043.5 355718269 341930237 327706451 313586864 300042515 287240105 274982834 262936974
1050.2 262936974 250996704 239543571 229492760 222172852 219071655 221393166 229443130 242115879
1058 242115879 256922569 270779934 281219540 287232456 289136467 287648392 283126125 275862675
1065.7 275862675 267246952 260468082 259482746 266429863 279349728 292307167 298417721 294076939
1073.4 294076939 281657982 268816299 264615459 274616413 297760773 326931000 352893143
1080.1 352893143 369145317 374582329 372526054 367418022 362058868 357359428 354096413 354491692
1087.9 354491692 361940994 379123650 406111984 439904518 475575523 508177223 534303932
1094.6 534303932 552695618 563898544 569448433 571103058 570391579 568425522 565839729 562851524
$$ packed form
1043.5C55718269j3788032j4223786j4119587j3544349j2802410j2257271j2045860
1050.2B62936974j1940270j1453133j0050811p319908l101197K321511Q049964J2672749
1058B42115879J4806690J3857365J0439606O012916J904011j488075m522267p263450
1065.7B75862675q615723o778870r85336O947117J2919865J2957439O110554m340782
1073.4B94076939j2418957j2841683m200840J0000954K3144360K9170227K5962143
1080.1C52893143J6252174N437012k056275n108032n359154m699440l263015L95279
1087.9C54491692P449302J7182656K6988334L3792534L5671005L2601700K6126709
1094.6E34303932J8391686J1202926N549889J654625p11479j966057k585793k988205
$$ plain form
1102.3 562851524 559472733 555750771 551830406 547823105 543728676 539574928 535570679 531973190
1110 531973190 528753319 525481682 521564636 516393280 509062233 498184853 482755699 463980980
1117.7 463980980 446376076 436320152 438403816 452314301 472946243 493671379 509995308
1124.5 509995308 520872269 527430229 531013145 532301598 531599541 529295883 525873795 521680870
1132.2 521680870 516848831 511376305 505230637 498521156 491806641 486249161 483192596 483261909 485729179
1140.9 485729179 488798294 490610962 490119972 487241249 482449799 476335678 469332771 461493263
1148.6 461493263 452277527 440566864 425003891 404468307 378504715 347864685 315338211
1155.4 315338211 286380291 268435249 268370838 289046230 327250977 374693832 421616364 460762062
$$ packed form
1102.3E62851524l378791l721962l920365m007301m094429m153748m004249l597489
1110E31973190l219871l271637l917046n171356p331047j0877380j5429154j8774719
1117.7D63980980j7604904j0055924K083664J3910485K0631942K0725136J6323929
1124.5E09995308J0876961O557960L582916J288453p02057k303658l422088m192925
1132.2E21680870m832039n472526o145668o709481o714515n557480l056565O9313K467270
1140.9D85729179L069115J812668m90990k878723m791450o114121p002907p839508
1148.6D61493263r215736j1710663j5562973k0535584k5963592l0640030l2526474
1155.4C15338211k8957920j7945042o4411K0675392L8204747M7442855M6922532L9145698
$$ plain form
1163.1 460762062 489386063 508614159 521254196 529777832 535500870 538867836 540110512 539639587
1170.8 539639587 538031464 535850029 533556938 531526604 530020714 529071312 528419952 527675552 526617432
1179.5 526617432 525369873 524263763 523514671 523020248 522425499 521329155 519425926 516537819 512647629
1188.1 512647629 508001862 503209610 499211311 497074280 497658997 501251144 507307701 514519463
1195.9 514519463 521285629 526398468 529492187 530942421 531368370 531214676 530715790 530087204 529581871
1204.5 529581871 529316101 529122887 528669891 527730789 526304092 524487343 522334290 519911385 517453461
1213.2 517453461 515344391 513852043 512879715 512014580 510839882 509220390 507335587 505502319 503977203
1221.9 503977203 502862473 502116890 501627541 501297073 501092834 501020775 501066170 501185379 501359596 501615829
$$ packed form
1163.1D60762062K8624001J9228096J2640037Q523636N723038L366966J242676m70925
1170.8E39639587j608123k181435k293091k030334j505890r49402o51360p44400j058120
1179.5E26617432j247559j106110p49092m94423n94749j096344j903229k888107l890190
1188.1E12647629m645767m792252l998299k137031N84717L592147O056557P211762
1195.9E14519463O766166N112839L093719J450234M25949j53694m98886o28586n05333
1204.5E29581871k65770j93214m52996r39102j426697j816749k153053k422905k457924
1213.2E17453461k109070j492348r72328q65135j174698j619492j884803j833268j525116
1221.9E03977203j114730p45583m89349l30468k04239p2059M5395J19209J74217K56233
$$ plain form
1231.5 501615829 501947098 502219582 502209435 501757011 500861397 499606247 498026276 496094093 493809357
1240.2 493809357 491206970 488226929 484633713 480154343 474696045 468342361 461101761 452779083
1247.9 452779083 443285217 433185425 423910713 417316742 414890060 417185669 423773880 433522072
1255.7 433522072 444931908 456459084 466853828 475431328 482083168 487003784 490367584 492210159
1263.4 492210159 492527618 491399536 488989868 485456429 480875587 475223198 468381805 460158119
1271.1 460158119 450338516 438821030 425866165 412464180 400655975 393439217 393911476 403796539
1278.8 403796539 422165260 445357094 468413277 487223396 500016708 507365265 511013489 512598381
1286.5 512598381 513081932 512897758 512276573 511363449 510193672 508750725 507079773 505230217 503012962
$$ packed form
1231.5E01615829L31269K72484j0147m52424q95614j255150j579971j932183k284736
1240.2D93809357k602387k980041l593216m479370n458298o353684p240600q322678
1247.9D52779083r493866j0099792r274712o593971k426682K295609O588211R748192
1255.7D33522072J1409836J1527176J0394744Q577500O651840M920616L363800J842575
1263.4D92210159L17459j128082k409668l533439m580842n652389o841393q223686
1271.1D60158119r819603j1517486j2954865j3401985j1808205p216758M72259R885063
1278.8D03796539J8368721K3191834K3056183J8810119J2793312P348557L648224J584892
1286.5E12598381M83551j84174o21185r13124j169777j442947j670952j849556k217255
$$ plain form
1295.2 503012962 499927521 495569382 490272331 485292740 482143974 481559906 483046150 485451469
1302.9 485451469 487960014 490502930 493274307 496027145 498000946 498543053 497695122 496103897 494414291
1311.6 494414291 492823563 491184044 489381981 487499428 485646744 483783340 481793327 479704285
1319.3 479704285 477748680 476182137 475077209 474316635 473752327 473318825 472992020 472697601 472316704
1328 472316704 471786270 471160622 470560074 470074158 469725075 469494514 469333496 469125633 468684464 467850952
1337.6 467850952 466626358 465195312 463800735 462595825 461622276 460898819 460471802 460351524 460431252
1346.3 460431252 460526619 460514488 460410614 460295906 460190659 460031471 459759293 459380112 458910751 458281250
1355.9 458281250 457320366 455833168 453690414 450890846 447638016 444413223 441902313 440683670
$$ packed form
1295.2E03012962l085441m358139n297051m979591l148766n84068J486244K405319
1302.9D85451469K508545K542916K771377K752838J973801N42107q47931j591225j689606
1311.6D94414291j590728j639519j802063j882553j852684j863404j990013k089042
1319.3D79704285j955605j566543j104928p60574n64308m33502l26805k94419l80897
1328D72316704n30434o25648o00548m85916l49083k30561j61018k07863m41169q33512
1337.6D67850952j224594j431046j394577j204910r73549p23457m27017j20278P9728
1346.3D60431252R5367j2131j03874j14708j05247j59188k72178l79181m69361o29501
1355.9D58281250r60884j487198k142754k799568l252830l224793k510910j218643
$$ plain form
1363.7 440683670 440836449 441813774 442754250 443008308 442449188 441359978 440083351 438785477 437472649
1372.3 437472649 436121216 434721222 433213921 431456604 429304543 426743202 423934441 421124649
1380.1 421124649 418505287 416154289 414092865 412360764 411000443 409956589 409020767 407917137
1387.8 407917137 406457672 404585953 402242889 399208794 395142479 389832840 383436623 376485558
1395.5 376485558 369681587 363661652 358826599 355193405 352299194 349375153 345921516 342365837
1403.2 342365837 340154953 340944443 345374870 352424355 359904327 365677299 368615036 368689346 366426544
1411.9 366426544 362356033 356808701 349963722 341956711 333037758 323763542 314974461 307306156
1419.6 307306156 300459480 292935734 282720032 268510189 250469379 229906445 208346405 186983376
$$ packed form
1363.7D40683670J52779R77325R40476K54058n59120j089210j276627j297874j312828
1372.3D37472649j351433j399994j507301j757317k152061k561341k808761k809792
1380.1D21124649k619362k350998k061424j732101j360321j043854r35822j103630
1387.8D07917137j459465j871719k343064l034095m066315n309639o396217o951065
1395.5C76485558o803971o019935m835053l633194k894211k924041l453637l555679
1403.2C42365837k210884P89490M430427P049485P479972N772972K937737P4310k262802
1411.9C66426544m070511n547332o844979q007011q918953r274216q789081p668305
1419.6C07306156o846676p523746j0215702j4209843j8040810k0562934k1560040k1363029
$$ plain form
1427.3 186983376 166911716 149581146 136765985 130095348 130789480 139861937 158193245 185830002
1435 185830002 220870609 259183521 295711117 326596870 350477562 368058968 380680046 389269218
1442.7 389269218 394315872 396309509 395862007 393446426 389257889 383454437 376450310 368883820
1450.5 368883820 361386871 354587097 349410439 347196121 349177589 355567780 365044899 375199165
1458.2 375199165 383674774 389158249 391562042 391477089 389509087 386031609 381362419 375967331 370354652
1466.8 370354652 364730492 358784409 351854172 343339424 332991982 320861282 307021484 291382122
1474.6 291382122 273743935 253995953 232256794 208927746 184838028 161658611 142400475
1481.3 142400475 131347475 132743454 148387289 175593357 207519245 236580009 259116459
$$ packed form
1427.3A86983376k0071660j7330570j2815161o670637O94132R072457J8331308K7636757
1435A85830002L5040607L8312912L6527596L0885753K3880692J7581406J2621078Q589172
1442.7C89269218N046654J993637m47502k415581m188537n803452p004127p566490
1450.5C68883820p496949o799774n176658k214318J981468O390191R477119J0154266
1458.2C75199165Q475609N483475K403793q4953j968002l477478m669190n395088n612679
1466.8C70354652n624160n946083o930237q514748j0347442j2130700j3839798j5639362
1474.6B91382122j7638187j9747982k1739159k3329048k4089718k3179417j9258136
1481.3A42400475j1053000J395979J5643835K7206068L1925888K9060764K2536450
$$ plain form
1488.1 259116459 277859554 299941082 331642456 373787384 421126099 465717239 501314774
1494.8 501314774 525641823 539806328 546377678 547928810 546578522 543973465 541157913 538391228
1502.5 538391228 535261383 531182899 525975075 520122528 514540901 510016479 506729050 504220657
1510.2 504220657 501800652 498992310 495631638 491664009 487026711 481820564 476491051 471635170
1518 471635170 467517090 463823853 459988327 455757904 451404877 447416458 444085884 441457024 439559174
1526.6 439559174 438538780 438501854 439294586 440509949 441720200 442706070 443504677 444269524 445028343
1535.3 445028343 445486603 445080299 443359604 440436249 437012711 433834267 431049576 428157005 424603424
1544 424603424 420351791 415787697 411146774 406209564 400603409 394241219 387305946 379880219 371852570
$$ packed form
1488.1B59116459J8743095K2081528L1701374M2144928M7338715M4591140L5597535
1494.8E01314774K4327049J4164505O571350J551132j350288k605057k815552k766685
1502.5E38391228l129845m078484n207824n852547n581627m524422l287429k508393
1510.2E04220657k420005k808342l360672l967629m637298n206147n329513m855881
1518D71635170m118080l693237l835526m230423m353027l988419l330574k628860j897850
1526.6D39559174j020394l6926P92732J215363J210251R85870P98607P64847P58819
1535.3D45028343M58260m06304j720695k923355l423538l178444k784691k892571l553581
1544D24603424m251633m564094m640923m937210n606155o362190o935273p425727q027649
$$ plain form
1552.7 371852570 363331947 355022469 347949715 342737350 339252510 337030602 335958099 336419640
1560.4 336419640 338813705 343087769 348809624 355555878 363045235 370887718 378384666 384750061
1568.1 384750061 389556656 392911186 395191841 396678543 397461662 397630768 397438698 397231674 397230186
1576.8 397230186 397375984 397346001 396679573 394932404 391801147 387186584 381169701 373921204 365604286
1585.5 365604286 356322746 346117821 334986191 322914886 309937248 296200962 282017250
1592.2 282017250 267863712 254318199 241910248 230920029 221236324 212412395 203945580 195619259
1599.9 195619259 187676125 180735226 175557461 172811661 172890110 175766373 180959606 187718887 195398560
1608.6 195398560 203788147 213161087 224061604 237059498 252604179 270854340 291353359 312741508
$$ packed form
1552.7C71852570q520623q309478p072754n212365l484840k221908j072503M61541
1560.4C36419640K394065M274064N721855O746254P489357P842483P496948O365395
1568.1C84750061M806595L354530K280655J486702P83119J69106j92070k07024j488
1576.8C97230186J45798k9983o66428j747169l131257m614563o016883p248497q316918
1585.5C65604286r281540j0204925j1131630j2071305j2977638j3736286j4183712
1592.2B82017250j4153538j3545513j2407951j0990219r683705q823929q466815q326321
1599.9A95619259p943134o940899n177765k745800P8449K876263N193233O759281P679673
1608.6A95398560Q389587R372940J0900517J2997894J5544681J8250161K0499019K1388149
$$ plain form
1616.3 312741508 332928238 349880676 362573814 371369934 377521706 382252769 386184921 389454117
1624 389454117 392170181 394645920 397208366 399909897 402520561 404811058 406799164 408703690 410696373
1632.7 410696373 412750130 414736900 416635361 418601723 420829773 423357353 426014366 428542213
1640.4 428542213 430740814 432498436 433702316 434165840 433702240 432339478 430498466 428921051 428295288
1649.1 428295288 428797264 429922905 430805054 430819473 430000267 428942795 428320122 428462639 429313812
1657.8 429313812 430670128 432375221 434306984 436288147 438114738 439687004 441054306 442296448
1665.5 442296448 443387451 444226532 444802780 445272408 445813255 446394615 446731987 446511040 445682907
1674.2 445682907 444536896 443478508 442727127 442217255 441763649 441278038 440785103 440243530 439431267
$$ packed form
1616.3C12741508K0186730J6952438J2693138Q796120O151772M731063L932152L269196
1624C89454117K716064K475739K562446K701531K610664K290497J988106J904526J992683
1632.7D10696373K053757J986770J898461J966362K228050K527580K657013K527847
1640.4D28542213K198601J757622J203880M63524m63600j362762j841012j577415o25763
1649.1D28295288N01976J125641Q82149J4419q19206j057472o22673J42517Q51173
1657.8D29313812J356316J705093J931763J981163J826591J572266J367302J242142
1665.5D42296448J091003Q39081N76248M69628N40847N81360L37372k20947q28133
1674.2D45682907j146011j058388p51381n09872m53606m85611m92935n41573q12263
$$ plain form
1682.9 439431267 438110085 436335869 434542122 433218384 432472420 431955833 431262398 430359497 429551697
1691.5 429551697 429027824 428557510 427747841 426584015 425592117 425372543 425983238 426841698 427240982
1700.2 427240982 426921425 426146584 425319176 424622345 424015961 423458595 423028717 422835274 422873306 422992897
1709.9 422992897 422985535 422700653 422141113 421503677 421104622 421180649 421699562 422370758 422871284 423069267
1719.5 423069267 423032265 422861099 422589531 422261124 422029152 422081451 422434273 422848892 422995644 422698364
1729.1 422698364 422005348 421070175 420046387 419128380 418610687 418770370 419616013 420771027 421674461
1737.8 421674461 421952362 421642151 421104698 420755501 420843697 421386299 422207222 423017845 423526230 423563004
1747.5 423563004 423162651 422549400 422043419 421943245 422415390 423399200 424587860 425558243 426018906
$$ packed form
1682.9D39431267j321182j774216j793747j323738p45964n16587o93435r02901q07800
1691.5D29551697n23873m70314q09669j163826r91898k19574O10695Q58460L99284
1700.2D27240982l19557p74841q27408o96831o06384n57366m29878j93443L8032J19591
1709.9D22992897p362k84882n59540o37436l99055P6027N18913O71196N00526J97983
1719.5D23069267l7002j71166k71568l28407k31972N2299L52822M14619J46752k97280
1729.1D22698364o93016r35173j023788r18007n17693J59683Q45643J155014R03434
1737.8D21674461K77901l10211n37453l49197Q8196N42602Q20923Q10623N08385L6774
1747.5D23563004m00353o13251n05981j00174M72145R83810J188660R70383M60663
$$ plain form
1756.2 426018906 425988731 425728340 425479622 425278091 425025330 424708977 424486732 424518890 424745941 424881401
1765.8 424881401 424637032 423940506 422932014 421794014 420632553 419510384 418527946 417802086 417361336
1774.5 417361336 417097702 416854057 416560631 416283569 416151543 416253433 416598816 417144470 417830658 418598557
1784.1 418598557 419405441 420247231 421162949 422197571 423347015 424541588 425686226 426717453 427621613
1792.8 427621613 428409843 429095154 429702415 430286140 430916595 431631203 432402077 433155518 433822441 434367790
1802.4 434367790 434784317 435079231 435280380 435440865 435615730 435823746 436040421 436230507 436376534 436467094
1812.1 436467094 436471748 436356163 436131020 435869827 435663452 435565186 435591965 435755157 436040230 436334991
1821.7 436334991 436423836 436132240 435511055 434851608 434472466 434477005 434723129 435009079 435249176 435459709
$$ packed form
1756.2D26018906l0175k60391k48718k01531k52761l16353k22245L2158K27051J35460
1765.8D24881401k44369o96526j008492j138000j161461j122169r82438p25860m40750
1774.5D17361336k63634k43645k93426k77062j32026J01890L45383N45654O86188P67899
1784.1D18598557Q06884Q41790R15718J034622J149444J194573J144638J031227R04160
1792.8D27621613P88230O85311O07261N83725O30455P14608P70874P53441O66923N45349
1802.4D34367790M16527K94914K01149J60485J74865K08016K16675J90086J46027R0560
1812.1D36467094M654j15585k25143k61193k06375r8266K6779J63192K85073K94761
1821.7D36334991Q8845k91596o21185o59447l79142M539K46124K85950K40097K10533
$$ plain form
1831.4 435459709 435629616 435674973 435538177 435289574 435096512 435097008 435317459 435686378 436075630 436318054
1841 436318054 436247444 435801506 435112534 434459381 434083900 434033890 434177246 434347649 434458389 434494820
1850.7 434494820 434453354 434329338 434155693 434014015 433981590 434073753 434244499 434433479 434603882 434743347
1860.3 434743347 434853973 434950409 435053711 435166550 435256920 435273132 435185127 435007095 434781685 434547844
1869.9 434547844 434325752 434121399 433935661 433769646 433629341 433525009 433454437 433378181 433220215 432911072
1879.6 432911072 432443390 431890373 431371574 430996017 430817413 430809593 430861931 430809059 430508957 429930305
1889.2 429930305 429177742 428416824 427751770 427159805 426529579 425757027 424810219 423713913 422488670
1897.9 422488670 421103935 419485588 417567520 415347862 412906075 410372887 407882156 405546913
$$ packed form
1831.4D35459709J69907M5357j36796k48603j93062M96K20451L68919L89252K42424
1841D36318054p0610m45938o88972o53153l75481n0010J43356J70403J10740L6431
1850.7D34494820m1466j24016j73645j41678l2425R2163J70746J88980J70403J39465
1860.3D34743347J10626R6436J03302J12839R0370J6212q8005j78032k25410k33841
1869.9D34547844k22092k04353j85738j66015j40305j04332p0572p6256j57966l09143
1879.6D32911072m67682n53017n18799l75557j78604p820N2338n2872l00102n78652
1889.2D29930305p52563p60918o65054n91965o30226p72552r46808j096306j225243
1897.9D22488670j384735j618347j918068k219658k441787k533188k490731k335243
$$ plain form
1905.6 405546913 403464127 401716156 400345154 399330139 398618317 398204689 398179588 398678474 399772110
1914.3 399772110 401405449 403444710 405766411 408287926 410925255 413560295 416074181 418402061
1922 418402061 420527420 422417412 423989067 425162392 425947609 426461296 426855659 427235527 427639847
1930.7 427639847 428069763 428502655 428877029 429097557 429091568 428873062 428549652 428261719 428109055 428116112
1940.3 428116112 428235245 428368759 428401413 428251419 427919846 427499619 427130051 426923943 426915703 427049599
1950 427049599 427205124 427248573 427096138 426755867 426313171 425868301 425481339 425172157 424956322 424856758
1959.6 424856758 424869423 424931221 424944000 424838333 424612617 424314575 423999367 423711929 423487587 423341141
1969.3 423341141 423245659 423140373 422978630 422766533 422544518 422336388 422134819 421938820 421781578 421692200
$$ packed form
1905.6D05546913k082786j747971j371002j015015p11822m13628k5101M98886J093636
1914.3C99772110J633339K039261K321701K521515K637329K635040K513886K327880
1922D18402061K125359J889992J571655J173325P85217N13687L94363L79868M04320
1930.7D27639847M29916M32892L74374K20528n989k18506l23410k87933j52664P057
1940.3D28116112J19133J33514L2654j49994l31573m20227l69568k06108q240J33896
1950D27049599J55525M3449j52435l40271m42696m44870l86962l09182k15835r9564
1959.6D24856758J2665O1798J2779j05667k25716k98042l15208k87438k24342j46446
1969.3D23341141r5482j05286j61743k12097k22015k08130k01569j95999j57242q9378
$$ plain form
1978.9 421692200 421630669 421487007 421162643 420649338 420017357 419338036 418638687 417936211 417281532 416738358
1988.6 416738358 416313019 415931702 415506668 415022888 414550400 414178200 413950653 413866272 413907890 414042931
1998.2 414042931 414195900 414252434 414126587 413834915 413496552 413254395 413188553 413296242 413527527 413815575
2007.8 413815575 414077034 414212074 414145050 413884239 413537292 413252678 413131447 413182068 413340454 413518105
2017.5 413518105 413629608 413604698 413411484 413094711 412779694 412605133 412619858 412737579 412801819 412708702
2027.1 412708702 412473221 412183533 411906242 411647263 411399841 411200294 411110077 411138840 411204224 411187439
2036.8 411187439 411028366 410759735 410451927 410145950 409853401 409605598 409466934 409476357 409584579 409673691
2046.4 409673691 409650192 409516220 409347572 409216118 409143982 409122925 409145508 409196320 409222183 409143295 408912239
$$ packed form
1978.9D21692200o1531j43662l24364n13305o31981o79321o99349p02476o54679n43174
1988.6D16738358m25339l81317m25034m83780m72488l72200k27547q4381M1618J35041
1998.2D14042931J52969N6534j25847k91672l38363k42157o5842J07689K31285K88048
2007.8D13815575K61459J35040o7024k60811l46947k84614j21231N0621J58386J77651
2017.5D13518105J11503k4910j93214l16773l15017j74561J4725J17721O4240r3117
2027.1D12708702k35481k89688k77291k58979k47422j99547r0217K8763O5384j6785
2036.8D11187439j59073k68631l07808l05977k92549k47803j38664R423J08222Q9112
2046.4D09673691k3499j33972j68648j31454p2136k1057K2583N0812K5863p8888k31056
$$ plain form
2057 408912239 408562851 408188896 407871284 407626762 407416992 407191963 406917686 406579361 406183052 405764694
2066.7 405764694 405386314 405100403 404908905 404759865 404591217 404381828 404161453 403972321 403824234 403684578
2076.3 403684578 403508987 403282623 403031006 402792130 402578392 402365723 402123146 401853409 401596031 401387138
2086 401387138 401217155 401039124 400822754 400592499 400400467 400259323 400112076 399881248 399547920 399176941
2095.6 399176941 398860817 398642426 398491707 398347435 398167534 397939529 397656059 397300529 396861229 396355438
2105.2 396355438 395833893 395361710 394988670 394723358 394520607 394294739 393965302 393506432 392961502 392407150
2114.9 392407150 391902122 391471252 391125984 390873375 390688591 390489349 390170517 389688339 389106865 388545761
2124.5 388545761 388079376 387700615 387384949 387164230 387100868 387183342 387275620 387206154 386915474 386505432
$$ packed form
2057D08912239l49388l73955l17612k44522k09770k25029k74277l38325l96309m18358
2066.7D05764694l78380k85911j91498j49040j68648k09389k20375j89132j48087j39656
2076.3D03684578j75591k26364k51617k38876k13738k12669k42577k69737k57378k08893
2086D01387138j69983j78031k16370k30255j92032j41144j47247k30828l33328l70979
2095.6C99176941l16124k18391j50719j44272j79901k28005k83470l55530m39300n05791
2105.2C96355438n21545m72183l73040k65312k02751k25868l29437m58870n44930n54352
2114.9C92407150n05028m30870l45268k52609j84784j99242l18832m82178n81474n61104
2124.5C88545761m66385l78761l15666k20719o3362Q2474R2278o9466k90680m10042
$$ plain form
2134.2 386505432 386134491 385875854 385687599 385504150 385324020 385192261 385113945 385018311 384821548 384513817
2143.8 384513817 384175148 383909569 383774338 383764801 383843651 383965950 384082718 384146538 384134636 384067230 383994331
2154.4 383994331 383956604 383954086 383949623 383895493 383759499 383536339 383251190 382959328 382736778 382653923 382737198
2165 382737198 382941742 383157730 383260498 383181076 382953148 382694931 382529869 382501259 382545128 382539825 382389221
2175.6 382389221 382075729 381656723 381223068 380851898 380572853 380357018 380136871 379854965 379507484 379144287
2185.3 379144287 378822365 378558044 378327751 378109665 377910004 377739105 377569237 377330589 376963806 376474075
2194.9 376474075 375932922 375426140 375001030 374654961 374358444 374079781 373797073 373502197 373206253 372935410
2204.6 372935410 372709694 372518883 372321396 372072220 371759567 371418648 371111946 370889320 370755310 370664062
$$ packed form
2134.2C86505432l70941k58637j88255j83449j80130j31759p8316r5634j96763l07731
2143.8C84513817l38669k65579j35231r537P8850J22299J16768O3820j1902o7406p2899
2154.4C83994331l7727k518m463n4130j35994k23160k85149k91862k22550q2855Q3275
2165C82737198K04544K15988J02768p9422k27928k58217j65062k8610M3869n303j50604
2175.6C82389221l13492m19006m33655l71170k79045k15835k20147k81906l47481l63197
2185.3C79144287l21922k64321k30293k18086j99661j70899j69868k38648l66783m89731
2194.9C76474075n41153n06782m25110l46069k96517k78663k82708k94876k95944k70843
2204.6C72935410k25716j90811j97487k49176l12653l40919l06702k22626j34010r1248
$$ plain form
2214.2 370664062 370544548 370342064 370047455 369693604 369325256 368969154 368630753 368313789 368036041 367815857
2223.9 367815857 367642899 367464333 367211456 366850891 366419029 366005669 365693512 365494919 365336609 365108643
2233.5 365108643 364744606 364273453 363796844 363409958 363127823 362883606 362596474 362245483 361876945 361541862
2243.2 361541862 361230888 360876007 360420609 359882889 359353752 358930817 358655510 358498001 358382034 358215294
2252.8 358215294 357913399 357432175 356801186 356121254 355504303 354994926 354549904 354095688 353606262 353121300
2262.4 353121300 352695808 352346344 352050209 351785507 351553154 351360016 351196022 351038589 350874443 350703087
2272.1 350703087 350515938 350282669 349968529 349564934 349098129 348609619 348131027 347674942 347240524 346821861
2281.7 346821861 346416168 346029472 345672226 345340576 345001450 344603882 344112091 343529320 342887268 342219887
$$ packed form
2214.2C70664062j19514k02484k94609l53851l68348l56102l38401l16964k77748k20184
2223.9C67815857j72958j78566k52877l60565m31862m13360l12157j98593j58310k27966
2233.5C65108643l64037m71153m76609l86886k82135k44217k87132l50991l68538l35083
2243.2C61541862l10974l54881m55398n37720n29137m22935k75307j57509j15967j66740
2252.8C58215294l01895m81224o30989o79932o16951n09377m45022m54216m89426m84962
2262.4C53121300m25492l49464k96135k64702k32353j93138j63994j57433j64146j71356
2272.1C50703087j87149k33269l14140m03595m66805m88510m78592m56085m34418m18663
2281.7C46821861m05693l86696l57246l31650l39126l97568m91791n82771o42052o67381
$$ plain form
2291.4 342219887 341550636 340896606 340265579 339640312 338980255 338258820 337500038 336763268 336080894 335416107
2301 335416107 334689751 333843155 332864304 331763687 330554428 329274292 328009834 326860809 325861626
2309.7 325861626 324949150 324033432 323114128 322328606 321880989 321910095 322396355 323166428 323984146 324669228
2319.3 324669228 325168877 325534897 325830460 326055908 326167526 326153336 326058311 325910950 325637627 325081863
2329 325081863 324130058 322820015 321334534 319914513 318780823 318083458 317836113 317856236 317813301 317422733
2338.6 317422733 316647587 315717030 314938316 314490910 314379940 314527760 314853325 315272732 315687008 316013947
2348.3 316013947 316212101 316246319 316057835 315635548 315126247 314798775 314816380 315045052 315151424 314923840
2357.9 314923840 314463387 314023838 313708248 313395615 312968616 312521172 312255726 312197628 312103634 311701851
$$ packed form
2291.4C42219887o69251o54030o31027o25267o60057p21435p58782p36770o82374o64787
2301C35416107p26356q46596r78851j100617j209259j280136j264458j149025r99183
2309.7C25861626r12476r15718r19304p85522m47617K9106M86260P70073Q17718O85082
2319.3C24669228M99649L66020K95563K25448J11618j4190r5025j47361k73323n55764
2329C25081863r51805j310043j485481j420021j133690o97365k47345K0123m2935l90568
2338.6C17422733p75146r30557p78714m47406j10970J47820L25565M19407M14276L26939
2348.3C16013947J98154L4218j88484m22287n09301l27472J7605K28672J06372k27584
2357.9C14923840m60453m39549l15590l12633m26999m47444k65446n8098r3994m01783
$$ plain form
2367.6 311701851 310981464 310192661 309571724 309122639 308680305 308132114 307525616 306977768 306544418 306206951
2377.2 306206951 305945873 305774384 305692844 305641785 305521107 305251274 304810429 304229298 303568611 302893600
2386.8 302893600 302241344 301595306 300899429 300112801 299253902 298388481 297576218 296832905 296138935 295465450
2396.5 295465450 294788628 294086800 293346176 292569752 291774864 290979862 290197887 289446907 288755035 288144798
2406.1 288144798 287615719 287150517 286737251 286376877 286061649 285758362 285423813 285032043 284577045 284051266
2415.8 284051266 283441772 282761898 282075195 281464920 280973396 280578556 280237427 279935780 279679012 279438992
2425.4 279438992 279136314 278690853 278083172 277349300 276517982 275570374 274473782 273248367 271989079
2434.1 271989079 270821934 269844570 269099464 268580608 268243504 268010273 267788353 267503929 267126637
$$ packed form
2367.6C11701851p20387p88803o20937m49085m42334n48191o06498n47848m33350l37467
2377.2C06206951k61078j71489q1540n1059j20678k69833m40845n81131o60687o75011
2386.8C02893600o52256o46038o95877p86628q58899q65421q12263p43313o93970o73485
2396.5B95465450o76822p01828p40624p76424p94888p95002p81975p50980o91872o10237
2406.1B88144798n29079m65202m13266l60374l15228l03287l34549l91770m54998n25779
2415.8B84051266o09494o79874o86703o10275m91524l94840l41129l01647k56768k40020
2425.4B79438992l02678m45461o07681p33872q31318r47608j096592j225415j259288
2434.1B71989079j167145r77364p45106n18856l37104k33231k21920k84424l77292
$$ plain form
2442.8 267126637 266664543 266136494 265550518 264902515 264186497 263406315 262582016 261747780 260938034 260163765
2452.4 260163765 259403362 258618927 257787762 256919537 256046162 255200748 254405994 253669128 252975502 252285671
2462.1 252285671 251555767 250773926 249973030 249195004 248437500 247647514 246777229 245843716 244922752 244083481
2471.7 244083481 243336220 242646732 241985226 241344566 240715580 240072517 239408455 238783112 238312817 238091679
2481.3 238091679 238119011 238303185 238533230 238739014 238891983 238975983 238986282 238962784 239006157 239236450
2491 239236450 239718819 240422955 241245613 242069111 242802544 243386974 243788681 244004440 244073486 244066486
2500.6 244066486 244042721 244006062 243899879 243652630 243233662 242671108 242019272 241312294 240550194 239723816
2510.3 239723816 238849068 237974911 237166843 236480637 235942650 235536366 235201664 234855213 234429016 233898582
$$ packed form
2442.8B67126637m62094n28049n85976o48003p16018p80182q24299q34236q09746p74269
2452.4B60163765p60403p84435q31165q68225q73375q45414p94754p36866o93626o89831
2462.1B52285671p29904p81841q00896p78026p57504p89986q70285r33513r20964q39271
2471.7B44083481p47261o89488o61506o40660o28986o43063o64062o25343m70295k21138
2481.3B38091679K7332J84174K30045K05784J52969Q4000J0299k3498M3373K30293
2491B39236450M82369P04136Q22658Q23498P33433N84430M01707K15759O9046p000
2500.6B44066486k3765l6659j06183k47249m18968n62554o51836p06978p62100q26378
2510.3B39723816q74748q74157q08068o86206n37987m06284l34702l46451m26197n30434
$$ plain form
2519.9 233898582 233277740 232590942 231855087 231083050 230286789 229459763 228560410 227531853 226356106
2528.6 226356106 225088768 223831711 222667427 221616077 220647335 219715824 218781509 217815533 216816120
2537.3 216816120 215833092 214961567 214288292 213827305 213503609 213198471 212818432 212338600 211804085 211293793
2546.9 211293793 210865650 210508118 210136642 209646034 208981876 208165569 207258205 206316013 205390949 204562283
2556.6 204562283 203935566 203584213 203492374 203562984 203685093 203788605 203844490 203839703 203773251 203671494 203586597
2567.2 203586597 203567142 203636894 203799400 204047432 204350376 204638557 204824085 204855595 204746590 204542103
2576.8 204542103 204258633 203868160 203339558 202681217 201934986 201137981 200301361 199425659 198519459 197599163
2586.5 197599163 196680126 195772629 194877262 193968010 192989559 191897316 190717010 189550629 188496552
$$ packed form
2519.9B33898582o20842o86798p35855p72037p96261q27026q99353j028557j175747
2528.6B26356106j267338j257057j164284j051350r68742r31511r34315r65976r99413
2537.3B16816120r83028q71525o73275m60987l23696l05138l80039m79832n34515n10292
2546.9B11293793m28143l57532l71476m90608o64158q16307r07364r42192r25064q28666
2556.6B04562283o26717l51353r1839P0610J22109J03512N5885m787o6452j01757q4897
2567.2B03586597j9455O9752J62506K48032L02944K88181J85528L1510j09005k04487
2576.8B04542103k83470l90473n28602o58341p46231p97005q36620q75702r06200r20296
2586.5A97599163r19037r07497q95367r09252r78451j092243j180306j166381j054077
$$ plain form
2595.1 188496552 187550812 186597672 185511818 184270115 182964001 181710091 180562401 179508381 178527412
2603.8 178527412 177629871 176838398 176144695 175499287 174841518 174139729 173408127 172693520 172048855 171510601
2613.5 171510601 171090317 170778713 170551014 170368252 170183487 169963074 169708252 169446220 169187679 168892517
2623.1 168892517 168493805 167963657 167346554 166714897 166094036 165444107 164718952 163927250 163127460 162378483
2632.8 162378483 161727467 161243153 161020679 161105576 161404972 161707306 161824608 161729851 161553230 161457291
2642.4 161457291 161525707 161766338 162179527 162790928 163616161 164628124 165783558 167078457 168563194
2651.1 168563194 170296783 172291698 174497490 176821842 179154911 181384201 183408871 185156879
2658.8 185156879 186594753 187715721 188521481 189009953 189174175 189007626 188515568 187732449 186732311
$$ packed form
2595.1A88496552r45740r53140j085854j241703j306114j253910j147690j054020r80969
2603.8A78527412q97541p91473o93703o45408o57769p01789p31602p14607o44665n38254
2613.5A71510601m20284l11604k27699j82762j84765k20413k54822k62032k58541k95162
2623.1A68892517l98712n30148o17103o31657o20861o49929p25155p91702p99790p48977
2632.8A62378483o51016m84314k22474Q4897K99396L02334J17302r4757j76621r5939
2642.4A61457291O8416K40631M13189O11401Q25233J011963J155434J294899J484737
2651.1A68563194J733589J994915K205792K324352K333069K229290K024670J748008
2658.8A85156879J437874J120968Q05760M88472J64222j66549m92058p83119j000138
$$ plain form
2667.5 186732311 185612621 184457684 183307400 182154770 180963154 179682999 178267899 176707458
2675.2 176707458 175066223 173482533 172101898 170990047 170108509 169379482 168769569 168302670 167997322
2683.9 167997322 167812138 167668056 167515144 167360668 167221909 167067165 166817989 166410580 165841084 165142040
2693.5 165142040 164324131 163360996 162240543 161021614 159823580 158747025 157802591 156918631 156017561
2702.2 156017561 155085058 154171705 153340549 152623672 152024317 151541510 151170979 150876484 150574675 150169344
2711.8 150169344 149615984 148954067 148270884 147628632 147020416 146390514 145692015 144924889 144126701 143337431
2721.5 143337431 142577639 141856985 141193457 140616550 140149403 139793673 139535818 139370556 139313078 139387074
2731.1 139387074 139605598 139972477 140502110 141225348 142156906 143252726 144408569 145510597 146488886
$$ packed form
2667.5A86732311j119690j154937j150284j152630j191616j280155j415100j560441
2675.2A76707458j641235j583690j380635j111851q81538p29027o09913m66899l05348
2683.9A67997322j85184j44082j52912j54476j38759j54744k49176m07409n69496o99044
2693.5A65142040q17909r63135j120453j218929j198034j076555r44434q83960r01070
2702.2A56017561r32503r13353q31156p16877n99355m82807l70531k94495l01809m05331
2711.8A50169344n53360o61917o83183o42252o08216o29902o98499p67126p98188p89270
2721.5A43337431p59792p20654o63528n76907m67147l55730k57855j65262n7478P3996
2731.1A39387074K18524L66879N29633P23238R31558J095820J155843J102028R78289
$$ plain form
2739.8 146488886 147316589 147966070 148387299 148547459 148485527 148307619 148108444 147897501 147602110 147138910
2749.4 147138910 146475086 145629644 144642429 143566380 142487993 141531239 140814667 140390062 140219126
2758.1 140219126 140201979 140230379 140227394 140167150 140075808 140013227 140030680 140129051 140251980 140328722 140332184 140303879
2769.7 140303879 140329103 140492554 140852785 141441584 142270231 143325167 144563446 145926638 147373953
2778.4 147373953 148909426 150579348 152439489 154518681 156807976 159273462 161873302 164557171
2786.1 164557171 167260494 169913826 172473717 174947071 177378769 179805756 182214298 184534264
2793.8 184534264 186667843 188524094 190042038 191202888 192037220 192613850 193000412 193213806 193203945
2802.5 193203945 192895489 192262001 191377583 190406590 189541836 188931465 188632183 188602524 188728848 188863850
$$ packed form
2739.8A46488886Q27703O49481M21229J60160o1932j77908j99175k10943k95391m63200
2749.4A47138910o63824q45442r87215j076049j078387r56754p16572m24605j70936
2758.1A40219126j7147K8400k985o0244r1342o2581J7453R8371J22929P6742L462k8305
2769.7A40303879K5224J63451L60231N88799Q28647J054936J238279J363192J447315
2778.4A47373953J535473J669922J860141K079192K289295K465486K599840K683869
2786.1A64557171K703323K653332K559891K473354K431698K426987K408542K319966
2793.8A84534264K133579J856251J517944J160850Q34332N76630L86562K13394r861
2802.5A93203945l08456o33488q84418r70993q64754o10371k99282k9659J26324J35002
$$ plain form
2812.1 188863850 188857288 188569031 187877197 186699924 185034866 182988739 180765991 178611546 176740494
2820.8 176740494 175297947 174359035 173950386 174061394 174633427 175541000 176592426 177569485 178299847
2829.5 178299847 178722458 178893490 178914337 178827000 178558216 177957916 176897564 175346546 173379765
2838.2 173379765 171137466 168791656 166533146 164552364 162992115 161900501 161228580 160880375 160772095
2846.8 160772095 160860825 161139507 161622562 162328911 163251419 164322529 165411720 166382408 167168694
2855.5 167168694 167805252 168377838 168940983 169474697 169903965 170148449 170162411 169959526 169629230 169333057
2865.2 169333057 169262352 169566898 170302601 171433048 172870445 174517250 176288986 178133354 180051441
2873.8 180051441 182099686 184348335 186811218 189390297 191871777 193975430 195442085 196132278
$$ packed form
2812.1A88863850o562k88257o91834j177273j665058k046127k222748k154445j871052
2820.8A76740494j442547r38912m08649J11008N72033R07573J051426R77059P30362
2829.5A78299847M22611J71032K0847q7337k68784o00300j060352j551018j966781
2838.2A73379765k242299k345810k258510j980782j560249j091614o71921l48205j08280
2846.8A60772095Q8730K78682M83055P06349R22508J071110J089191R70688P86286
2855.5A67168694O36558N72586N63145N33714M29268K44484J3962k02885l30296k96173
2865.2A69333057p0705L04546P35703J130447J437397J646805J771736J844368J918087
2873.8A80051441K048245K248649K462883K579079K481480K103653J466655O90193
$$ plain form
2881.6 196132278 196094856 195551338 194778633 193957043 193091183 192059269 190729771 189044724 187023239
2890.2 187023239 184734917 182292042 179850864 177572937 175553818 173785229 172198429 170751610
2897.9 170751610 169475861 168448715 167741737 167404289 167480354 168018761 169052258 170568504 172499523
2906.6 172499523 174721165 177047310 179238338 181061630 182397213 183314037 184036407 184804554 185721264
2915.3 185721264 186690521 187475567 187826366 187606888 186879196 185919056 185144444 184961700 185595932 187011929
2925 187011929 188986855 191277866 193750229 196373425 199127121 201935139 204694519 207351456 209925461
2933.6 209925461 212458992 214956303 217382526 219709225 221939430 224085197 226138916 228084126
2941.3 228084126 229927330 231695175 233387032 234938507 236246948 237234039 237877159 238179684 238124886
$$ packed form
2881.6A96132278l7422n43518p72705q21590q65860j031914j329498j685047k021485
2890.2A87023239k288322k442875k441178k277927k019119j768589j586800j446819
2897.9A70751610j275749j027146p06978l37448P6065N38407J033497J516246J931019
2906.6A72499523K221642K326145K191028J823292J335583R16824P22370P68147R16710
2915.3A85721264R69257P85046L50799k19478p27692r60140p74612j82744O34232J415997
2925A87011929J974926K291011K472363K623196K753696K808018K759380K656937K574005
2933.6B09925461K533531K497311K426223K326699K230205K145767K053719J945210
2941.3B28084126J843204J767845J691857J551475J308441R87091O43120L02525n4798
$$ plain form
2950 238124886 237669029 236773930 235436974 233692818 231604195 229258747 226760788 224201679 221624393
2958.7 221624393 219021988 216377220 213702888 211040802 208426495 205869141 203377419 201007423
2966.4 201007423 198883724 197165642 195976067 195337334 195159130 195289745 195600109 196041393 196638470
2975.1 196638470 197440052 198477669 199757309 201252403 202868099 204404774 205588818 206180344 206080551
2983.8 206080551 205351162 204148998 202658958 201074314 199587460 198337440 197344341 196518269 195761356
2992.5 195761356 195066719 194512482 194165401 194012775 193988514 194038639 194133816 194229946 194257965 194182549 194061317
3003.1 194061317 194018631 194147072 194434624 194788151 195116081 195392361 195666142 196035576 196604462 197427864
3012.7 197427864 198473835 199647999 200887127 202237320 203826504 205740414 207924366 210207920
$$ packed form
2950B38124886m55857q95099j336956j744156k088623k345448k497959k559109k577286
2958.7B21624393k602405k644768k674332k662086k614307k557354k491722k369996
2966.4B01007423k123699j718082j189575o38733j78204J30615L10364M41284N97077
2975.1A96638470Q01582J037617J279640J495094J615696J536675J184044N91526r9793
2983.8B06080551p29389j202164j490040j584644j486854j250020r93099q26072p56913
2992.5A95761356o94637n54237l47081j52626k4261N0125R5177R6130K8019p5416j21232
3003.1A94061317m2686J28441K87552L53527L27930K76280K73781L69434N68886Q23402
3012.7A97427864J045971J174164J239128J350193J589184J913910K183952K283554
$$ plain form
3020.4 210207920 212420673 214475479 216357250 218066330 219599190 220969639 222211266 223334236
3028.1 223334236 224284744 224960155 225264530 225146751 224596710 223634930 222328758 220816212 219294567
3036.8 219294567 217969742 217005959 216510506 216539059 217094021 218109436 219448872 220927467 222349758
3045.5 222349758 223545876 224398975 224861050 224942074 224670219 224049091 223050346 221648121 219856834
3054.2 219856834 217732658 215345173 212757111 210036182 207278099 204614925 202205601 200223618
3061.9 200223618 198840904 198195419 198345509 199250546 200804024 202898560 205467472 208467751 211831436
3070.6 211831436 215434055 219103832 222650890 225885372 228613548 230629044 231724815 231742916 230649433
3079.2 230649433 228587170 225847321 222743568 219453907 215945492 212057114 207702427 203068027
$$ packed form
3020.4B10207920K212753K054806J881771J709080J532860J370449J241627J122970
3028.1B23334236R50508O75411L04375j17779n50041r61780j306172j512546j521645
3036.8B19294567j324825r63783m95453K8553N54962J015415J339436J478595J422291
3045.5B22349758J196118Q53099M62075Q1024k71855o21128r98745j402225j791287
3054.2B19856834k124176k387485k588062k720929k758083k663174k409324j981983
3061.9B00223618j382714o45485J50090R05037J553478K094536K568912L000279L363685
3070.6B11831436L602619L669777L547058L234482K728176K015496J095771J8101j093483
3079.2B30649433k062263k739849l103753l289661l508415l888378m354687m634400
$$ plain form
3087 203068027 198680573 195300102 193688545 194360523 197421989 202558708 209162598 216518173 223960876
3095.6 223960876 230971088 237221851 242604084 247210674 251247463 254894581 258200016 261077290
3103.4 261077290 263393936 265061817 266063652 266428623 266212521 265506725 264446697 263187408 261858387
3112 261858387 260537910 259263306 258057709 256946354 255958405 255124664 254477005 254043312 253841248
3120.7 253841248 253879719 254165173 254698143 255451717 256354370 257306499 258228474 259098072 259942150 260796165
3130.4 260796165 261678219 262602940 263604279 264726696 265984306 267339001 268734264 270157242 271660442
3139 271660442 273308926 275096092 276911373 278596725 280046654 281265507 282337894 283347816 284319305
3147.7 284319305 285221119 286013832 286685867 287250595 287722530 288107033 288409538 288647099 288843212 289015484
$$ packed form
3087B03068027m387454l380471j611557O71978L061466N136719O603890P355575P442703
3095.6B23960876P010212O250763N382233M606590M036789L647118L305435K877274
3103.4B61077290K316646J667881J001835L64971k16102p05796j060028j259289j329021
3112B61858387j320477j274604j205597j111355r87949q33741o47659m33693k02064
3120.7B53841248L8471K85454N32970P53574R02653R52129R21975Q69598Q44078Q54015
3130.4B60796165Q82054R24721J001339J122417J257610J354695J395263J422978J503200
3139B71660442J648484J787166J815281J685352J449929J218853J072387J009922R71489
3147.7B84319305R01814P92713O72035N64728M71935L84503L02505K37561J96113J72272
$$ plain form
3157.4 289015484 289176598 289346504 289555607 289824600 290139065 290455990 290743713 291020699 291348934 291784878
3167 291784878 292333908 292951279 293580055 294183807 294747066 295259781 295721970 296165848 296660538 297276173
3176.6 297276173 298031082 298876114 299731712 300539017 301278400 301950703 302564373 303150978 303780670 304535503
3186.3 304535503 305443821 306437588 307381878 308158665 308736362 309175873 309582939 310050602 310620022 311265888
3195.9 311265888 311907902 312453289 312853165 313131466 313359127 313599281 313876858 314196682 314575615 315041046
3205.6 315041046 315595970 316197929 316784668 317323093 317827187 318328228 318832493 319311104 319729061 320075912
3215.2 320075912 320368767 320630913 320873451 321096611 321303749 321510925 321742325 322016602 322332230 322663460
3224.9 322663460 322971039 323228493 323446808 323671875 323944511 324250717 324513931 324651642 324654770 324606705
$$ packed form
3157.4B89015484J61114J69906K09103K68993L14465L16925K87723K76986L28235M35944
3167B91784878N49030O17371O28776O03752N63259N12715M62189M43878M94690O15635
3176.6B97276173P54909Q45032Q55598Q07305P39383O72303O13670N86605O29692P54833
3186.3C04535503R08318R93767R44290P76787N77697M39511M07066M67663N69420O45866
3195.9C11265888O42014N45387L99876K78301K27661K40154K77577L19824L78933M65431
3205.6C15041046N54924O01959N86739N38425N04094N01041N04265M78611M17957L46851
3215.2C20075912K92855K62146K42538K23160K07138K07176K31400K74277L15628L31230
3224.9C22663460L07579K57454K18315K25067K72636L06206K63214J37711L128m8065
$$ plain form
3234.5 324606705 324612083 324693756 324766350 324718552 324530182 324304237 324188080 324265175 324516640 324862823 325214767
3245.1 325214767 325484390 325579987 325439034 325090523 324674492 324372330 324293900 324415245 324618645 324787331
3254.8 324787331 324872360 324888763 324870911 324835472 324777107 324681816 324542236 324368019 324190788 324057198 324002800
3265.4 324002800 324019508 324045677 323999901 323837967 323585358 323313560 323080101 322889252 322707787 322512894
3275 322512894 322320213 322167206 322075310 322030716 321994591 321924438 321790581 321584969 321324234 321039238 320750237
3285.6 320750237 320451660 320128403 319794083 319503593 319313068 319217224 319129314 318929768 318544617 317990417
3295.3 317990417 317360497 316779709 316359653 316161766 316168919 316279964 316346893 316244087 315923996 315423737
3304.9 315423737 314827881 314228172 313699055 313283577 312976456 312718716 312426586 312045288 311581154 311079617
$$ packed form
3234.5C24606705N378Q1673P2594m7798j88370k25945j16157P7095K51465L46183L51944
3245.1C25214767K69623R5597j40953l48511m16031l02162p8430J21345K03400J68686
3254.8C24787331Q5029J6403j7852l5439n8365r5291j39580j74217j77231j33590n4398
3265.4C24002800J6708K6169m5776j61934k52609k71798k33459j90849j81465j94893
3275C22512894j92681j53007r1896m4594l6125p0153j33857k05612k60735k84996k89001
3285.6C20750237k98577l23257l34320k90490j90525r5844q7910j99546l85151n54200
3295.3C17990417o29920n80788m20056j97887P153J11045O6929j02806l20091n00259
3304.9C15423737n95856n99709n29117m15478l07121k57740k92130l81298m64134n01537
$$ plain form
3314.6 311079617 310572472 310050602 309491062 308903484 308339806 307854271 307456036 307102013 306731548 306302204
3324.2 306302204 305798531 305219517 304570370 303870125 303160305 302499771 301940556 301497231 301129532 300755692
3333.8 300755692 300298691 299739227 299131451 298563480 298091202 297701092 297328510 296906395 296399326 295807590
3343.5 295807590 295159302 294504089 293899937 293382626 292937679 292500725 291990242 291346092 290550251 289629707
3353.1 289629707 288650436 287695885 286827564 286052837 285334949 284640942 283975449 283358345 282777405 282185593
3362.8 282185593 281555481 280923767 280357113 279866276 279369411 278757839 278001232 277181358 276420650 275779953
3372.4 275779953 275220089 274648151 273991566 273242359 272454109 271705379 271050129 270481052 269935417 269348316
3382.1 269348316 268712044 268078709 267500668 266970081 266431789 265854950 265280666 264784756 264393978 264053802
$$ packed form
3314.6C11079617n07145n21870n59540n87578n63678m85535l98235l54023l70465m29344
3324.2C06302204n03673n79014o49147p00245p09820o60534n59215m43325l67699l73840
3333.8C00755692m57001n59464o07776n67971m72278l90110l72582m22115n07069n91736
3343.5B95807590o48288o55213o04152n17311m44947m36954n10483o44150p95841r20544
3353.1B89629707r79271r54551q68321p74727p17888o94007o65493o17104n80940n91812
3362.8B82185593o30112o31714n66654m90837m96865o11572p56607q19874p60708o40697
3372.4B75779953n59864n71938o56585p49207p88250p48730o55250n69077n45635n87101
3382.1B69348316o36272o33335n78041n30587n38292n76839n74284m95910l90778l40176
$$ plain form
3391.7 264053802 263684940 263260231 262812653 262371483 261915283 261405830 260860634 260363674 259986572 259703960
3401.3 259703960 259406052 259005337 258523407 258064175 257703419 257413750 257102947 256716385 256295929 255936604
3411 255936604 255689240 255506935 255283165 254940281 254490757 254021835 253624668 253328800 253092060 252846642
3420.6 252846642 252558575 252251415 251980743 251783104 251643848 251506252 251313496 251051884 250761471 250509777
3430.3 250509777 250348949 250285587 250280285 250270214 250201969 250062599 249892139 249762936 249726620 249764423 249795971
3440.9 249795971 249751244 249643555 249561806 249580612 249679585 249761238 249749889 249665241 249594650 249603462 249683189
3451.5 249683189 249779453 249853325 249908905 249972172 250058765 250156651 250229130 250236969 250174026 250092201 250077152 250181389
3463.1 250181389 250380135 250606632 250831203 251084747 251393356 251705894 251917152 251968136 251905460 251830502
$$ packed form
3391.7B64053802l68862m24709m47578m41170m56200n09453n45196m96960l77102k82612
3401.3B59703960k97908m00715m81930m59232l60756k89669l10803l86562m20456l59325
3411B55936604k47364j82305k23770l42884m49524m68922l97167k95868k36740k45418
3420.6B52846642k88067l07160k70672j97639j39256j37596j92756k61612k90413k51694
3430.3B50509777j60828o3362n302j0071o8245j39370j70460j29203l6316L7803L1548
3440.9B49795971m4727j07689q1749J8806R8973Q1653j1349q4648p0591Q812P9727
3451.5B49683189R6264P3872N5580O3267Q6593R7886P2479P839o2943q1825j5049J04237
3463.1B50181389J98746K26497K24571K53544L08609L12538K11258N0984o2676p4958
$$ plain form
3472.7 251830502 251809330 251852493 251968822 252190762 252521954 252882652 253152199 253279247 253329315 253412285
3482.3 253412285 253577309 253795280 254024715 254257202 254490299 254693565 254838676 254953728 255107098 255320492
3492 255320492 255525284 255638561 255676422 255760918 255997963 256363869 256726646 256967010 257061749 257063026 257040501
3502.6 257040501 257063999 257212181 257540894 258016243 258498783 258827400 258936901 258900414 258865547 258955021
3512.2 258955021 259208908 259579258 259957848 260229645 260344334 260361443 260410538 260583801 260862865 261158504
3521.9 261158504 261418037 261675282 261986217 262333355 262619820 262768002 262816086 262909527 263195343 263714809
3531.5 263714809 264374256 264998112 265420189 265568085 265502796 265390072 265409241 265658054 266116829 266687412
3541.2 266687412 267254276 267714520 267984867 268030357 267918625 267832508 267980614 268450222 269130478 269792709
$$ packed form
3472.7B51830502k1172M3163J16329K21940L31192L60698K69547J27048N0068Q2970
3482.3B53412285J65024K17971K29435K32487K33097K03266J45111J15052J53370K13394
3492B55320492K04792J13277L7861Q4496K37045L65906L62777K40364R4739J277k2525
3502.6B57040501K3498J48182L28713M75349M82540L28617J09501l6487l4867Q9474
3512.2B58955021K53887L70350L78590K71797J14689J7109M9095J73263K79064K95639
3521.9B61158504K59533K57245L10935L47138K86465J48182M8084R3441K85816N19466
3531.5B63714809O59447O23856M22077J47896o5289j12724J9169K48813M58775N70583
3541.2B66687412N66864M60244K70347M5490j11732q6117J48106M69608O80256O62231
$$ plain form
3550.8 269792709 270264797 270540066 270731907 270941963 271189518 271455612 271756516 272136669 272594757 273052254
3560.5 273052254 273422737 273700562 273948898 274193649 274363422 274371128 274255199 274202347 274400463 274872627
3570.1 274872627 275471802 276037254 276533108 277028122 277571411 278123322 278609085 279006824 279357834 279708900
3579.7 279708900 280079308 280486050 280962849 281509171 282025166 282339096 282348480 282152176 282032204 282274933
3589.4 282274933 282968025 283930397 284824448 285371876 285527821 285505486 285625362 286088886 286840458 287628365
3599 287628365 288216572 288568783 288853073 289277191 289907494 290613785 291168156 291417141 291410408 291392670
3608.7 291392670 291634731 292203579 292870598 293290653 293329811 293219833 293346405 293858433 294512959 294929638
3618.3 294929638 294975643 294861565 294887104 295174999 295688381 296414490 297379761 298445930 299207096 299252796
$$ packed form
3550.8B69792709M72088K75269J91841K10056K47555K66094L00904L80153M58088M57497
3560.5B73052254L70483K77825K48336K44751J69773P706j15929n2852J98116M72164
3570.1B74872627N99175N65452M95854M95014N43289N51911M85763L97739L51010L51066
3579.7B79708900L70408M06742M76799N46322N15995L13930R384j96304j19972K42729
3589.4B82274933O93092R62372Q94051N47428J55945k2335J19876M63524P51572P87907
3599B87628365N88207L52211K84290M24118O30303P06291N54371K48985o733j7738
3608.7B91392670K42061N68848O67019M20055L9158j09978J26572N12028O54526M16679
3618.3B94929638M6005j14078K5539K87895N13382P26109R65271J066169P61166M5700
$$ plain form
3628 299252796 298582268 297695980 297205982 297348080 297883663 298435917 298847237 299204559 299602165 299976444
3637.6 299976444 300184956 300190792 300128708 300202599 300538921 301115761 301784573 302334175 302560577 302332668
3647.3 302332668 301650887 300691757 299797726 299363785 299625931 300484009 301533890 302335243 302703724
3655.9 302703724 302771626 302791405 302908726 303110294 303312283 303431091 303399944 303216991 303016815 303003769
3665.6 303003769 303205357 303318405 302945919 302084179 301298599 301256504 302023335 302898121 303040581 302271729
3675.2 302271729 301219730 300697842 300991306 301738148 302388706 302687397 302754307 302844868 303102722 303477535
3684.9 303477535 303771324 303751583 303307571 302572441 301883965 301571331 301736603 302217541 302734833 303068428
3694.5 303068428 303146591 303044891 302926121 302922268 303007927 302996750 302723179 302252884 301873760 301842213 302152500
$$ packed form
3628B99252796o70528q86288m89998J42098N35583N52254M11320L57322L97606L74279
3637.6B99976444K08512N836o2084P3891L36322N76840O68812N49602K26402k27909
3647.3C02332668o81781r59130q94031m33941K62146Q58078J049881Q01353L68481
3655.9C02703724O7902J9779J17321K01568K01989J18808l1147j82953k00176j3046
3665.6C03003769K01588J13048l72486q61740p85580m2095P66831Q74786J42460p68852
3675.2C02271729j051999n21888K93464P46842O50558K98691O6910R0561K57854L74813
3684.9C03477535K93789j9741m44012p35130o88476l12634J65272M80938N17292L33595
3694.5C03068428P8163j01700j18770l853Q5659j1177k73571m70295l79124l1547L10287
$$ plain form
3705.1 302152500 302583904 302939758 303171825 303265724 303103409 302547169 301663990 300782566 300259171 300193386
3714.8 300193386 300393944 300600319 300693855 300712433 300736294 300808964 300927887 301039276 301035557 300824451 300451584
3725.4 300451584 300131512 300101910 300424786 300948715 301462898 301854744 302100563 302151794 301902790 301302814
3735 301302814 300474186 299692478 299243374 299276218 299724407 300294476 300550003 300142746 299112053 297994251
3744.7 297994251 297526226 298076744 299280682 300253410 300263023 299290581 298005371 297216835 297313004 298118172
3754.3 298118172 299156895 299986687 300351028 300189228 299643269 299049568 298787098 299005814 299482384
3763 299482384 299807777 299763031 299499607 299327660 299354572 299379044 299143486 298636093 298107910 297825966
3772.6 297825966 297861805 298108883 298421364 298675365 298740940 298503551 297975903 297357655 296916161 296779652
$$ packed form
3705.1C02152500M31404L55854K32067R3899j62315n56240q83179q81424n23395o5785
3714.8C00193386K00558K06375R3536J8578K3861P2670J18923J11389l719k11106l72867
3725.4C00451584l20072k9602L22876N23929N14183L91846K45819N1231k49004n99976
3735C01302814q28628p81708m49104L2844M48189N70069K55527m07257j030693j117802
3744.7B97994251m68025N50518J203938R72728R613r72442j285210p88536R6169Q05168
3754.3B98118172J038723Q29792L64341j61800n45959n93701k62470K18716M76570
3763B99482384L25393m4746k63424j71947K6912K4472k35558n07393n28183k81944
3772.6B97825966L5839K47078L12481K54001O5575k37389n27648o18248m41494j36509
$$ plain form
3782.3 296779652 296858864 296979103 297066917 297190571 297427521 297721825 297894039 297802162 297495041 297195034
3791.9 297195034 297099094 297182198 297220192 297044430 296758556 296632729 296744442 296784954 296337643 295380478
3801.5 295380478 294422588 294039097 294272041 294575119 294381866 293668213 292913609 292582817 292748089 293186150
3811.2 293186150 293665810 294028568 294104023 293778553 293226891 292909451 293139763 293655281 293789749 293185177
3820.8 293185177 292260513 291838436 292293663 293168316 293678226 293521290 293097591 292973900 293265038 293601265
3830.5 293601265 293618317 293352222 293132401 293179169 293380718 293448315 293223038 292810421 292455006 292326393
3840.1 292326393 292412701 292576580 292679176 292661991 292551041 292423172 292377834 292505817 292822971 293194904
3849.8 293194904 293343945 292999096 292111073 290949554 289964924 289499931 289581165 289960155 290355206 290665092
$$ packed form
3782.3B96779652P9212J20239Q7814J23654K36950K94304J72214r1877l07121l00007
3791.9B97195034r5940Q3104L7994j75762k85874j25827J11713M0512m47311r57165
3801.5B95380478r57890l83491K32944L03078j93253p13653p54604l30792J65272M38061
3811.2B93186150M79660L62758P5455l25470n51662l17440K30312N15518J34468o04572
3820.8B93185177r24664m22077M55227Q74653N09910j56936m23699j23691K91138L36227
3830.5B93601265J7052k66095k19821M6768K01549O7597k25277m12617l55415j28613
3840.1B92326393Q6308J63879J02596j7185j10950j27869m5338J27983L17154L71933
3849.8B93194904J49041l44849q88023j161519r84630m64993Q1234L78990L95051L09886
$$ plain form
3859.4 290665092 290962143 291293201 291525326 291441116 291011715 290530167 290386181 290662365 291002007 290953712
3869.1 290953712 290453091 289893532 289679623 289778099 289803867 289537277 289217129 289224281 289535389 289653873
3878.7 289653873 289154892 288217449 287492542 287434959 287848358 288136444 287950287 287515373 287338829 287674007
3888.3 287674007 288304386 288788471 288848076 288534031 288106709 287811489 287731857 287772388 287739925 287472343
3898 287472343 286945267 286285648 285673542 285217514 284912815 284711704 284610634 284654846 284861927 285168152
3907.6 285168152 285467472 285694790 285853405 285961761 286006832 285973625 285901718 285867386 285886059 285866451 285705910
3918.2 285705910 285436840 285241261 285285053 285541725 285796528 285829334 285588760 285206852 284880714 284745674
3927.9 284745674 284817677 285003414 285158348 285174484 285048485 284867325 284720631 284632244 284581451 284563103
$$ packed form
3859.4B90665092K97051L31058K32125q4210m29401m81548j43986K76184L39642m8295
3869.1B90953712n00621n59559k13909R8476K5768k66590l20148P152L11108J18484
3878.7B89653873m98981r37443p24907n7583M13399K88086j86157m34914j76544L35178
3888.3B87674007O30379M84085N9605l14045m27322k95220p9632M0531l2463k67582
3898B87472343n27076o59619o12106m56028l04699k01111j01070M4212K07081L06225
3907.6B85168152K99320K27318J58615J08356M5071l3207p1907l4332J8673j9608j60541
3918.2B85705910k69070j95579M3792K56672K54803L2806k40574l81908l26138j35040
3927.9B84745674P2003J85737J54934J6136j25999j81160j46694q8387n0793j8348
$$ plain form
3937.5 284563103 284589310 284626732 284572487 284332733 283929653 283511181 283242931 283187923 283278313 283383389
3947.2 283383389 283400249 283302383 283128605 282936058 282762527 282631207 282573185 282610645 282697277 282704830 282520981
3957.8 282520981 282176304 281839390 281662045 281651592 281714401 281784725 281846161 281843033 281668472 281300030 280890102
3968.4 280890102 280634518 280559959 280518703 280398102 280241108 280115547 279961491 279677429 279309216 279010029
3978 279010029 278805695 278553772 278207130 277961273 277968540 278011303 277714901 277095947 276597672 276422825
3987.7 276422825 276134377 275286045 274253540 273818073 273789158 272810268 273967628 275066032 275972366
3996.3 275972366 276553421 276676102 276207237 275013638
4000.2 275013638
$$ packed form
3937.5B84563103K6207L7422n4245k39754m03080m18472k68250n5008R0390J05076
3947.2B83383389J6860r7866j73778j92547j73531j31320n8022L7460Q6632P553j83849
3957.8B82520981l44677l36914j77345j0453O2809P0324O1436l128j74561l68442m09928
3968.4B80890102k55584p4559m1256j20601j56994j25561j54056k84062l68213k99187
3978B79010029k04334k51923l46642k45857P267M2763k96402o18954m98275j74847
3987.7B76422825k88448q48332j032505m35467k8915r78890J157360J098404R06334
3996.3B75972366N81055J22681m68865j193599
4000.2B75013638
##END=$$ End of the data block
