##TITLE=5 e-mac $$ Begin of the data block
##JCAMP-DX=5.00 $$ ACD/SpecManager v 10.08
##SPECTROMETER/DATA SYSTEM=Alpha
##DATE=16 Oct 2013 13:51:24
##DATA TYPE=INFRARED SPECTRUM
##DATA CLASS=XYDATA
##ORIGIN=
##OWNER=
##NPOINTS=1765
##FIRSTX=399.75695801
##LASTX=3997.56933594
##MAXX=3997.56933594
##MINX=399.75695801
##MAXY=0.80770457
##MINY=0.24975875
##XFACTOR=1.0000000000
##YFACTOR=1.000000000000000e-9
##FIRSTY=0.56304932
##DELTAX=2.03957629
##XUNITS=1/CM
##YUNITS=ARBITRARY UNITS
##XYDATA=(X++(Y..Y))
399.8E63049316l948569n316198l430962N51939K423644Q40842j324176j099468Q85785
418.1E52632153J383662j010298l323794l386795j409769j02878j376450l575564l386855
436.5E36443412k49207K685368K849222J200318O11901J857221K988875K034724k47121
454.8E50174713j700640j413583k63751m27782k203942l678202l190339j609266j475811
473.2E34211397l019214l945171k946973p39515N96166j96159j904547k153635o24061
491.5E19278288K01762r46165k427697k821266k161563j479208j937509l353417m241407
509.9E00111818l757536k782405k795100l977090m732430l781080j812130n86361p25299
528.3D75162387r34601J02192K208024M039586M494459L621011K625615K316624J928955
$$ y = [563049316, 559100747, 553784549, 550353587, 550905526, 553329170, 554170012, 552845836, 551746368, 552632153, 554015815, 553005517, 549681723, 546294928, 544885159, 544782281, 543405831, 539830267, 536443412, 536194205, 538879573, 541728795, 542929113, 543541014, 545398235, 548387110, 550421834, 550174713, 548474073, 547060490, 546796739, 546368957, 544165015, 540486813, 537296474, 535687208, 534211397, 531192183, 527247012, 524300039, 523560524, 524156690, 523960531, 522055984, 519902349, 519278288, 519480050, 518533885, 516106188, 513284922, 511123359, 509644151, 507706642, 504353225, 500111818, 496354282, 493571877, 490776777, 486799687, 482067257, 478286177, 476474047, 475887686, 475162387, 474227786, 474329978, 476538002, 480577588, 485072047, 488693058, 491318673, 493635297, 495564252]
546.6D95564252O12915j034528j799494j390040r41485j745463l430992m499316m398317
565D76937532m208624m810184n461246m756153k337187Q01176L325671M473835M671395
583.3D68636215N012989N559206N129814L293723J077413o9111K25186Q25286M99517
601.7D90190238l89308n70387K24263J356840J950681J712710J423955K055287L432483
620E01386762M203915L781915K996802K793789L192961L327012K509356J441300J110852
638.4E26744664J628339K257288K041697J157463O96778J047790J583159J461685O04570
656.7E39223433j8895K72453J026570J455069J467049N44429J6391J048148J933217
675.1E46967864J669884Q50796O84679J280367J685083J230777K82585l71516m59015
$$ y = [495564252, 496177167, 495142639, 493343145, 491953105, 491011620, 489266157, 485835165, 481335849, 476937532, 472728908, 467918724, 462457478, 457701325, 455364138, 456165314, 459490985, 463964820, 468636215, 473649204, 479208410, 484338224, 487631947, 488709360, 488640249, 488865435, 489690721, 490190238, 489800930, 489230543, 489454806, 490811646, 492762327, 494475037, 495898992, 497954279, 501386762, 505590677, 509372592, 512369394, 515163183, 518356144, 521683156, 524192512, 525633812, 526744664, 528373003, 530630291, 532671988, 533829451, 534526229, 535574019, 537157178, 538618863, 539223433, 539204538, 539476991, 540503561, 541958630, 543425679, 543970108, 543986499, 545034647, 546967864, 548637748, 549488544, 550173223, 551453590, 553138673, 554369450, 554652035, 554280519, 553821504]
693.5E53821504l72350r01997k004802k561272j980245q25166K0861L18527P90000
711.8E46305060K050162L645897M651248M768252M532099M730881N400359N655468
728.1E81739426M908621L610492K755522K744914K857863K154768N95510q15928j398623
746.5E99152565j489580j959979l108502m162907m237592l381372k404451j725376
762.8E76682806q78751Q58307L420055N831539P016540O789982O089687N816400N787433
781.2F17413998N154550L781020K646745K612888L299237L737986L438890K995908
797.5F45081222L286243M122197M515588L624082J975536J077295J299858J686811
813.8F66668832J293302L2306j121819j373351j191139j650274l018439m303276m457474
$$ y = [553821504, 553449154, 552547157, 550542355, 547981083, 546000838, 545175672, 545196533, 545515060, 546305060, 548355222, 552001119, 556652367, 561420619, 565952718, 570683599, 576083958, 581739426, 586648047, 590258539, 593014061, 595758975, 598616838, 600771606, 601367116, 600551188, 599152565, 597662985, 595703006, 592594504, 588431597, 584194005, 580812633, 578408182, 576682806, 575804055, 576662362, 580082417, 585913956, 592930496, 599720478, 605810165, 611626565, 617413998, 622568548, 626349568, 628996313, 631609201, 634908438, 638646424, 642085314, 645081222, 648367465, 652489662, 657005250, 660629332, 662604868, 663682163, 664982021, 666668832, 667962134, 667994440, 666872621, 665499270, 664308131, 662657857, 659639418, 655336142, 650878668]
832.1F50878668l703475l316462l889501m670620m586458l514171k430022k234042
848.5F22533917k799928l129780k562761j554013p53104J77323K146841N320727Q535028
866.8F27914250J0114729R450674P442475N422294L965497K523899K78473k472758
883.1F64639533m448235m988552m771173m827678n301237n484641m914701m047155
899.4F25856161l797889m535675n705774o512761o810486p122159p810235q526325
915.8E75034857q492112p241190n175590l289044k154112j393438m05251P95900J711727
934.1E49391747K080202K366006L153861M072487L902852J836658j532912m706323
950.4E60564578o789208q117199r463727j1005998j2285888j3105005j3822526j4827847
$$ y = [650878668, 647175193, 643858731, 639969230, 635298610, 630712152, 627197981, 624767959, 622533917, 619733989, 616604209, 614041448, 612487435, 611734331, 611911654, 614058495, 619379222, 627914250, 638028979, 647479653, 654922128, 660344422, 664309919, 666833818, 667112291, 664639533, 660191298, 655202746, 650431573, 645603895, 640302658, 634818017, 629903316, 625856161, 622058272, 617522597, 611816823, 605304062, 598493576, 591371417, 583561182, 575034857, 566542745, 559301555, 554125965, 550836921, 548682809, 547289371, 546884120, 547680020, 549391747, 551471949, 553837955, 556991816, 561064303, 564967155, 566803813, 565270901, 560564578, 553775370, 545658171, 536194444, 525188446, 512902558, 499797553, 485975027, 471147180]
966.8D71147180j6201884j7621756j8613129j9098759j9350201j9397706j8897176
981C41966569j7536461j5372127j2844473j0449469q308620o335139m531711k933294
997.3B63655275j679182j017213r35703j143098j423449j724094j976996j971692j502723
1015.7B50281125n22375O93530J794547K694756L420561L987909M330694M231066L517955
1034.1B74429768K380044J335710Q23051Q07464J031160J350701J850843K776266M135489
1052.4B90920496N621076O919413P981867Q929610R641826R307802O750465J585245
1068.7C47657800m745305r495586j0746717q754641n155623j388282J878441M456579
1085C13706666O222159P112473P211715O635517N594850M269212K786636J494796R08851
$$ y = [471147180, 454945296, 437323540, 418710411, 399611652, 380261451, 360863745, 341966569, 324430108, 309057981, 296213508, 285764039, 277455419, 271120280, 266588569, 263655275, 261976093, 260958880, 260023177, 258880079, 257456630, 255732536, 253755540, 251783848, 250281125, 249758750, 250452280, 252246827, 254941583, 258362144, 262350053, 266680747, 270911813, 274429768, 276809812, 278145522, 278968573, 279776037, 280807197, 282157898, 284008741, 286785007, 290920496, 296541572, 303460985, 311442852, 320372462, 330014288, 339322090, 346072555, 347657800, 342912495, 333416909, 322670192, 313915551, 308759928, 307371646, 309250087, 313706666, 319928825, 327041298, 334253013, 340888530, 346483380, 350752592, 353539228, 355034024, 355942875]
1103.4C55942875J288295K316981L260345L644675L551960L278315L024310K772748
1119.7C79080504K454221K216638K412140L094137L660500L264814J631767o75380
1136C97139341k880603m659534o042778o963611p171005o481886n077720l378421j660347
1154.4C52823436J00911K123982M476368O915033R140521J1002660J2515426J3775617
1170.7D12873954J4720767J5058905J4551938J3444662J2279898J1274993J0183811
1185E04388928Q630813O657719M816771L529429K652526J789391R15229N07832Q91089
1203.3E34779727J797498K613067K931834K888381K848983K877295K571285J573860
1219.7E54881930J89305q66711j301885j430214j664459k024949k116740j645684q38458
$$ y = [355942875, 357231170, 359548151, 362808496, 366453171, 370005131, 373283446, 376307756, 379080504, 381534725, 383751363, 386163503, 389257640, 392918140, 396182954, 397814721, 397139341, 394258738, 389599204, 383556426, 376592815, 369421810, 362939924, 357862204, 354483783, 352823436, 352924347, 355048329, 359524697, 366439730, 375580251, 386582911, 399098337, 412873954, 427594721, 442653626, 457205564, 470650226, 482930124, 494205117, 504388928, 513019741, 519677460, 524494231, 528023660, 530676186, 532465577, 533380806, 533888638, 534779727, 536577225, 539190292, 542122126, 545010507, 547859490, 550736785, 553308070, 554881930, 555071235, 554204524, 552902639, 551472425, 549807966, 547783017, 545666277, 544020593, 543182135]
1238E43182135j96278R5665L15547Q37207J664877K299309K311408J893997J640678
1256.4E54044545J838147K155364K142429J796246J544773J698494K004624J916647
1272.7E69141269J251101M95434K38121M42326O20365M15981p4447m31478n02944n74290
1293.1E71021438r22382j468063j734733j382232p23720m55737q50916j408040j530826
1311.4E60544789j273096j155793j487256k036690k300978k188861k136946k499878
1327.8E45465291l051818l153562k510429j570940r76205q93354q83341n38588o0379
1346.1E31826675Q0883l14951r14752j212716j063764q06809q69989j322866j597642
1364.5E23804069j210869m97043N9009J11401k21014k24233M19378R76682R85384R63807
$$ y = [543182135, 542985857, 543081522, 543397069, 544234276, 545899153, 548198462, 550509870, 552403867, 554044545, 555882692, 558038056, 560180485, 561976731, 563521504, 565219998, 567224622, 569141269, 570392370, 570887804, 571125925, 571568251, 572188616, 572604597, 572530150, 572098672, 571595728, 571021438, 570099056, 568630993, 566896260, 565514028, 564790308, 564334571, 563483655, 562075615, 560544789, 559271693, 558115900, 556628644, 554591954, 552290976, 550102115, 547965169, 545465291, 542413473, 539259911, 536749482, 535178542, 534202337, 533308983, 532425642, 531887054, 531826675, 531907558, 531592607, 530677855, 529465139, 528401375, 527594566, 526724577, 525401711, 523804069, 522593200, 522096157, 522155166, 522266567, 522045553, 521821320, 522240698, 523217380, 524202764, 525166571]
1384.9E25166571J257479J446307J229942O21319l87907j108289j090050n97715k17259
1403.2E26320398m02987p47264o51598k19404J80065L87788N11766P50839J177371
1421.6E27306974J651704J676440J162529O28829M67182P20620Q16166K77937j52409
1439.9E34555972N9306M62115N53906j02878j134634j654565j327932n46276J08957
1458.3E30973971N96523J445711L045261N132973P078230R178818J1122763J0551512
1474.6E79125762Q876741P972717P040918N768240M530429M016102L662467K450347
1490.9F23443723R29057R4951k39611l17156l36290m98056j198411k874911l261983
1509.3F15741313k670348k657294k699733k179861r85146k18749n92947j353383j868904
$$ y = [525166571, 526424050, 527870357, 529100299, 529721618, 529333711, 528225422, 527135372, 526537657, 526320398, 525917411, 525170147, 524518549, 524299145, 524479210, 524866998, 525378764, 526129603, 527306974, 528958678, 530635118, 531797647, 532426476, 532893658, 533614278, 534430444, 534708381, 534555972, 534615278, 535077393, 535631299, 535528421, 534393787, 532739222, 531411290, 530865014, 530973971, 531570494, 533016205, 536061466, 541194439, 548272669, 557451487, 568574250, 579125762, 588002503, 595975220, 603016138, 608784378, 613314807, 617330909, 620993376, 623443723, 624372780, 624467731, 624228120, 623910964, 623574674, 623076618, 621878207, 619003296, 615741313, 613070965, 610413671, 607713938, 605534077, 604548931, 604330182, 603737235, 602383852, 600514948]
1527.6F00514948j568436q25227o34074p40587n56767n63264o14345j45853J71781
1546E95038176K61068N24819J187742K010643K435505K304018J140356N87165J304925
1564.3F06794417J887739J712620J019239O78897J234055J701355J019120K12312j75596
1582.7F16084158j76787o0022l43084j213312k090037k479077k412855k461434l138005
1601.1F01709545m096151m626691m685044m949391n495847n887448o652892p698655
1617.4E57617426o641269n905449p205606p984757p823706p386923o187021n601585
1633.7E02881110o499380n715490l301829j573085m56691R119N7638M75049J513004
1652D87389445K244354J731395J838446K783596L946066M612625M529953M856050N295456
$$ y = [600514948, 598946512, 598121285, 597487211, 596746624, 596189857, 595626593, 595012248, 594866395, 595038176, 595299244, 595824063, 597011805, 599022448, 601457953, 603761971, 604902327, 605489492, 606794417, 608682156, 610394776, 611414015, 612092912, 613326967, 615028322, 616047442, 616259754, 616084158, 615907371, 615847349, 615504265, 614290953, 612200916, 609721839, 607308984, 604847550, 601709545, 597613394, 592986703, 588301659, 583352268, 577856421, 571968973, 565316081, 557617426, 550976157, 545070708, 537865102, 529880345, 522056639, 514669716, 508482695, 502881110, 496381730, 490666240, 487364411, 485791326, 485334635, 485343754, 485401392, 485876441, 487389445, 489633799, 491365194, 493203640, 495987236, 499933302, 504545927, 509075880, 513931930, 519227386]
1670.4E19227386N128204N837500O549478N965531N615353O451011Q027971P333338
1686.7E70135772O266654O511032O686867Q128285R385288Q770644Q233309O206513
1703F30324364N107522N185187M497170L782630L439188L612220M199088L834844K618968
1721.4F66601181J629829Q84474M92871L38375k58148j989245l455639k944350k349138
1739.7F58950210j641333k57254J699805M380465P615208R883881R755373R187937
1756.1F99574292Q579194P642806P166684N903124M343629L488600L186703L257036
1772.4G43142068K846063K018392J521825J433194J689494J960814J742422J270652
1788.7G57624924J087904J254618J418233J396716J090586P09534P36713J120031J376748
$$ y = [519227386, 524355590, 530193090, 536742568, 542708099, 548323452, 554774463, 562802434, 570135772, 576402426, 582913458, 589600325, 597728610, 607113898, 615884542, 624117851, 630324364, 635431886, 640617073, 645114243, 648896873, 652336061, 655948281, 660147369, 663982213, 666601181, 668231010, 669115484, 669608355, 669946730, 669688582, 667699337, 664243698, 661299348, 658950210, 657308877, 657051623, 658751428, 663131893, 670747101, 680630982, 690386355, 699574292, 708153486, 715796292, 722962976, 728866100, 733209729, 736698329, 739885032, 743142068, 745988131, 748006523, 749528348, 750961542, 752651036, 754611850, 756354272, 757624924, 758712828, 759967446, 761385679, 762782395, 763872981, 764582515, 765319228, 766439259, 767816007]
1807G67816007J150608O42359M46737Q30651J234531J119077O68466M69148O84381
1825.4G75061965J027346J072287N61893J36256K63095O74725R38654Q28624L68237
1843.8G80933082M411K37226O27578O16848K30432k981K11537N87821O56486L94165
1864.2G84496605J64569J80125L58224M93705L99530J10626J3471K88129O36995O50465
1884.6G87792444L51548R4176J31488M28021N66184K99811l6776j3768K82526M78208
1904.9G90373862L42190k623j36554J20938M36366M23193J03652j02162K4914K95341
1925.3G91879117L91782J57654j28090j02759J60337L57389L00288O8605q6426M2081
1945.7G93039978K79247L10481J29521j6272M2379K32279L61979K57313M8399R597
$$ y = [767816007, 768966615, 769608974, 770055711, 770886362, 772120893, 773239970, 773908436, 774377584, 775061965, 776089311, 777161598, 777723491, 777859747, 778122842, 778797567, 779736221, 780564845, 780933082, 780937493, 781174719, 781802297, 782419145, 782649577, 782646596, 782858133, 783445954, 784102440, 784496605, 784661174, 784841299, 785199523, 785693228, 786092758, 786203384, 786216855, 786504984, 787141979, 787792444, 788143992, 788238168, 788369656, 788797677, 789363861, 789663672, 789626896, 789613128, 789895654, 790373862, 790716052, 790713429, 790576875, 790697813, 791134179, 791557372, 791661024, 791558862, 791583776, 791879117, 792270899, 792428553, 792300463, 792197704, 792358041, 792715430, 793015718, 793084323, 792997897, 793039978, 793319225, 793629706, 793759227, 793742955, 793785334, 794017613, 794379592, 794636905, 794685304, 794694901]
1966.1G94694901J49667K59042J84655k3186j35720M77K10344K32280M6968r7215k3723
1988.6G95498490J46091J76072L040j75357j75178k0802Q5354J9133j62065k84493
2009G95110285k49922j33634r4235k21550l87371l96549k46406j44541k26379l84986
2029.4G92624712m30048l29315j92225j51396k43008l31700k97844j50800k9147n2750
2049.8G90416479j55508j67728k7895J30654J26838M888n3644l219R6917J17123K7716
2072.2G90512621m6491k1160Q1241J62185J30772J6451l6895N2273J65522J60754P7188
2094.6G91254461o795O974J34289K05040J38640L4154j252N3287J27494J11520K7240
2117.1G92085052l2306j7941N9664Q7142J1683p0036n0545M3095R7274M8995m9650
$$ y = [794694901, 794844568, 795103610, 795288265, 795265079, 795129359, 795129836, 795340180, 795572460, 795619428, 795522213, 795498490, 795644581, 795820653, 795823693, 795648336, 795473158, 795452356, 795537710, 795556843, 795394778, 795110285, 794860363, 794726729, 794632494, 794410944, 794023573, 793627024, 793380618, 793236077, 793009698, 792624712, 792194664, 791865349, 791673124, 791521728, 791278720, 790947020, 790649176, 790498376, 790469229, 790416479, 790260971, 790093243, 790065348, 790196002, 790322840, 790327728, 790274084, 790270865, 790367782, 790484905, 790512621, 790466130, 790444970, 790526211, 790688396, 790819168, 790835619, 790798724, 790850997, 791016519, 791177273, 791254461, 791247666, 791254640, 791388929, 791593969, 791732609, 791766763, 791765511, 791818798, 791946292, 792057812, 792085052, 792052746, 792034805, 792094469, 792181611, 792193294, 792123258, 792072713, 792115808, 792213082, 792262077, 792212427]
2139.5G92212427q8811j2636J08778J40965M4405n7578j2338J23918K05696J85847
2159.9G92850673J21594J38640K37823K99871K98380K66970K39431K76566L61800L83020
2180.3G95474768L19242K53081K34485K85149L56138L28600K10047J47938K21849L41058
2200.7G98172355L63886K72930J89006K09987K93255L07679K33591J53959J28209J81854
2221.1H00506711K43247K14338J15216O6340R6380J39177J45197R5427N0306M8161
2241.5H01720500Q5354J40667J22905L7729K0206Q6367J14203P8380K5749J9610J05679
2263.9H02557349J96815J48833J3411l1114Q166N4598P2717L7015k444K5094R4890
2286.3H03175330J25468J01983O8069N6684Q1241J28865J49072J43587J54972K05517
$$ y = [792212427, 792123616, 792110980, 792219758, 792360723, 792405128, 792347550, 792335212, 792459130, 792664826, 792850673, 792972267, 793110907, 793348730, 793648601, 793946981, 794213951, 794453382, 794729948, 795091748, 795474768, 795794010, 796047091, 796281576, 796566725, 796922863, 797251463, 797461510, 797609448, 797831297, 798172355, 798536241, 798809171, 798998177, 799208164, 799501419, 799809098, 800042689, 800196648, 800324857, 800506711, 800749958, 800964296, 801079512, 801145852, 801242232, 801381409, 801526606, 801622033, 801672339, 801720500, 801805854, 801946521, 802069426, 802107155, 802127361, 802213728, 802327931, 802406311, 802432060, 802451670, 802557349, 802754164, 802902997, 802916408, 802885294, 802893460, 802948058, 803020775, 803057790, 803055346, 803080440, 803175330, 803300798, 803402781, 803470850, 803527534, 803608775, 803737640, 803886712, 804030299, 804185271, 804390788]
2306.7H04390788K82228L16382K44915J43051K03312L89516M75168L72529K20955J82986
2327.1H07221830J70588L9101j34051j35541j2338J9014j30475n12540j055896j046062
2347.5H04423630k74956O10232J053691R88961P11083J91927l94881q18610j087070
2365.9H05404007j223266j298904j340032j247644j106382j022577r26077p84636o29961
2384.2G95824528n06342m26292l43859k71023k64108l06368l47852l46840l20256l28779
2404.6G92362809l63946l97205m17054m10735l94762m19378m83811n25475n04613m50194
2425G87995636m52399n26368n87583n77271n30243n29587n89431o27756n93483n51522
2445.4G82429993n42700n55873o04391o45042n98490n12421n04196n82039o43969n95212
$$ y = [804390788, 804673016, 804989398, 805234313, 805377364, 805580676, 805970192, 806445360, 806817889, 807038844, 807221830, 807392418, 807431519, 807297468, 807161927, 807149589, 807168603, 807038128, 806525588, 805469692, 804423630, 804148674, 804758906, 805812597, 806801558, 807512641, 807704568, 807309687, 806491077, 805404007, 804180741, 802881837, 801541805, 800294161, 799187779, 798165202, 797239125, 796454489, 795824528, 795318186, 794891894, 794548035, 794277012, 794012904, 793706536, 793358684, 793011844, 792691588, 792362809, 791998863, 791601658, 791184604, 790773869, 790379107, 789959729, 789475918, 788950443, 788445830, 787995636, 787543237, 787016869, 786429286, 785852015, 785321772, 784792185, 784202754, 783574998, 782981515, 782429993, 781887293, 781331420, 780727029, 780081987, 779483497, 778971076, 778466880, 777884841, 777240872, 776645660]
2465.8G76645660m87268m31597m62472n46515n96941n47349m73559m72307n09560n34714
2486.2G71583378m98295m01020l67283m50969n23150m63247l49045l25322m07040n06342
2506.6G67291665n11765l93510l03269l66032m94361n60164n19276m19021l82661m86076
2527G62855530o23882o33121n30898m68910n25892o32941o73294o13869n50031n71311
2547.4G57031381o51359p01011o24597m86672m85301o16312o98685o79374o00994n29468
2567.8G50957608n40018o31153p10667o59406n24103m79401n70118o80089o62863n33164
2588.2G44966626m68433n36084o33180o30200n25653m64380n39422o76155p46966p01487
2608.6G39044666o07431o31153q16763r69112r37104q22723q04186r16898j061082
$$ y = [776645660, 776158392, 775726795, 775264323, 774717808, 774120867, 773573518, 773099959, 772627652, 772118092, 771583378, 771085083, 770684063, 770316780, 769865811, 769342661, 768879414, 768530369, 768205047, 767798007, 767291665, 766779900, 766386390, 766083121, 765717089, 765222728, 764662564, 764143288, 763724267, 763341606, 762855530, 762231648, 761598527, 761067629, 760598719, 760072827, 759439886, 758766592, 758152723, 757602692, 757031381, 756380022, 755679011, 755054414, 754567742, 754082441, 753466129, 752767444, 752088070, 751487076, 750957608, 750417590, 749786437, 749075770, 748416364, 747892261, 747412860, 746842742, 746162653, 745499790, 744966626, 744498193, 743962109, 743328929, 742698729, 742173076, 741708696, 741169274, 740493119, 739746153, 739044666, 738437235, 737806082, 736989319, 736020207, 735083103, 734260380, 733456194, 732539296, 731478214]
2626.9G31478214j108706j035571r52184r91762j124799j176000j088082r75192r52363
2645.3G22073555j057565j166582j115501r92239r69112j062452j157940j115262r58980
2663.7G12477922q61048r05931j008332j030684r41574q21591p89821q93771r53138
2682G04272032q47459p33912p34210q24630q97527q80778q13305p90179q66234r82821
2702.4F95900977j032114r59337q80778r23693j036286j102984j046658r39250r20713
2720.8F87059164r89616j048624j027048r29654q09014p86244q83460r21786q33869
2739.1F78829849p34270p40170q38220q65400p66218o75023o80506p35164p77423p64966
2759.5F71252489o92725o40392o71506p52747q11100p90716p26580p62105r08673j002550
$$ y = [731478214, 730369508, 729333937, 728381753, 727389991, 726265192, 725089192, 724001110, 723025918, 722073555, 721015990, 719849408, 718733907, 717741668, 716772556, 715710104, 714552164, 713436902, 712477922, 711616874, 710710943, 709702611, 708671927, 707730353, 706908762, 706118941, 705225170, 704272032, 703424573, 702690661, 701956451, 701131821, 700234294, 699353516, 698540211, 697750032, 696883798, 695900977, 694868863, 693909526, 693028748, 692105055, 691068769, 689965785, 688919127, 687979877, 687059164, 686069548, 685020924, 683993876, 683064222, 682255208, 681468964, 680585504, 679663718, 678829849, 678095579, 677355409, 676517189, 675651789, 674885571, 674210548, 673530042, 672794878, 672017455, 671252489, 670559764, 669919372, 669247866, 668495119, 667684019, 666893303, 666166723, 665404618, 664495945, 663493395]
2779.9F63493395r93788r66311j028240j162529j245081j268685j263678j255393j332104
2798.3F52977586j489938j600265j631975j663566j714051j801610j946926k067387
2814.6F39061868k125263k192736k310455k472460k646982k777517k894402l096104
2830.9F18545949l350734l596008l949165m597307n594074o860018q249104r376526
2847.2E72973013r664893q667171o332278l192962k39551J555503J881182J114309
2863.5E49427152j92046j578033k631307k996802k792299k539218k490759k536416
2879.9E31670272k583801k666593k757132k745032k636731k538621k483547k511919
2896.2E10746896k650678k828538l071428l495395m142314m956305n848229o811172
$$ y = [663493395, 662499607, 661533296, 660505056, 659342527, 658097446, 656828761, 655565083, 654309690, 652977586, 651487648, 649887383, 648255408, 646591842, 644877791, 643076181, 641129255, 639061868, 636936605, 634743869, 632433414, 629960954, 627313972, 624536455, 621642053, 618545949, 615195215, 611599207, 607650042, 603052735, 597458661, 590598643, 582349539, 572973013, 563308120, 554640949, 548308671, 545115709, 544876158, 546431661, 548312843, 549427152, 549235106, 547657073, 545025766, 542028964, 539236665, 536697447, 534206688, 531670272, 529086471, 526419878, 523662746, 520917714, 518280983, 515742362, 513258815, 510746896, 508096218, 505267680, 502196252, 498700857, 494558543, 489602238, 483754009, 476942837]
2912.5D76942837p783204q444995q456826p660985o049544l857374j434147R33647
2928.8D34189409L038734M844547O335020P374286P884950P929414P566959O819576
2945.1D85982895N788505M688382L770054L201842L066361L351033L919422M634857
2961.4E18403351N356908N936384O281793O372512O228566N875886N424976M989326
2977.8E64869702M535615M013539L514886L116548K734303K301335J770914J100659
2994.1E87957501M15862k06232q13067j401186j881838j998782j634002r89318l22520
3012.4E79126418J53660L83318M00126K00510j65284o44505j132965j420319j489997
3030.8E75410962j520455j660049j883805j988410j959026j999617k148569k279758
$$ y = [476942837, 469159633, 460714638, 452257812, 444596827, 438547283, 434689909, 433255762, 434189409, 437228143, 442072690, 448407710, 455781996, 463666946, 471596360, 479163319, 485982895, 491771400, 496459782, 500229836, 503431678, 506498039, 509849072, 513768494, 518403351, 523760259, 529696643, 535978436, 542350948, 548579514, 554455400, 559880376, 564869702, 569405317, 573418856, 576933742, 580050290, 582784593, 585085928, 586856842, 587957501, 588373363, 588167131, 587354064, 585952878, 584071040, 582072258, 580438256, 579448938, 579126418, 579280078, 579663396, 580063522, 580264032, 580098748, 579454243, 578321278, 576900959, 575410962, 573890507, 572230458, 570346653, 568358243, 566399217, 564399600, 562251031, 559971273]
3047.1E59971273k296627k253770k256394k263486k277732k325714k295971k188325
3063.4E41813254k120137k150833k217949k200007k098382k012193k008677k105772
3079.7E24899304k197445k176761k136529k122819k119482k176106k225518k178788
3096E07565856k102554k135336k259255k288699k200782k173603k265960k301722k186627
3114.4D87651318k122044k237380k419352k538652k521634k411037k335996k354532
3130.7D68710691k415926k420187k350688k325117k403110k461553k461135k454490
3147D49418485k369433k240330k268315k426386k491325k420634k315789k253384k260536
3165.4D28372353k310782k334357k303004k249062k207726k198994k190978k165913
$$ y = [559971273, 557674646, 555420876, 553164482, 550900996, 548623264, 546297550, 544001579, 541813254, 539693117, 537542284, 535324335, 533124328, 531025946, 529013753, 527005076, 524899304, 522701859, 520525098, 518388569, 516265750, 514146268, 511970162, 509744644, 507565856, 505463302, 503327966, 501068711, 498780012, 496579230, 494405627, 492139667, 489837945, 487651318, 485529274, 483291894, 480872542, 478333890, 475812256, 473401219, 471065223, 468710691, 466294765, 463874578, 461523890, 459198773, 456795663, 454334110, 451872975, 449418485, 447049052, 444808722, 442540407, 440114021, 437622696, 435202062, 432886273, 430632889, 428372353, 426061571, 423727214, 421424210, 419175148, 416967422, 414768428, 412577450, 410411537]
3181.7D10411537k145231k130479k090573k033025k002537k003253j990288j948715
3198C94067436j915365j876324j837284j808613j795143j799286j789033j744151j675129
3216.4C77827108j638770j640171j658738j674533j646578j569658j464665j436234
3232.7C65097761j590073j709789j630396j542002j479506j419306j435757j493483
3249C52797449j496882j408815j341611j373261j414866j396775j331568j262784j211702
3267.4C40559185j151801j154810j229673j222521j144708j101285j084655j057566
3283.7C31412166j016825r77784r22084q78156r12129r70304r91524r61840q73357
3302C22908163p91490q31276r68605j024247r88394r94146j028388j001478r32693
$$ y = [410411537, 408266306, 406135827, 404045254, 402012229, 400009692, 398006439, 396016151, 394067436, 392152071, 390275747, 388438463, 386629850, 384834707, 383035421, 381246388, 379502237, 377827108, 376188338, 374548167, 372889429, 371214896, 369568318, 367998660, 366533995, 365097761, 363507688, 361797899, 360167503, 358625501, 357145995, 355726689, 354290932, 352797449, 351300567, 349891752, 348550141, 347176880, 345762014, 344365239, 343033671, 341770887, 340559185, 339407384, 338252574, 337022901, 335800380, 334655672, 333554387, 332469732, 331412166, 330395341, 329417557, 328495473, 327617317, 326705188, 325734884, 324743360, 323781520, 322908163, 322116673, 321285397, 320316792, 319292545, 318304151, 317310005, 316281617, 315280139, 314347446]
3320.4C14347446r05782r32068j010477j105070j095832j010596r63539r56148j017183
3338.8C05350751j126945j154304j132905j100004j003951j008004j164794j234263
3355.1B96425581j147032j057863j062930j091391j014441r32127j035362j223714
3371.4B87860721j224011j022816q89569q94636r08881q71450p59661n49496l72707
3389.7B80367494m92841p88242p75039m04716j70469l91334o96808n80997k89380j96517
3410.1B75581151k43217l10003k89232j55508n6535m2975L4451K00421L33071L53574
3430.5B75405198M19528N48660M44532K29150K97189N48869O96480P12037O66649P20083
3450.9B80688375Q36939Q97199R89318J100570J080006J082569J316190J476169J261532
$$ y = [314347446, 313441664, 312509596, 311499119, 310394049, 309298217, 308287621, 307324082, 306367934, 305350751, 304223806, 303069502, 301936597, 300836593, 299832642, 298824638, 297659844, 296425581, 295278549, 294220686, 293157756, 292066365, 291051924, 290119797, 289084435, 287860721, 286636710, 285613894, 284724325, 283829689, 282920808, 282049358, 281289697, 280740201, 280367494, 279874653, 279086411, 278311372, 277906656, 277736187, 277344853, 276648045, 276067048, 275777668, 275581151, 275337934, 275027931, 274738699, 274583191, 274526656, 274483681, 274518132, 274718553, 275051624, 275405198, 275824726, 276373386, 276817918, 277047068, 277344257, 277893126, 278589606, 279301643, 279968292, 280688375, 281525314, 282422513, 283411831, 284512401, 285592407, 286674976, 287991166, 289467335, 290728867]
3469.3B90728867R51499R49591J179397J420558J469195J300603J280010J481443J572520
3487.6C02333683J493841J452238J532524J665146J656323J586646J631439J642972
3504C14994812J617283J701980J811296J888454J907766J839012J842380K022206K261073
3522.3C31886262K271980K108782K071381K186477K336174K473504K481430K396644
3538.6C50212634K545207K829194K891630K679497K596945K795607K971381L019035
3554.9C72541130L072887L195077L297329L327877L411978L701955L828407L715276
3571.3D00091916L778726L949613M039526M164278M331142M424810M452050M468053
3587.6D33700114M474909M455804M600704M800052M869550M835844M726529M614979
$$ y = [290728867, 291680366, 292629957, 293809354, 295229912, 296699107, 297999710, 299279720, 300761163, 302333683, 303827524, 305279762, 306812286, 308477432, 310133755, 311720401, 313351840, 314994812, 316612095, 318314075, 320125371, 322013825, 323921591, 325760603, 327602983, 329625189, 331886262, 334158242, 336267024, 338338405, 340524882, 342861056, 345334560, 347815990, 350212634, 352757841, 355587035, 358478665, 361158162, 363755107, 366550714, 369522095, 372541130, 375614017, 378809094, 382106423, 385434300, 388846278, 392548233, 396376640, 400091916, 403870642, 407820255, 411859781, 416024059, 420355201, 424780011, 429232061, 433700114, 438175023, 442630827, 447231531, 452031583, 456901133, 461736977, 466463506, 471078485]
3603.9D71078485M572153M744292M920184M882992M865706M858642M883349M886270
3620.2E09692073M559398M309654M401505M836023M954576M323363M055381M125119
3636.5E45257092M174113M239857M146516L940761M003585M371583M219651L505469
3652.8E77858627L303587L673613L695488L338456L149629L113985L075361L116072
3669.2F04324818L141224K873838K700448K564251K308131K318084K481043K572358
3685.5F25284195K639294K418875J903713J709580J824081J890243J802682J689732
3701.8F41162395J634062J613676J604021J506507J298547J212835J243890J279652
3718.1F52555585J280188J246095J150549J065909J165271J258076J217603J080215
$$ y = [471078485, 475650638, 480394930, 485315114, 490198106, 495063812, 499922454, 504805803, 509692073, 514251471, 518561125, 522962630, 527798653, 532753229, 537076592, 541131973, 545257092, 549431205, 553671062, 557817578, 561758339, 565761924, 570133507, 574353158, 577858627, 581162214, 584835827, 588531315, 591869771, 595019400, 598133385, 601208746, 604324818, 607466042, 610339880, 613040328, 615604579, 617912710, 620230794, 622711837, 625284195, 627923489, 630342364, 632246077, 633955657, 635779738, 637669981, 639472663, 641162395, 642796457, 644410133, 646014154, 647520661, 648819208, 650032043, 651275933, 652555585, 653835773, 655081868, 656232417, 657298326, 658463597, 659721673, 660939276, 662019491]
3734.4F62019491R51350Q99374Q29339P29561Q33690J109779J068354Q43883O86168
3752.8F69970989P02977P97630Q14140P56502O93798P08401Q13663Q34942P33375O54579
3773.2F77480996O66141P32780P24315N97835M79996M53711N29825O59526P34865P47562
3793.6F83807552P53581O81341M84645L96431M63962M10557L65615M58777O06239O84500
3814F89113200O74069N94914L81112K90930L10659L12210M13179M74632N46455O87957
3834.4F93799317O09040L43919K08020K21729K84076L35455M26233M57048K59340J95503
3854.8F97139680L40164L64304L86893L76404L45587L03269J94192J73986J71721J68860
3875.2F99965060L04520M23193M54366L80278K00987J24752J61469J29879P6770J36018
$$ y = [662019491, 662970841, 663870215, 664699554, 665429115, 666262805, 667372584, 668440938, 669284821, 669970989, 670673966, 671471596, 672285736, 673042238, 673736036, 674444437, 675258100, 676093042, 676826417, 677480996, 678147137, 678879917, 679604232, 680202067, 680682063, 681135774, 681665599, 682325125, 683059990, 683807552, 684561133, 685242474, 685727119, 686123550, 686587512, 686998069, 687363684, 687822461, 688428700, 689113200, 689787269, 690382183, 690763295, 691054225, 691364884, 691677094, 692090273, 692564905, 693111360, 693799317, 694408357, 694752276, 694960296, 695182025, 695466101, 695801556, 696227789, 696684837, 696944177, 697139680, 697479844, 697844148, 698231041, 698607445, 698953032, 699256301, 699450493, 699624479, 699796200, 699965060, 700269580, 700692773, 701147139, 701527417, 701728404, 701853156, 702014625, 702144504, 702221274, 702357292]
3895.5G02357292K59996L49998L50535K04027L4153N722Q7738J74225J73330J26541
3915.9G04123557J09374J28925J64092J94668J81675J19925Q0943J23084J50620Q7858
3936.3G05464721N3584N4956Q5294J80125K30551J71483O5565N0842J20104J20044
3956.7G06597269O0916M7802Q5414J17242J63615K03907J23919J3530Q2731K06113
3977.1G07702458J52707L0398J490O0261J35004J69039J40488R0182J24216J80185
3997.5G08786428
$$ y = [702357292, 702617288, 702967286, 703317821, 703521848, 703556001, 703561723, 703649461, 703823686, 703997016, 704123557, 704232931, 704361856, 704525948, 704720616, 704902291, 705022216, 705103159, 705226243, 705376863, 705464721, 705518305, 705573261, 705658555, 705838680, 706069231, 706240714, 706306279, 706357121, 706477225, 706597269, 706658185, 706705987, 706791401, 706908643, 707072258, 707276165, 707400084, 707413614, 707496345, 707702458, 707855165, 707885563, 707887053, 707947314, 708082318, 708251357, 708391845, 708482027, 708606243, 708786428]
##END=$$ End of the data block
