##TITLE=5 e-mac $$ Begin of the data block
##JCAMP-DX=5.00 $$ ACD/SpecManager v 10.08
##SPECTROMETER/DATA SYSTEM=Alpha
##DATE=16 Oct 2013 13:51:24
##DATA TYPE=INFRARED SPECTRUM
##DATA CLASS=XYDATA
##ORIGIN=
##OWNER=
##NPOINTS=1765
##FIRSTX=399.75695801
##LASTX=3997.56933594
##MAXX=3997.56933594
##MINX=399.75695801
##MAXY=0.80837727
##MINY=0.24977003
##XFACTOR=1.0000000000
##YFACTOR=1.000000000000000e-9
##FIRSTY=0.56209892
##DELTAX=2.03957629
##XUNITS=1/CM
##YUNITS=ARBITRARY UNITS
##XYDATA=(X++(Y..Y))
399.8E62098920l914952n092680l376305M44233K240062N89549j406610r56416J115441
$$ 562098920 558183968 553091288 549714983 550159216 552399278 552988827 551582217 550625801 551741242
418.1E51741242J583159j143455l703237l566920j284063J84893j112580l393710l247142
$$ 551741242 553324401 552180946 548477709 544910789 543626726 543811619 542699039 539305329 536058187
436.5E36058187l17573K383828K552509R52304M01139J898885L351927K405822k44737
$$ 536058187 535740614 538124442 540676951 541629255 542030394 543929279 547281206 549687028 549442291
454.8E49442291j789629j172960Q583m59552k431690l730536l088653j605690j455962
$$ 549442291 547652662 546479702 546488285 546028733 543597043 539866507 536777854 535172164 533716202
473.2E33716202k916873l810048k833783p93517L58939l53396j623630j736999p35044
$$ 533716202 530799329 526989281 524155498 523361981 523720920 523367524 521743894 520006895 519271851
491.5E19271851j35363j023054k548158l024340k101600j235485j794696l379166m401177
$$ 519271851 519136488 518113434 515565276 512540936 510439336 509203851 507409155 504029989 499628812
509.9D99628812l841519k618373k601176l953517m766702l834278j959055p30366p31289
$$ 499628812 495787293 493168920 490567744 486614227 481847525 478013247 476054192 475323826 474592537
528.3D74592537p77245L54856K337158L931999M297108L467768K662391K556890K089590
$$ 474592537 473815292 474170148 476507306 480439305 484736413 488204181 490866572 493423462 495513052
546.6D95513052O27249r80824j752287j481921j048743j737476l371149m490227m483312
$$ 495513052 496140301 495159477 493407190 491925269 490876526 489139050 485767901 481277674 476794362
565D76794362m276901m641474n151093m687398k460301P66039L389418M533827M599482
$$ 476794362 472517461 467875987 462724894 458037496 455577195 456343234 459732652 464266479 468865961
583.3D68865961M842758N427748N003482L166705J135499J63465L63410P95215M74692
$$ 468865961 473708719 479136467 484139949 487306654 488442153 488605618 488969028 489764243 490238935
601.7D90238935l59118o32227J68562J463145K015710J699269J535416K188265L364682
$$ 490238935 489879817 489247590 489416152 490879297 492895007 494594276 496129692 498317957 501682639
620E01682639M034758L693461K997577K843380L214419L359437K616942J512647J164913
$$ 501682639 505717397 509410858 512408435 515251815 518466234 521825671 524442613 525955260 527120173
638.4E27120173J666188K169192J959324J225412P93278J032233J544059J514554O39796
$$ 527120173 528786361 530955553 532914877 534140289 534933567 535965800 537509859 539024413 539664209
656.7E39664209j00851J71423R84728J403093J342595O04987K70367J167059J915455
$$ 539664209 539563358 539734781 540719509 542122602 543465197 544070184 544340551 545507610 547423065
675.1E47423065J602173Q12709O89447J324773J741230J178742J46627l58462k76566
$$ 547423065 549025238 549837947 550527394 551852167 553593397 554772139 554918766 554560304 554283738
693.5E54283738k57134q86739j993239k544701j977622r07600q2612L20554Q04603
$$ 554283738 554026604 553139865 551146626 548601925 546624303 545716703 545634091 545954645 546759248
711.8E46759248K023697L620863M614234M774212M562557M729390N444825N739749
$$ 546759248 548782945 552403808 557018042 561792254 566354811 571084201 576529026 582268775
728.1E82268775M983305L687978K777219K677739K779305K142548N99444q83400j426518
$$ 582268775 587252080 590940058 593717277 596395016 599174321 601316869 601916313 601032913 599606395
746.5E99606395j402080j902819l150880m211188m245639l402352k425968j727224
$$ 599606395 598204315 596301496 593150616 588939428 584693789 581291437 578865469 577138245
762.8E77138245r47654P29084L392279N943358P086694O716252O001830N831718N878985
$$ 577138245 576190591 576919675 580311954 586255312 593342006 600058258 606060088 611891806 617770791
781.2F17770791N278766L861249K609074K501666L233314L777325L493309K970815
$$ 617770791 623049557 626910806 629519880 632021546 635254860 639032185 642525494 645496309
797.5F45496309L229439M105926M480302L533483J929879J116395J389384J779854
$$ 645496309 648725748 652831674 657311976 660845459 662775338 663891733 665281117 667060971
813.8F67060971J306296l9816j164317j376093j264691j720727k945244m179180m418790
$$ 667060971 668367267 668327451 667163134 665787041 664522350 662801623 659856379 655677199 651258409
832.1F51258409l757954l412604l952205m692793m606068l531397k481281k297879
$$ 651258409 647500455 644087851 640135646 635442853 630836785 627305388 624824107 622526228
848.5F22526228k776801l057480k555132j619518q16881J78098K192617N336761Q524120
$$ 622526228 619749427 616691947 614136815 612517297 611700416 611878514 614071131 619407892 627932012
866.8F27932012J0145426R484947P389247N328119L947377K567589K99454k492547
$$ 627932012 638077438 647562385 654951632 660279751 664227128 666794717 667094171 664601624
883.1F64601624m505336n064845m789770m777670n287826n517066m926979m049778
$$ 664601624 660096288 655031443 650241673 645464003 640176177 634659111 629732132 625682354
899.4F25682354l810644m575849n768478o535649o784677p083953p789075q549154
$$ 625682354 621871710 617295861 611527383 604991734 598207057 591123104 583334029 574784875
915.8E74784875q503854p196129n136847l285766k143860j355827l57270Q08299J692652
$$ 574784875 566281021 559084892 553948045 550662279 548518419 547162592 546805322 547613621 549306273
934.1E49306273K095998K382874L112018M007459L839314J770735j564145m671097
$$ 549306273 551402271 553785145 556897163 560904622 564743936 566514671 564950526 560279429
950.4E60279429o718516q059621r471596j1100590j2420296j3185025j3787061j4757633
$$ 560279429 553560913 545501292 536029696 524929106 512508810 499323785 485536724 470779091
966.8D70779091j6174972j7614961j8633842j9118130j9305170j9357443j8893778
$$ 470779091 454604119 436989158 418355316 399237186 379932016 360574573 341680795
981C41680795j7481864j5280097j2784034j0420054q332104o386936m501670k854795
$$ 341680795 324198931 308918834 296134800 285714746 277382642 270995706 266494036 263639241
997.3B63639241j671880j056820r36717j106352j398474j725196j987249j966149j477927
$$ 263639241 261967361 260910541 259973824 258867472 257468998 255743802 253756553 251790404 250312477
1015.7B50312477n42447O23808J770466K723813L449947M010141M354715M236669L465980
$$ 250312477 249770030 250393838 252164304 254888117 258338064 262348205 266702920 270939589 274405569
1034.1B74405569K298236J283914Q26090Q66443J111537J412124J882851K776891M107147
$$ 274405569 276703805 277987719 278813809 279680252 280791789 282203913 284086764 286863655 290970802
1052.4B90970802N567700O862015P957130Q938819R670437R323925O725072J549393
$$ 290970802 296538502 303400517 311357647 320296466 329966903 339290828 346015900 347565293
1068.7C47565293m762679r485036j0701418q707941n137711j374811J901745M466951
$$ 347565293 342802614 333317578 322616160 313908219 308770508 307395697 309297442 313764393
1085C13764393O220252P097393P179946O631970N603641M250497K785474J515687R25034
$$ 313764393 319984645 327082038 334261984 340893954 346497595 350748092 353533566 355049253 355974287
1103.4C55974287J300007K328962L296345L660590L496051L254473L102720K850681
$$ 355974287 357274294 359603256 362899601 366560191 370056242 373310715 376413435 379264116
1119.7C79264116K460808K181232K363384L048837L645569L277570J662314o25998
$$ 379264116 381724924 383906156 386269540 389318377 392963946 396241516 397903830 397277832
1136C97277832k859443m697174o101549o978542p100194o369710n014241l374070j663714
$$ 397277832 394418389 389721215 383619666 376641124 369540930 363171220 358156979 354782909 353119195
1154.4C53119195R0390K085984M445493O946057R207159J1025161J2484401J3740659
$$ 353119195 353209585 355295569 359741062 366687119 375894278 386919439 399403840 413144499
1170.7D13144499J4694333J5019208J4514327J3428867J2288958J1300057J0170639
$$ 413144499 427838832 442858040 457372367 470801234 483090192 494390249 504560888
1185E04560888Q576810O639779M859984L577947K656639J752138Q75771M93825R02652
$$ 504560888 513137698 519777477 524637461 528215408 530872047 532624185 533499956 533993781 534896433
1203.3E34896433J819611K612054K899170K857864K848566K890587K577960J590312
$$ 534896433 536716044 539328098 542227268 545085132 547933698 550824285 553402245 554992557
1219.7E54992557K13444q63314j320839j447975j668454k017617k105892j645386q40246
$$ 554992557 555206001 554342687 553021848 551573873 549905419 547887802 545781910 544136524 543296278
1238E43296278j69337J32680L24070Q43823J684606K297342K272904J856923J645088
$$ 543296278 543126941 543259621 543583691 544427514 546112120 548409462 550682366 552539289 554184377
1256.4E54184377J872063K187431K138138J759171J511693J678944K012193J940310
$$ 554184377 556056440 558243871 560382009 562141180 563652873 565331817 567344010 569284320
1272.7E69284320J262128N06163K38538M27901O14703M10497j05381m90844n29051
$$ 569284320 570546448 571052611 571291149 571719050 572333753 572744250 572638869 572148025 571618974
1291E71618974n35607q86560j471758j742899j358271o89089m45545q44836j390517
$$ 571618974 571083367 570196807 568725049 566982150 565623879 564934790 564489245 563644409 562253892
1309.4E62253892j540005j313150j161813j450122j998484k258301k143204k118349
$$ 562253892 560713887 559400737 558238924 556788802 554790318 552532017 550388813 548270464
1325.7E48270464k504766l059208l171504k531588j563311r49979q77499q72731n33641
$$ 548270464 545765698 542706490 539534986 537003398 535440087 534490108 533612609 532739878 532206237
1344.1E32206237o8247P1049l42727r63151j238168j037180p43568q40187j351118
$$ 532206237 532137990 532209039 531866312 530903161 529664993 528627813 527884245 527044058 525692940
1362.4E25692940j612842j186908m77671M3332N2214k81334k21610M54605R86755R62197
$$ 525692940 524080098 522893190 522415519 522458851 522511065 522229731 522008121 522462726 523449481 524411678
1382.8E24411678R21190J232445J463890J229883N67138m26650j085341j040042n55694
$$ 524411678 525332868 526565313 528029203 529259086 529826224 529399574 528314233 527274191 526718497
1401.2E26718497j95861l94344p55966o66618k22445J81735M08709N44667P66754J205922
$$ 526718497 526522636 526128292 525372326 524705708 524483263 524664998 525073707 525618374 526385128 527591050
1421.6E27591050J693487J681566J125336N97358M78684P47681Q27611K91168j38640
$$ 527591050 529284537 530966103 532091439 532688797 533167481 533915162 534742773 535033941 534895301
1439.9E34895301M2796M13060N13435q8215j097083j653731j357138n75662J28388
$$ 534895301 534938097 535351157 535864592 535776377 534679294 533025563 531668425 531092763 531221151
1458.3E31221151O42181J451492L051162N183339P093668R130239J1076212J0536313
$$ 531221151 531863332 533314824 536365986 541549325 548642993 557773232 568849444 579385757
1474.6E79385757Q873404P979333P039785N753339M515767L987848L630937K472996
$$ 579385757 588259161 596238494 603278279 609031618 613547385 617535233 621166170 623639166
1490.9F23639166R67563O3419l08097l18706l02255n29706j307309k896607l159940
$$ 623639166 624606729 624670148 624362051 624043345 623741090 623211384 621904075 619007468 615847528
1509.3F15847528k625704k667129k711058k185225r87828k05040n34355j277984j809954
$$ 615847528 613221824 610554695 607843637 605658412 604670584 604465544 603931189 602653205 600843251
1527.6F00843251j532674q23081o32047p27594o14941o64234n83947k6405K52426K82645
$$ 600843251 599310577 598487496 597855449 597127855 596512914 595848680 595264733 595238328 595490754 595773399
1548E95773399N22554J175344J996398K397477K222360J175224P08878J362145J887322
$$ 595773399 596295953 597471297 599467695 601865172 604087532 605262756 605971634 607333779 609221101
1566.4F09221101J699328J033426O79791J173317J655877J051902K67029j54257j97410
$$ 609221101 610920429 611953855 612633646 613806963 615462840 616514742 616781771 616627514 616430104
1584.7F16430104q3328l63528j231551k095402k471327k408088k475798l146767m075110
$$ 616430104 616346776 615983248 614751697 612656295 610184968 607776880 605301082 602154315 598079205
1603.1E98079205m590214m653990m938006n501926n898178o668508p694125o622017
$$ 598079205 593488991 588835001 583896995 578395069 572496891 565828383 558134258 551512241
1619.4E51512241n911052p207095p963837p808745p375240o206036n691766o572128
$$ 551512241 545601189 538394094 530430257 522621512 515246272 509040236 503348470 496776342
1635.7D96776342n677163l240586j541167m67598q137J07199M98146J419157K214491
$$ 496776342 491099179 487858593 486317426 485849828 485841691 485948890 486447036 487866193 490080684
1654.1D90080684J864642J930148K775341L908932M617512M527629M803717N258918
$$ 490080684 491945326 493875474 496650815 500559747 505177259 509704888 514508605 519767523
1670.4E19767523N150258N860031O550848N949915N573034O377757P982790P361651
$$ 519767523 524917781 530777812 537328660 543278575 548851609 555229366 563212156 570573807
1686.7E70573807O282329O499291O660700Q075118R310364Q701444Q236110O248296
$$ 570573807 576856136 583355427 590016127 598091245 607401609 616103053 624339163 630587459
1703F30587459N107760N190194M553139L834903L420949L550470M211009L940641K712965
$$ 630587459 635695219 640885413 645438552 649273455 652694404 656244874 660455883 664396524 667109489
1721.4F67109489J692474R42946N31852L25203l02434j957238l310620k836347k293468
$$ 667109489 668801963 669744909 670276761 670601964 670299530 668342292 665031672 662195325 659901857
1739.7F59901857j580178k12372J712799M359126P574559R885728R762168R149969
$$ 659901857 658321679 658109307 659822106 664181232 671755791 681641519 691403687 700553656
1756.1G00553656Q538901P599593P104873N853832M304648L450870L168762L290891
$$ 700553656 709092557 716692150 723797023 729650855 733955503 737406373 740575135 743866026
1772.4G43866026K903760K037704J524329J439512J680374J950622J749098J274526
$$ 743866026 746769786 748807490 750331819 751771331 753451705 755402327 757151425 758425951
1788.7G58425951J076043J248181J436889J424670J102686P04110P31408J114428J377106
$$ 758425951 759501994 760750175 762187064 763611734 764714420 765418530 766149938 767264366 768641472
1807G68641472J165151O70910M78566Q34346J203537J100898O82175M69446O67572
$$ 768641472 769806623 770477533 770956099 771790445 772993982 774094880 774777055 775246501 775914073
1825.4G75914073J017451J072467N86986J77443L16441P08700Q83936P21038L15308
$$ 775914073 776931524 778003991 778590977 778768420 779084861 779793561 780677497 781398535 781713843
1843.8G81713843K8730K85327O64294O31452K43544J1861K11716N87046O50525L51608
$$ 781713843 781742573 782027900 782692194 783323646 783567190 783579051 783790767 784377813 785028338 785379946
1864.2G85379946J05024J74999M22299N35190L76463R1553M4822L31581O49690O30558
$$ 785379946 785484970 785659969 786082268 786617458 786993921 787085474 787130296 787461877 788111567 788742125
1884.6G88742125L10957P2301J59800M55558N51164K73467k6525J5200K89917M72903
$$ 788742125 789053082 789125383 789285183 789740741 790291905 790565372 790538847 790554047 790843964 791316867
1904.9G91316867L37124L218j28507J14918M17351L96967J00434r9897m769K70188
$$ 791316867 791653991 791657209 791528702 791643620 792060971 792457938 792558372 792458475 792453706 792723894
1925.3G92723894M08769K14219p2718r7334J35064L43442L04460Q7262n4241O1989
$$ 792723894 793132663 793346882 793274164 793176830 793311894 793655336 793959796 794047058 793992817 794054806
1945.7G94054806K55704K71321J15334r894O5744K63453L63588K22444J5915l58J42694
$$ 794054806 794310510 794581831 794697165 794687271 794753015 795016468 795380056 795602500 795618415 795618057 795760751
1968.2G95760751K46703J85252J073j00255K1398K13146K39074O4492q0108l4273J07348
$$ 795760751 796007454 796192706 796193779 796093524 796114922 796328068 796567142 796631634 796551526 796517253 796624601
1990.6G96624601J57654K4319j41204j51991k3663O9499J2159j71185k86817k27928
$$ 796624601 796782255 796806574 796665370 796513379 796489716 796559215 796571374 796400189 796113372 795885444
2011G95885444j21653j09971k24829l69012l91364k62797j64092k27809l73899m14491
$$ 795885444 795763791 795653820 795428991 795059979 794668615 794405818 794241726 794013917 793640018 793225527
2031.4G93225527l17037k09093j82391k54929l21746k72870j23798k5332p0811j64151
$$ 793225527 792908490 792699397 792517006 792262077 791940331 791667461 791543663 791518331 791447520 791283369
2051.8G91283369j66178l3974J29997J57476L4988o8128k9803R8765J38104N2214k4021
$$ 791283369 791117191 791083217 791213214 791370690 791405678 791337550 791307747 791406512 791544616 791596830 791572809
2074.2G91572809m172P8559J42515J30713L4272l1829M0293J50681J50799P5758Q881
$$ 791572809 791568637 791647196 791789711 791920424 791954696 791922867 791963160 792113841 792264640 792340398 792349279
2096.7G92349279J5676J14560J95265J51992L9160k801N5670J35482J31845L7789m5299
$$ 792349279 792364955 792479515 792674780 792826772 792865932 792863131 792918801 793054283 793186128 793223917 793178618
2119.1G93178618l3736N5372R7633J6093q8274o8307L3796J00731P7665k6405q2373
$$ 793178618 793144882 793200254 793297887 793313980 793225706 793157399 793191195 793291926 793369591 793343186 793260813
2141.5G93260813j0491R0778J16647M7683l4034J6093J56701K26736J93596J29044
$$ 793260813 793250322 793341100 793457747 793505430 793471396 793487489 793644190 793870926 794064522 794193566
2161.9G94193566J31547K11597K87235L09705K74659K39253K63392L37601L88265L37958
$$ 794193566 794325113 794536710 794823945 795133650 795408309 795647562 795910954 796248555 796636820 796974778
2182.3G96974778K50518K46525L10123L48866L08574K20477J83344K38359L16977L21746
$$ 796974778 797225296 797471821 797781944 798130810 798439384 798659861 798843205 799081564 799398541 799720287
2202.7G99720287K40147J79112K07603K74122K97547K67982K06113J55747J94549K58088
$$ 799720287 799960434 800139546 800347149 800621271 800918818 801186800 801392913 801548660 801743209 802001297
2223.1H02001297K12014R1672L5226R0898J87516J91033P6770j609L8087J19687J42157
$$ 802001297 802213311 802304983 802340209 802431107 802618623 802809656 802886426 802884817 802922904 803042591 803184748
2245.6H03184748Q4102J8477K4796Q5413J13845J01328O6161M4763R7454J55389J06871
$$ 803184748 803268850 803287327 803312123 803397536 803511381 803612709 803678870 803723633 803821087 803976476 804083347
2268H04083347L755k7775J6927O7115P8798M0233o438J3769Q6010J32620J20461O9558
$$ 804083347 804087102 804059327 804076254 804143369 804222167 804262400 804255962 804269731 804355741 804488361 804608822 804678380
2292.5H04678380N2393R6202J36137J33872J28925J39057J78039K54035L00408K40505
$$ 804678380 804730773 804826975 804963112 805096984 805225909 805364966 805543005 805797040 806097448 806337953
2312.9H06337953J40726J73688L20792M26889L78430K51650K06113J41025j8835j33336
$$ 806337953 806478679 806652367 806973159 807400048 807778478 808030128 808236241 808377266 808358431 808225095
2333.3H08225095j42157r9003l7313j08659m54605r64820j005947l44456N00739R74536
$$ 808225095 808082938 807983935 807946622 807837963 807383358 806418538 805412591 805068135 805568874 806543410
2353.6H06543410Q64982N40317J37984k90870o11544q54611j084984j290738j353383
$$ 806543410 807408392 807948709 808086693 807795823 807184279 806329668 805244684 803953946 802600563
2372H02600563j213968j028955r28104q73089p97868o78718n28872l94702l11672k75314
$$ 802600563 801386595 800357640 799429536 798556447 797758579 797079861 796550989 796156287 795844615 795569301
2392.4G95569301k79427l13044l41177l24189k98739l23653l66866m08650m42624m36962
$$ 795569301 795289874 794976830 794635653 794311464 794012725 793689072 793322206 792913556 792470932 792033970
2412.8G92033970m00900l88504m36723n06401n25474n10335n04017n13911n64158n98133
$$ 792033970 791633070 791244566 790807843 790301442 789775968 789265633 788761616 788247705 787683547 787085414
2433.2G87085414n60045n13137n23269n84781o20604o02245n65469n50568o04332o60181
$$ 787085414 786525369 786012232 785488963 784904182 784283578 783681333 783115864 782565296 781960964 781300783
2453.6G81300783n92649m88162n11467o05822o34193n68271m63963m32193m98772n66065
$$ 781300783 780708134 780219972 779708505 779102683 778468490 777900219 777436256 777004063 776505291 775939226
2474G75939226n88775n42461m69685m82559n32925n33343m78208l89814l68297m37916
$$ 775939226 775350451 774807990 774338305 773855746 773322821 772789478 772311270 771921456 771553159 771115243
2494.4G71115243m91738m70579l78727l26217m02510n07116n11110m08530l17335l42667
$$ 771115243 770623505 770152926 769774199 769447982 769045472 768538356 768027246 767618716 767301381 766958714
2514.8G66958714m68195n69761n46396m40299l89695m80592o09875o13332m85957m15563
$$ 766958714 766490519 765920758 765374362 764934063 764544368 764063776 763453901 762840569 762354612 761939049
2535.2G61939049n17190o74128p22289o28889n33938n50032o34134o82175o14166n06342
$$ 761939049 761421859 760747731 760025442 759396553 758862615 758312583 757678449 756996274 756382108 755875766
2555.6G55875766n16712o48141p44641o94931n63144m85778n31793o67214p47681o62684
$$ 755875766 755359054 754710913 753966272 753271341 752708197 752222419 751690626 751023412 750275731 749613047
2576G49613047n11647m76062n66125o56009o52492n53250m76658n32568o52194o56307
$$ 749613047 749101400 748625338 748059213 747403204 746750712 746197462 745720804 745188236 744536042 743879735
2596.4G43879735n36024m54068n06640o51896p51197p06494n97894o20067q06630r57787
$$ 743879735 743343711 742889643 742383003 741731107 740979910 740273416 739675522 739055455 738248825 737291038
2616.8G37291038r33707q25882q10504r42647j097739j117885j003325r25064r95696
$$ 737291038 736357331 735531449 734720945 733778298 732680559 731562674 730559349 729634285 728638589
2635.1G28638589j122176j161635j076758r70662r77099j103460j191676j101196r44853
$$ 728638589 727516413 726354778 725278020 724307358 723330259 722226799 721035123 719933927 718989074
2653.5G18989074r32753j069605j163542j102984r47893q42214r10997j050830j055896
$$ 718989074 718056321 716986716 715823174 714720190 713772297 712930083 712019086 710968256 709912360
2671.8G09912360r33349q13246p97093q90970r41277q61823p60437p20500p72000q65280
$$ 709912360 708979011 708165765 707368672 706477702 705536425 704674602 703914165 703193665 702421665 701556385
2692.2G01556385q86322q46683q21710q67963r90808j035929r28640q47340r08136
$$ 701556385 700670063 699823380 699001670 698133707 697142899 696106970 695178330 694330990 693422854
2710.6F93422854j056373j149297j047969q75830q75891j026869j111745j047254r24587
$$ 693422854 692366481 691217184 690169215 689293385 688417494 687390625 686278880 685231626 684307039
2728.9F84307039q19028q07643q96453r22740q17418p07507p15077q24988q85308q05795
$$ 684307039 683488011 682680368 681783915 680861175 680043757 679336250 678621173 677796185 676910877 676105082
2749.3F76105082o83963o40214p03156q05974q14974o94871n98073o44863p48813q05318
$$ 676105082 675421119 674780905 674077749 673271775 672456801 671761930 671163857 670518994 669770181 668964863
2769.7F68964863q05617p56204p55429q70466r79483j004279r89437j021981j139224
$$ 668964863 668159246 667403042 666647613 665777147 664797664 663793385 662803948 661781967 660642743
2788.1F60642743j247465j276732j263857j283586j371503j468718j527071j584887
$$ 660642743 659395278 658118546 656854689 655571103 654199600 652730882 651203811 649618924
2804.4F49618924j667738j756311j848399j955927k044618k108753k213657k355098
$$ 649618924 647951186 646194875 644346476 642390549 640345931 638237178 636023521 633668423
2820.7F33668423k487362k615452k746164k895594l087878l322304l616690m006207
$$ 633668423 631181061 628565609 625819445 622923851 619835973 616513669 612896979 608890772
2837F08890772m619062n588114o837070q209527r375751r727239q741856o380499l210246
$$ 608890772 604271710 598683596 591846526 583636999 574261248 564534009 555792153 549411654 546201408
2855.4E46201408k22087J598179J901389J078307k56538j615346k607643k968192k831281
$$ 546201408 545979321 547577500 549478889 550557196 550300658 548685312 546077669 543109477 540278196
2873.7E40278196k593815k482593k517700k627969k701461k709926k698123k654552
$$ 540278196 537684381 535201788 532684088 530056119 527354658 524644732 521946609 519292057
2890.1E19292057k557457k476036k512277k660453k840757l086329l513723m157126
$$ 519292057 516734600 514258564 511746287 509085834 506245077 503158748 499645025 495487899
2906.4D95487899m951090n835831o815344p805109q494914q508831p649392n994052
$$ 495487899 490536809 484700978 477885634 470080525 461585611 453076780 445427388 439433336
2922.7D39433336l807306j403391R23514L006071M832506O345481P389664P887841
$$ 439433336 435626030 434222639 435146153 438152224 442984730 449330211 456719875 464607716
2939D64607716P912367P566333O864846N842626M720688L784090L204167L064155L356338
$$ 464607716 472520083 480086416 486951262 492793888 497514576 501298666 504502833 507566988 510923326
2957.4E10923326L943443M656792N364716N942702O291926O385327O248235N912721
$$ 510923326 514866769 519523561 524888277 530830979 537122905 543508232 549756467 555669188
2973.7E55669188N461634N005896M551589M058481L546893L110171K759814K344966
$$ 555669188 561130822 566136718 570688307 574746788 578293681 581403852 584163666 586508632
2990E86508632J786172J128674M57167j97708q40605j414299j846075j950502j599431
$$ 586508632 588294804 589423478 589880645 589682937 588842332 587428033 585581958 583631456 582032025
3008.3E82032025r52065k95818J48773L65019L89397J57774k53022o65128j048148
$$ 582032025 581079960 580784142 580932915 581297934 581687331 581845105 581592083 580926955 579878807
3026.7E79878807j344442j469553j537442j717865j918614j938761j905024k021908
$$ 579878807 578534365 577064812 575527370 573809505 571890891 569952130 568047106 566025198
3043E66025198k192200k267420k233088k208054k276838k330720k340734k333284k257287
$$ 566025198 563832998 561565578 559332490 557124436 554847598 552516878 550176144 547842860 545585573
3061.4E45585573k151966k091110k124310k195239k176583k106010k044619k005815
$$ 545585573 543433607 541342497 539218187 537022948 534846365 532740355 530695736 528689921
3077.7E28689921k087057k210200k205610k163946k145708k124071k168834k229453
$$ 528689921 526602864 524392664 522187054 520023108 517877400 515753329 513584495 511355042
3094E11355042k190768k119720k144575k244413k281547k217740k174288k237141k282947
$$ 511355042 509164274 507044554 504899979 502655566 500374019 498156279 495981991 493744850 491461903
3112.4D91461903k213359k177864k259225k400428k532721k533286k416522k337366
$$ 491461903 489248544 487070680 484811455 482411027 479878306 477345020 474928498 472591132
3128.7D72591132k364397k434135k438306k349914k289950k392501k520293k516568
$$ 472591132 470226735 467792600 465354294 463004380 460714430 458321929 455801636 453285068
3145D53285068k437234k301156k201408k317697k521873k540826k411306k304316k268672
$$ 453285068 450847834 448546678 446345270 444027573 441505700 438964874 436553568 434249252 431980580
3163.4D31980580k287388k311676k293140k255947k244949k225339k199054k207190
$$ 431980580 429693192 427381516 425088376 422832429 420587480 418362141 416163087 413955897
3179.7D13955897k221912k185762k106220k047032k043843k068549k047658j979560
$$ 413955897 411733985 409548223 407442003 405394971 403351128 401282579 399234921 397255361
3196C97255361j933634j913578j885920j867175j863361j848906j805604j767158j745492
$$ 397255361 395321727 393408149 391522229 389655054 387791693 385942787 384137183 382370025 380624533
3214.3C80624533j714826j670331j623004j625747j650303j632929j587332j522451
$$ 380624533 378909707 377239376 375616372 373990625 372340322 370707393 369120061 367597610
3230.7C67597610j495928j591593j681596j645416j573890j511455j466066j463830
$$ 367597610 366101682 364510089 362828493 361183077 359609187 358097732 356631666 355167836
3247C55167836j506984j512349j403361j315743j377851j457244j426518j344085j273990
$$ 355167836 353660852 352148503 350745142 349429399 348051548 346594304 345167786 343823701 342549711
3265.3C42549711j196920j125008j172632j259476j228959j157194j132607j129926
$$ 342549711 341352791 340227783 339055151 337795675 336566716 335409522 334276915 333146989
3281.6C33146989j082360j003713r30577q52138q47519r49382j036436j036137r67622
$$ 333146989 332064629 331060916 330130339 329278201 328430682 327481300 326444864 325408727 324441105
3300C24441105q90940q33363q35418r38326j048506j055538r84490r61870r73404r48101
$$ 324441105 323550165 322716802 321881384 320943058 319894552 318839014 317854524 316892654 315919250 314971149
3320.4C14971149r38058r63926j032055j089483j076847j040251r87380r38297r93460
$$ 314971149 314033091 313069165 312037110 310947627 309870780 308830529 307843149 306904852 305911392
3338.8C05911392j110137j139968j127213j093477j009465j067370j253992j280099
$$ 305911392 304801255 303661287 302534074 301440597 300431132 299363762 298109770 296829671
3355.1B96829671j129836j032561j071811j102179r93043q93325j026630j260549j247108
$$ 296829671 295699835 294667274 293595463 292493284 291500241 290606916 289580286 288319737 287072629
3373.4B87072629j031399r27985r39965r35227q52704p13020n77241m56751m80324
$$ 287072629 286041230 285113245 284173280 283238053 282385349 281672329 281095088 280638337 280158013
3391.8B80158013o91086p22557m01318j85758m13090o99252n83112l10988k14576k41995
$$ 280158013 279466927 278744370 278343052 278157294 277744204 277044952 276461840 276150852 275936276 275694281
3412.2B75694281l08722k99275j27912K9415K9773L5256J50203L02554L56137L94792
$$ 275694281 275385559 275086284 274958372 274987787 275017560 275052816 275203019 275505573 275861710 276256502
3432.6B76256502N01394M20392K27242K99722N51641P01368P30515P03364P26134Q22097
$$ 276256502 276757896 277178288 277405530 277705252 278256893 278958261 279688776 280392140 281118274 281940371
3453B81940371R12994J021355J133055J076013J031935J275927J482784J308918J009077
$$ 281940371 282853365 283874720 285007775 286083788 287115723 288391650 289874434 291183352 292192429
3471.3B92192429R89378J164019J365214J449228J309544J265227J435578J509756
$$ 292192429 293181807 294345826 295711040 297160268 298469812 299735039 301170617 302680373
3487.6C02680373J492530J551956J612783J650125J660764J694560J721948J604825
$$ 302680373 304172903 305724859 307337642 308987767 310648531 312343091 314065039 315669864
3504C15669864J537621J692385J842201J906007J907081J850217J888335K025723K191693
$$ 315669864 317207485 318899870 320742071 322648078 324555159 326405376 328293711 330319434 332511127
3522.3C32511127K190739K071261K107054K267272K424776K531827K517879K447545
$$ 332511127 334701866 336773127 338880181 341147453 343572229 346104056 348621935 351069480
3538.6C51069480K578497K830356K893299K694339K614498K812982L003120L063798
$$ 351069480 353647977 356478333 359371632 362065971 364680469 367493451 370496571 373560369
3554.9C73560369L104240L212511L317029L354787L457338L743201L843487L719061
$$ 373560369 376664609 379877120 383194149 386548936 390006274 393749475 397592962 401312023
3571.3D01312023L774614L965407M094899M259974M439115M457742M404009M432260
$$ 401312023 405086637 409052044 413146943 417406917 421846032 426303774 430707783 435140043
3587.6D35140043M508138M484415M572511M796952M920125M916221M848838M725426
$$ 435140043 439648181 444132596 448705107 453502059 458422184 463338405 468187243 472912669
3603.9D72912669M613012M711330M840404M840642M888207M879773M917979M999101
$$ 472912669 477525681 482237011 487077415 491918057 496806264 501686037 506604016 511603117
3620.2E11603117M692674M360854M351437M727304M876554M349769M137396M200101
$$ 511603117 516295791 520656645 525008082 529735386 534611940 538961709 543099105 547299206
3636.5E47299206M217506M234552M130423L945887L993511M331530M213929L549933
$$ 547299206 551516712 555751264 559881687 563827574 567821085 572152615 576366544 579916477
3652.8E79916477L337026L668725L703773L394425L205776L117800L012479L052115
$$ 579916477 583253503 586922228 590626001 594020426 597226202 600344002 603356481 606408596
3669.2F06408596L167272K900660K627909K528548K388954K398730K484977K513945
$$ 606408596 609575868 612476528 615104437 617632985 620021939 622420669 624905646 627419591
3685.5F27419591K583682K407730J945078J777411J856863J863421J766264J708150
$$ 627419591 630003273 632411003 634356081 636133492 637990355 639853776 641620040 643328190
3701.8F43328190J666665J612544J584649J482487J328647J290142J269222J235187
$$ 643328190 644994855 646607399 648192048 649674535 651003182 652293324 653562546 654797733
3718.1F54797733J217663J202941J168847J127124J128614J151740J226485J150608
$$ 654797733 656015396 657218337 658387184 659514308 660642922 661794662 663021147 664171755
3734.4F64171755R30906Q95023Q69751P28488Q40783J131356J040459Q43822P19429
$$ 664171755 665102661 665997684 666867435 667595923 668436706 669568062 670608521 671452343 672171772
3752.8F72171772P14063Q13365Q32617P62463P15196P27475P58529P16328O73652P29144
$$ 672171772 672885835 673699200 674531817 675294280 676009476 676736951 677495480 678211808 678885460 679614604
3773.2F79614604P60376P31230O78479N87404N01216M85479N63980O84321P32004O86825
$$ 679614604 680374980 681106210 681784689 682372093 682873309 683358788 683922768 684607089 685339093 686025918
3793.6F86025918O29723O07848N54800N21600N22733M24266L80277M59671N81384O41286
$$ 686025918 686655641 687263489 687818289 688339889 688862622 689286888 689667165 690126836 690708220 691349506
3814F91349506O58512O39678L92794K54929L32833L56853L95834L98338M41611O28650
$$ 691349506 692008018 692647696 693040490 693295419 693628252 693985105 694380939 694779277 695220888 695849538
3834.4F95849538O30021L72767K18630K22862K80738L45111M45425M59135K33710K12431
$$ 695849538 696479559 696852326 697070956 697293818 697574556 697919667 698365092 698824227 699057937 699270368
3854.8F99270368L90112L49224L31103L77775L84926L04521J54554J40191J69813J83702
$$ 699270368 699660480 700009704 700340807 700718582 701103508 701408029 701562583 701702774 701872587 702056289
3875.2G02056289L53157M92752M76897L14891J21891J54138K77162K20239Q4817O4194
$$ 702056289 702409446 702902198 703379095 703693986 703815877 703970015 704247177 704467416 704552233 704616427
3895.5G04616427J44482K63512L45350K52723N7578j788R7633K18689K15113J02997
$$ 704616427 704760909 705024421 705369771 705622494 705680072 705678284 705775917 705994606 706209719 706312716
3915.9G06312716O8009J62542K18749K18808K28346J64270M5777K9623R0122J04547
$$ 706312716 706380725 706543267 706762016 706980824 707209170 707373440 707419217 707448840 707538962 707643509
3936.3G07643509J01030J27435J75595K09391J82807J10329N0485N3763J06990J35601
$$ 707643509 707744539 707871974 708047569 708256960 708439767 708550096 708600581 708654344 708761334 708896935
3956.7G08896935J21891J04487R2626J02699J28329J08122O9678R4414J30892J06037
$$ 708896935 709018826 709123313 709215939 709318638 709446967 709555089 709624767 709719181 709850073 709956110
3977.1G09956110M7743M6313J23560J44363R5546R5725J28627J37508J38461J39654
$$ 709956110 710003853 710050166 710173726 710318089 710413635 710509360 710637987 710775495 710913956 711053610
3997.5G11053610
$$ 711053610
##END=$$ End of the data block
