##TITLE=5 e-mac $$ Begin of the data block
##JCAMP-DX=5.00 $$ ACD/SpecManager v 10.08
##SPECTROMETER/DATA SYSTEM=Alpha
##DATE=16 Oct 2013 13:51:24
##DATA TYPE=INFRARED SPECTRUM
##DATA CLASS=XYDATA
##ORIGIN=
##OWNER=
##NPOINTS=1765
##FIRSTX=399.75695801
##LASTX=3997.56933594
##MAXX=3997.56933594
##MINX=399.75695801
##MAXY=0.80977315
##MINY=0.24984409
##XFACTOR=1.0000000000
##YFACTOR=1.000000000000000e-9
##FIRSTY=0.56084830
##DELTAX=2.03957629
##XUNITS=1/CM
##YUNITS=ARBITRARY UNITS
##XYDATA=(X++(Y..Y))
399.8E60848296l764928m717827l226876L09766K352058R55821j349986j145005J126825
418.1E51388144J838029q06034l503740l723800j658559l49938j527131l285825k811790
436.5E35559356j5914K424598K603411J070559N07772K027214L307223K114654m48823
454.8E49150050j786590j181781L1113l00109k369165l936530l280341j583159j375020
473.2E33368468k799630l604412k722442r13084K67625l42130j738728j786172n51820
491.5E19177675j8954j091242k553105k895892j920342r96828j702786l524005m512608
509.9D99961913l824234k644569k809048m164636m759133l665179j819163q07971q85218
528.3D74582762q51483K49625K253264L998995M498362L720403K769470K404571J924306
$$ y = [560848296, 557083368, 552365541, 549138665, 549448431, 551800489, 552756310, 551406324, 550261319, 551388144, 553226173, 552420139, 548916399, 545192599, 543534040, 543184102, 541656971, 538371146, 535559356, 535543442, 537968040, 540571451, 541642010, 542149782, 544176996, 547484219, 549598873, 549150050, 547363460, 546181679, 546212792, 545912683, 543543518, 539606988, 536326647, 534743488, 533368468, 530568838, 526964426, 524241984, 523328900, 523596525, 523254395, 521515667, 519729495, 519177675, 519158721, 518067479, 515514374, 512618482, 510698140, 509701312, 507998526, 504474521, 499961913, 496137679, 493493110, 490684062, 486519426, 481760293, 478095114, 476275951, 475467980, 474582762, 473731279, 473980904, 476234168, 480233163, 484731525, 488451928, 491221398, 493625969, 495550275]
546.6D95550275N94705j105636j880706j391917r64582j683593l146142m291772m486829
565D77193803m304022m747391n418539m791587k318412R42528L394216M386842M590422
583.3D68927860N031139N649924N109936L137469J023859J4276K40624P08341M23908
601.7D90267336l19689m12494M30345J486689J872003J581252J460761K203464L498614
620E02068281M193545L816127L065169K855480L235876L386379K621412J468480J070857
638.4E27781606J687646K291619J973749J110792P30514J122237J571953J404822O30080
656.7E40305018M8042L02315R75251J307249J222670N03003L02852J247286J985848
675.1E48199534J661241Q21472P60257J461685J710236J085579J48594m27305l83735
$$ y = [495550275, 496144980, 495039344, 493158638, 491766721, 490802139, 489118546, 485972404, 481680632, 477193803, 472889781, 468142390, 462723851, 457932264, 455613852, 456556380, 459950596, 464337438, 468927860, 473958999, 479608923, 484718859, 487856328, 488880187, 488894463, 489135087, 489843428, 490267336, 489947647, 489535153, 489965498, 491452187, 493324190, 494905442, 496366203, 498569667, 502068281, 506261826, 510077953, 513143122, 515998602, 519234478, 522620857, 525242269, 526710749, 527781606, 529469252, 531760871, 533734620, 534845412, 535575926, 536698163, 538270116, 539674938, 540305018, 540353060, 540655375, 541630626, 542937875, 544160545, 544663548, 544966400, 546213686, 548199534, 549860775, 550682247, 551442504, 552904189, 554614425, 555700004, 555848598, 555421293, 555037558]
693.5E55037558k70069q72969j953840k516568k015412q58784L7194L43978P80940
711.8E47712028K008021L621876M684508M851401M573285M696668N381465N690276
728.1E83219528M975975L659487K742230K711118K851545K135158N08547q68559j350045
746.5F00584984j498223k079367l233016m243374m268050l361881k362966j729071
762.8E77809036r49800Q24451L530026N993545P070839O684601N929828N785883N859255
781.2F18537664N201757L792465K635717K597571L280997L659785L376842L066718
797.5F46149516L411889M182518M439056L507673J939893J086056J344562J705706
813.8F67766869J205802j13785j209200j361787j189589j693666l036142m269183m431009
$$ y = [555037558, 554767489, 553894520, 551940680, 549424112, 547408700, 546549916, 546587110, 546931088, 547712028, 549720049, 553341925, 558026433, 562877834, 567451119, 572147787, 577529252, 583219528, 588195503, 591854990, 594597220, 597308338, 600159883, 602295041, 602803588, 601935029, 600584984, 599086761, 597007394, 593774378, 589531004, 585262954, 581901073, 579538107, 577809036, 576859236, 577683687, 581213713, 587207258, 594278097, 600962698, 606892526, 612678409, 618537664, 623739421, 627531886, 630167603, 632765174, 636046171, 639705956, 643082798, 646149516, 649561405, 653743923, 658182979, 661690652, 663630545, 664716601, 666061163, 667766869, 668972671, 668858886, 667649686, 666287899, 665098310, 663404644, 660368502, 656099319, 651668310]
832.1F51668310l775477l436446l986776m759968m656791l547669k441585k249241
848.5F22814357k784729l077626k519548j533747p67529J69874K177536N332410Q529962
866.8F28340960J0125219R414077P355213N374551L954947K466798J52528k606213
883.1F64578080m524171m990399m741550m834592n353749n523979m936755m094660
899.4F25578225l845156m565119n756557o551683o756544p038951p823885q595407
915.8E74644923q504152p172525n094588l262877k156019j376451l55064Q47578J706361
934.1E49277186K015353K290010L145158M139960L915429J719177j656055m716158
950.4E60130060o728232q090437r516179j1098027j2373925j3169408j3855069j4847696
$$ y = [651668310, 647892833, 644456387, 640469611, 635709643, 631052852, 627505183, 625063598, 622814357, 620029628, 616952002, 614432454, 612898707, 612131178, 612301052, 614478588, 619810998, 628340960, 638466179, 647880256, 655235469, 660610020, 664564967, 667031765, 667184293, 664578080, 660053909, 655063510, 650321960, 645487368, 640133619, 634609640, 629672885, 625578225, 621733069, 617167950, 611411393, 604859710, 598103166, 591064215, 583240330, 574644923, 566140771, 558968246, 553873658, 550610781, 548454762, 547078311, 546723247, 547570825, 549277186, 551292539, 553582549, 556727707, 560867667, 564783096, 566502273, 564846218, 560130060, 553401828, 545311391, 535795212, 524697185, 512323260, 499153852, 485298783, 470451087]
966.8D70451087j6211927j7578513j8532037j9047976j9329876j9386351j8853545
981C41510862j7436415j5279680j2774915j0350674q220971o305039m484653k870143
997.3B63788372j703739j095205r42171j094550j406789j729786j987904j984388j486033
1015.7B50357807n13718O63087J768261K684653L413439L980189M313082M174888L422826
1034.1B74264514K334059J398325R36180Q93265J078159J394272J879483K745479M072517
1052.4B90996253N576730O878108P914305Q877247R634018R288401O699651J572699
1068.7C47437412m666448r355038j0614396q679628n140692j395583J879036M446119
1085C13910782O187231P076144P184744O621092N600274M303366K815068J485198R16750
$$ y = [470451087, 454239160, 436660647, 418128610, 399080634, 379750758, 360364407, 341510862, 324074447, 308794767, 296019852, 285669178, 277448207, 271143168, 266658515, 263788372, 262084633, 260989428, 260047257, 258952707, 257545918, 255816132, 253828228, 251843840, 250357807, 249844089, 250507176, 252275437, 254960090, 258373529, 262353718, 266666800, 270841688, 274264514, 276598573, 277996898, 278933078, 279826343, 280904502, 282298774, 284178257, 286923736, 290996253, 296572983, 303451091, 311365396, 320242643, 329876661, 339165062, 345864713, 347437412, 342770964, 333415926, 322801530, 314121902, 308981210, 307585627, 309464663, 313910782, 320098013, 327174157, 334358901, 340979993, 346580267, 350883633, 353698701, 355183899, 356100649]
1103.4C56100649J339048K347171L238142L615468L541708L293962L076285K821743
1119.7C79374176K468169K222180K416164L068298L619999L223926J602441o49423
1136C97345930k827078m637331o022870o901294p085592o408959n035162l358752j656770
1154.4C53412122R3102K121478M492313O961703R172768J0980934J2470930J3729394
1170.7D13434744J4667362J5002668J4516234J3424575J2273074J1298537J0186523
1185E04803717Q586109O641626M851103L562927K647460J744509Q69989M82380Q93653
1203.3E35083473J842499K663552K936125K867103K849757K876521K540111J538158
1219.7E55197299J75356q59499j287460j410901j635671k000749k116859j660347q23081
$$ y = [356100649, 357439697, 359786868, 363025010, 366640478, 370182186, 373476148, 376552433, 379374176, 381842345, 384064525, 386480689, 389548987, 393168986, 396392912, 397995353, 397345930, 394518852, 389881521, 383858651, 376957357, 369871765, 363462806, 358427644, 355068892, 353412122, 353505224, 355626702, 360119015, 367080718, 376253486, 387234420, 399705350, 413434744, 428102106, 443104774, 457621008, 471045583, 483318657, 494617194, 504803717, 513389826, 520031452, 524882555, 528445482, 531092942, 532837451, 533707440, 534189820, 535083473, 536925972, 539589524, 542525649, 545392752, 548242509, 551119030, 553659141, 555197299, 555372655, 554513156, 553225696, 551814795, 550179124, 548178375, 546061516, 544401169, 543578088]
1238E43578088j42514J19686K96414Q40425J689077K294480K273321J859129J638889
1256.4E54446995J877785K211034K143204J721561J482189J701474K034188J924276
1272.7E69542706J242995N13017K72274M69387O30736M01915j12534m70221m89771
1291E72000504n35965r27270j496076j714051j315236o93322m80949q72851j386463
1309.4E62578321j502038j279175j164734j479745k021492k265095k145470k126097
1325.7E48594475k507091l039539l153443k531171j558602r26375q42750q54015n40853
1344.1E32640636q8871M4167l54886r29415j175403j015902p87556q89182j364470
1362.4E26079118j601279j172184m92335P153N3227k43306j90199M68254R84132R43482
$$ y = [543578088, 543435574, 543555260, 543851674, 544692099, 546381176, 548675656, 550948977, 552808106, 554446995, 556324780, 558535814, 560679018, 562400579, 563882768, 565584242, 567618430, 569542706, 570785701, 571298718, 571570992, 572040379, 572671115, 573073030, 572960496, 572490275, 572000504, 571464539, 570537269, 569041193, 567327142, 566011906, 565318584, 564837635, 563964784, 562578321, 561076283, 559797108, 558632374, 557152629, 555131137, 552866042, 550720572, 548594475, 546087384, 543047845, 539894402, 537363231, 535804629, 534878254, 534035504, 533181489, 532640636, 532551765, 532595932, 532241046, 531311631, 530136228, 529120326, 528332770, 527443588, 526079118, 524477839, 523305655, 522813320, 522820473, 522873700, 522630394, 522440195, 522908449, 523892581, 524836063]
1382.8E24836063Q93236J209974J437545J200139N65708m22001j091599j027525n51879
1401.2E27049661k13802l92258p16091o21914j88470K31802M39525N05388P31170J230597
1421.6E28055608J719475J689375J124322O06120N05089P44939P96318K88904j22964
1439.9E35407186P1764M61101N34415j12474j122653j651049j356244o01888J09375
1458.3E31739533O63698J481831L058314N171597P063627R059549J0996759J0533213
1474.6E79768121Q926749Q007825P025182N736947M508972L963828L584803K436518
1490.9F23958945R66430Q6129k70546l05176l41594o02007j414537k944231l048301
1509.3F16085112k496898k611578k731800k219319r89974j91450n14030j264095j781404
$$ y = [524836063, 525729299, 526939273, 528376818, 529576957, 530142665, 529720664, 528629065, 527601540, 527049661, 526835859, 526443601, 525727510, 525105596, 524917126, 525148928, 525588453, 526093841, 526825011, 528055608, 529775083, 531464458, 532588780, 533194900, 533699989, 534444928, 535241246, 535530150, 535407186, 535478950, 535940051, 536474466, 536361992, 535239339, 533588290, 532232046, 531630158, 531739533, 532403231, 533885062, 536943376, 542114973, 549178600, 558238149, 569234908, 579768121, 588694870, 596702695, 603727877, 609464824, 613973796, 617937624, 621522427, 623958945, 624925375, 625011504, 624740958, 624435782, 624094188, 623492181, 622077644, 619133413, 616085112, 613588214, 610976636, 608244836, 606025517, 605035543, 604844093, 604330063, 603065968, 601284564]
1527.6F01284564j482547p92622o27756p34270o40154o86765n32150O9261L38912L36766
1548E96533239N41031J185239J997828K357721K158642J202464P83921J394033J861095
1566.4F10015213J620293R89020P25508J216709J645983J038074K58744j35243j35660
1584.7F17238641n3108m08053j322866k179503k490700k366662k439975l142536m073381
1603.1E98761857m577220m643738m914999n458057n895496o710708p674157o543398
1619.4E52344084n878210p216990p958234p793486p373452o206810n713344o626874
1635.7D97576684n682111l199697j517862m73410k8461J06633N01394J405031K244413
1654.1D90932614J910239J936823K783984L939748M628897M498481M766941N259038
$$ y = [601284564, 599802017, 599009395, 598381639, 597647369, 597007215, 596320450, 595788300, 595857561, 596196473, 596533239, 597074270, 598259509, 600257337, 602615058, 604773700, 605976164, 606760085, 608154118, 610015213, 611635506, 612624526, 613350034, 614566743, 616212726, 617250800, 617509544, 617374301, 617238641, 617185533, 616777480, 615454614, 613275111, 610784411, 608417749, 605977774, 602835238, 598761857, 594184637, 589540899, 584625900, 579167843, 573272347, 566561639, 558887482, 552344084, 546465874, 539248884, 531290650, 523497164, 516123712, 509916902, 504203558, 497576684, 491894573, 488694876, 487177014, 486703604, 486675143, 486781776, 487283170, 488688201, 490932614, 492842853, 494779676, 497563660, 501503408, 506132305, 510630786, 515397727, 520656765]
1670.4E20656765N175471N879819O561876N934119N508542O279409P926047P362365
1686.7E71284413O275297O473958O606698P995784R262801Q681356Q211673O257593
1703F31049573N158902N242169M543602L795564L436983L618121M288554M021704K772510
1721.4F67927682J735747R94563N83470L62933k95997j978516l277660k734303k154112
1739.7F61163807j431763j10746J747549M352033P558703R843350R678960R057343
1756.1G01859236Q478164P594169P130563N865335M277706L411592L156900L294468
1772.4G45068133K908587K039671J510442J446425J725078J979649J745641J248062
1788.7G59671688J032949J233458J464844J439452J082957O85751P59781J180410J410365
$$ y = [520656765, 525832236, 531712055, 538273931, 544208050, 549716592, 555996001, 563922048, 571284413, 577559710, 584033668, 590640366, 598636150, 607898951, 616580307, 624791980, 631049573, 636208475, 641450644, 645994246, 649789810, 653226793, 656844914, 661133468, 665155172, 667927682, 669663429, 670657992, 671241462, 671604395, 671308398, 669329882, 666052222, 663317919, 661163807, 659732044, 659621298, 661368847, 665720880, 673279583, 683122933, 692801893, 701859236, 710337400, 717931569, 725062132, 730927467, 735205173, 738616765, 741773665, 745068133, 747976720, 750016391, 751526833, 752973258, 754698336, 756677985, 758423626, 759671688, 760704637, 761938095, 763402939, 764842391, 765925348, 766611099, 767370880, 768551290, 769961655]
1807G69961655J135290O31928M78626Q52882J205683J087904O67334M86254P36297
1825.4G77243853J049757J011848N33223J77145L18229P17283R03547P07924K83360
1843.8G82946169N4002L41237O76274N94974K14398M3511K78532O26028O49452L30389
1864.2G86754966P4446J50681M28915N65111L95358R0599M5240L27825O35207O25908
1884.6G90094256L13998O7651J59323M64976N53668K72631k1219L3319L10302M64797
1904.9G92713702L07858k4259j24097J58787M49836L91841R0182p7188L7610K78831
1925.3G94203103L57210J37389r3460m8459J83642L65615K89381L7670q4937P9751
1945.7G95426905L06547L07619J19806j0252O8366K59519L44932K15471K7418M232
$$ y = [769961655, 771096945, 771728873, 772207499, 773060381, 774266064, 775353968, 776021302, 776507556, 777243853, 778293610, 779305458, 779838681, 780015826, 780334055, 781051338, 781954885, 782662809, 782946169, 783000171, 783341408, 784017682, 784612656, 784827054, 784870565, 785149097, 785775125, 786424577, 786754966, 786829412, 786980093, 787409008, 787974119, 788369477, 788460076, 788505316, 788833141, 789468348, 790094256, 790408254, 790475905, 790635228, 791100204, 791653872, 791926503, 791905284, 791938603, 792248905, 792713702, 793021560, 792997301, 792873204, 793031991, 793481827, 793873668, 793963850, 793886662, 793924272, 794203103, 794560313, 794697702, 794604242, 794555783, 794739425, 795105040, 795394421, 795432091, 795347154, 795426905, 795733452, 796041071, 796160877, 796150625, 796218991, 796478510, 796823442, 797038913, 797066331, 797070563]
1966.1G97070563J57714K62618J64866k3544r2685M3571K30372K39730L4750j22309
1986.5G97965646l1352J57356J98901M0650j47879j74344k8967Q3565J5021j81377
2006.9G97897220k81155j94610q7380j10924k62082m07815l99887k39432j39416k37941
2027.3G95536578l93510m06087l00765k03251j85967k50399k94685k65718j70410p6532
2047.7G92989254q0884j51991j37568M113J21355J00672M172n6982p271J25467J53900
2070.2G93064237N4240j7047L934P8142J42812J28567J5617n2691L9936J65760J69694
2092.6G93793201R3818L2425N2691J47760J98364J25289J0133j8299N2690J41263J31727
2115G94761062K4259n4121j6272P7188R5486J1981q1897o9678M0829J28210R3102l7908
$$ y = [797070563, 797228277, 797490895, 797655761, 797632217, 797539532, 797583103, 797813475, 798053205, 798087955, 797965646, 797934294, 798091650, 798290551, 798331201, 798183322, 798008978, 797980011, 798063576, 798078597, 797897220, 797616065, 797421455, 797334075, 797223151, 796961069, 796553254, 796153367, 795913935, 795774519, 795536578, 795143068, 794736981, 794436216, 794232965, 794046998, 793796599, 793501914, 793236196, 793065786, 792989254, 792908370, 792756379, 792618811, 792622924, 792744279, 792844951, 792849123, 792792141, 792784870, 792910337, 793064237, 793118477, 793101430, 793105364, 793183506, 793326318, 793454885, 793470502, 793417811, 793457747, 793623507, 793793201, 793887019, 793919444, 793972135, 794119895, 794318259, 794443548, 794453681, 794435382, 794488072, 794629335, 794761062, 794785321, 794731200, 794714928, 794792116, 794887602, 794899583, 794817686, 794748008, 794788837, 794917047, 795010149, 794972241]
2139.5G94972241j06454j5795J08897J31608O2882k3007L636J36793K10464J80244
2159.9G95661509J41561J67191K39551K94447K97368K61306K39373K85148L76880L96550
2180.3G98360884L03567K34067K62559L24726L51369K98917J96696J63376K39611L25501
2200.7H01061273L29911K47300J76072K14636L12806L36289K66790J71900J31667J96457
2221.1H03445101K55406K07722J06931N4478Q5652J52230J64509Q9824K5630M2975
2241.5H04630458J08481J57833J09494r54Q881J19567J39773Q4340K6346J430Q5533
2263.9H05471182J95205J59502L0995m1903k4676N4836J01149M8697q702L3617J24395
2286.3H06144297J42634N6446j8239R954R6917J69277J60575J11580J21176J91808
$$ y = [794972241, 794865787, 794849992, 794958889, 795090497, 795153379, 795130372, 795134008, 795270801, 795481265, 795661509, 795803070, 795970261, 796209812, 796504259, 796801627, 797062933, 797302306, 797587454, 797964334, 798360884, 798664451, 798898518, 799161077, 799485803, 799837172, 800136089, 800332785, 800496161, 800735772, 801061273, 801391184, 801638484, 801814556, 802029192, 802341998, 802678287, 802945077, 803116977, 803248644, 803445101, 803700507, 803908229, 804015160, 804069638, 804155290, 804307520, 804472029, 804561853, 804587483, 804630458, 804738939, 804896772, 805006266, 805005312, 805014193, 805133760, 805273533, 805357873, 805384219, 805385649, 805471182, 805666387, 805825889, 805856884, 805814981, 805790305, 805845141, 805946290, 805994987, 805986285, 806019902, 806144297, 806286931, 806343377, 806325138, 806335092, 806432009, 806601286, 806761861, 806873441, 806994617, 807186425]
2306.7H07186425K71499K80380J68860R4950K06113L61920L95000K77757J58847J78575
2327.1H09580326J80841J1980j54316j47641r0957q3863j19329l64184r06349r83417
2347.5H06923091k98678N17308R08077Q01682N58138J50562l26813o30796q80599j119792
2367.9H06602180j233757j258492j162529r95338q99374q57830p65443o14524m95672
2386.3G98319221m28796l48628k71201k67863l06189l23177l13103l18944l45826l48747
2406.7G95046747l71456m22299m24564m04179m44711n10752n45561n27918m63427m54902
2427.1G90476978n23389n87344n97477n46395n17965n64933o04868n87403n53728n42819
2447.5G84850657n79596o37650o42002n57065m83691n18144o02722o39975n74887m56035
$$ y = [807186425, 807457924, 807738304, 807907164, 808002114, 808208227, 808570147, 808965147, 809242904, 809401751, 809580326, 809761167, 809773147, 809618831, 809471190, 809380233, 809296370, 809177041, 808812857, 807906508, 806923091, 806624413, 807141721, 808049798, 808851480, 809409618, 809560180, 809233367, 808602571, 807721972, 806602180, 805368423, 804109931, 802947402, 801952064, 801052690, 800194860, 799429417, 798814893, 798319221, 797890425, 797541797, 797270596, 797002733, 796696544, 796373367, 796060264, 795741320, 795395494, 795046747, 794675291, 794252992, 793828428, 793424249, 792979538, 792468786, 791923225, 791395307, 790931880, 790476978, 789953589, 789366245, 788768768, 788222373, 787704408, 787139475, 786534607, 785947204, 785393476, 784850657, 784271061, 783633411, 782991409, 782434344, 781950653, 781432509, 780829787, 780189812, 779614925, 779158890]
2467.9G79158890m13239m83095n88000o39081n62966m45962m44770n15699n52535m99249
2488.3G74014294l78787l55363m59433n16355m63247l75211l27230l66449m70996n13256
2508.7G69787967m24087l38614l70323m74632n40197n05507m27544m16696n19753o25372
2529G65145242o02066m84705m37916n38170o76036p04288o08206n04732n23865o70255
2549.4G59395003p49826o51896n18203m95136n95331p03692o91414n69821m90784n44727
2569.8G53384173o56068p00653o21319n18858n29886o13689o61075o20723n13255m74632
2590.2G47474015n82159o92606o31928m73082m33564n67794p24554p46906o57857o03437
2610.6G41360128o58274p98523r31561r25541q05438p95722r67383j123369j123667
$$ y = [779158890, 778745651, 778262556, 777674556, 777035475, 776472509, 776026547, 775581777, 775066078, 774513543, 774014294, 773635507, 773280144, 772820711, 772304356, 771841109, 771465898, 771138668, 770772219, 770301223, 769787967, 769363880, 769025266, 768654943, 768180311, 767640114, 767134607, 766707063, 766290367, 765770614, 765145242, 764543176, 764058471, 763620555, 763082385, 762406349, 761702061, 761093855, 760589123, 760065258, 759395003, 758645177, 757993281, 757475078, 756979942, 756384611, 755680919, 754989505, 754419684, 753928900, 753384173, 752728105, 752027452, 751406133, 750887275, 750357389, 749743700, 749082625, 748461902, 747948647, 747474015, 746891856, 746199250, 745567322, 745094240, 744660676, 744092882, 743368328, 742621422, 741963565, 741360128, 740701854, 739903331, 738971770, 738046229, 737240791, 736445069, 735477686, 734354317, 733230650]
2629G33230650j020193r39428r76503j096547j155853j071871r50157r65774j118541
2647.3G23935783j216412j127064r54389r18925j065135j177848j100480r34780q54015
2665.7G14586735r17197j023590j020193r01044p94112q14319r22918r51350q52644
2684.1G06389368p32661o96242p90655r27091r32038q23736p78913q68142j011550
2702.4F98828340j056135r66191q76189r07421j039505j105010j019180q99792q87215
2720.8F90071702j007974j109541j048445r07839p96258p94470q89779r13560q24153
2739.1F81779683p36058p43568q34823q83043p99000o72340o40392p01786p77125p84874
2759.5F74206674o95467o13749o49691p61807q35657q01205p19905p47979r07957j025975
$$ y = [733230650, 732210457, 731271029, 730294526, 729197979, 728042126, 726970255, 726020098, 725054324, 723935783, 722719371, 721592307, 720637918, 719718993, 718653858, 717476010, 716375530, 715440750, 714586735, 713669538, 712645948, 711625755, 710724711, 709930599, 709116280, 708193362, 707242012, 706389368, 705656707, 704960465, 704169810, 703242719, 702310681, 701486945, 700708032, 699839890, 698828340, 697772205, 696806014, 695929825, 695022404, 693982899, 692877889, 691858709, 690958917, 690071702, 689063728, 687954187, 686905742, 685997903, 685201645, 684407175, 683517396, 682603836, 681779683, 681043625, 680300057, 679465234, 678582191, 677783191, 677110851, 676470459, 675768673, 674991548, 674206674, 673511207, 672897458, 672247767, 671485960, 670650303, 669849098, 669129193, 668381214, 667473257, 666447282]
2779.9F66447282j000285r47237j002908j149178j270771j288473j239419j257777
2796.2F57291234j383365j513898j577020j582622j623452j754999j884878j958430
2812.5F44012570k024471k123893k238929k345860k479136k615333k724587k881647
2828.9F24578714l107607l337920l590882l976643m623830n618036o881237q245110
2845.2E85197449r388745r723485q739888o367624l185213k45154J531125J846969
2861.5E50925434J073897k21909j614272k670050l039419k866388k604365k481282
2877.8E36501646k503157k612829k718687k765894k743721k662539k558410k479792
2894.1E15456617k501071k638936k812683l066600l529787m186958m964620n841285
$$ y = [666447282, 665446997, 664499760, 663496852, 662347674, 661076903, 659788430, 658549011, 657291234, 655907869, 654393971, 652816951, 651234329, 649610877, 647855878, 645971000, 644012570, 641988099, 639864206, 637625277, 635279417, 632800281, 630184948, 627460361, 624578714, 621471107, 618133187, 614542305, 610565662, 605941832, 600323796, 593442559, 585197449, 575808704, 566085219, 557345331, 550977707, 547792494, 547547340, 549078465, 550925434, 551999331, 551777422, 550163150, 547493100, 544453681, 541587293, 538982928, 536501646, 533998489, 531385660, 528666973, 525901079, 523157358, 520494819, 517936409, 515456617, 512955546, 510316610, 507503927, 504437327, 500907540, 496720582, 491755962, 485914677]
2910.4D85914677o810754p786215q480012q503944p668048o023973l809482j385480
2926.8D35446769R51380L029793M823804O322384P398039P943630P954478P546932
2943.1D81417209O837457N845070M748404L837109L229260L035605L348351L979385
2959.4E16277850M683792N378545N971133O324232O404221O271660N938948N471527
2975.7E62721908N028904M600763M093945L578842L154397K774357K346695J824677
2992E90124488J182079M94480j78635q36134j414180j838445j947642j620709r81391
3010.4E82983911k94745J85847M01020M13299J98781k21788o82533j059115j303554
3028.7E80621123j417875j521945j724660j920998j964987j932204j981973k142012
$$ y = [485914677, 479103923, 471317708, 462837696, 454333752, 446665704, 440641731, 436832249, 435446769, 436398149, 439427942, 444251746, 450574130, 457972169, 465915799, 473870277, 481417209, 488254666, 494099736, 498848140, 502685249, 505914509, 508950114, 512298465, 516277850, 520961642, 526340187, 532311320, 538635552, 545039773, 551311433, 557250381, 562721908, 567750812, 572351575, 576445520, 580024362, 583178759, 585953116, 588299811, 590124488, 591306567, 591801047, 591622412, 590786278, 589372098, 587533653, 585586011, 583965302, 582983911, 582689166, 582875013, 583276033, 583689332, 583888113, 583666325, 582983792, 581924677, 580621123, 579203248, 577681303, 575956643, 574035645, 572070658, 570138454, 568156481, 566014469]
3045.1E66014469k281666k270877k215028k246082k274275k294779k352118k324343
3061.4E47755301k203524k107024k124250k209604k191782k093613k025664k009749
3077.7E30790091k106548k213478k171993k117038k145588k172590k196252k220154
3094E13446450k178132k103865k143622k279878k300560k177238k150238k280414k312154
3112.4D93520349k204448k183079k285988k432018k538651k504707k401709k369106
3128.7D74600643k404064k433926k421677k379209k351314k403408k488047k516448
3145D55202550k473325k335667k213330k295225k476991k518415k431572k356290k327979
3163.4D33773756k304673k317578k345502k298564k221495k187520k214015k236425
$$ y = [566014469, 563732803, 561461926, 559246898, 557000816, 554726541, 552431762, 550079644, 547755301, 545551777, 543444753, 541320503, 539110899, 536919117, 534825504, 532799840, 530790091, 528683543, 526470065, 524298072, 522181034, 520035446, 517862856, 515666604, 513446450, 511268318, 509164453, 507020831, 504740953, 502440393, 500263155, 498112917, 495832503, 493520349, 491315901, 489132822, 486846834, 484414816, 481876165, 479371458, 476969749, 474600643, 472196579, 469762653, 467340976, 464961767, 462610453, 460207045, 457718998, 455202550, 452729225, 450393558, 448180228, 445885003, 443408012, 440889597, 438458025, 436101735, 433773756, 431469083, 429151505, 426806003, 424507439, 422285944, 420098424, 417884409, 415647984]
3179.7D15647984k196342k141863k117396k101630k086699k080172k051502k000034
3196C98872346j968950j938761j887768j876146j866460j837372j837045j820654j758426
3214.3C82080764j687408j663387j683175j679600j654267j659244j639158j543551
3230.7C68870974j475752j566499j714856j708507j589716j482844j420468j447022
3247C56465310j545131j557172j450181j384377j410902j430273j381397j326859j291543
3265.3C43687475j225174j161337j177132j229584j232445j195133j154542j114190
3281.6C34197938j063913j012534r67323r20624r14454r47386r83507j018792r79454
3300C25389951q64088p72536q04484r68933j109630j103729j001894r36657r46880
$$ y = [415647984, 413451642, 411309779, 409192383, 407090753, 405004054, 402923882, 400872380, 398872346, 396903396, 394964635, 393076867, 391200721, 389334261, 387496889, 385659844, 383839190, 382080764, 380393356, 378729969, 377046794, 375367194, 373712927, 372053683, 370414525, 368870974, 367395222, 365828723, 364113867, 362405360, 360815644, 359332800, 357912332, 356465310, 354920179, 353363007, 351912826, 350528449, 349117547, 347687274, 346305877, 344979018, 343687475, 342462301, 341300964, 340123832, 338894248, 337661803, 336466670, 335312128, 334197938, 333134025, 332121491, 331154168, 330233544, 329319090, 328371704, 327388197, 326369405, 325389951, 324525863, 323753327, 322948843, 321979910, 320870280, 319766551, 318764657, 317828000, 316881120]
3318.4C16881120r78946r75252r78559j096159j190603j104444r90004r41216r10819
3336.7C07715118r81182j128167j191199j205861j166910j037091j034677j173318
3353B98796713j234203j198292j123101j065105j059502j036823r99659j066804j226455
3371.4B88786769j238316j041025q78394q57413r12130r05603p81894n92619m21434
3389.7B81157941m88639p18177o93082l92288k23995m49031p13498n58406k82407k34842
3410.1B76403576k64078k61307k42889j42127k6018j7374K1964J79917L39150L71814
3430.5B76362628L91692M81724M54069L01689K79039M64946O66201P41780P36743P94053
3450.9B81674564Q78125R12190R81778J089453J088113J101345J302928J438766J266241
$$ y = [316881120, 315902174, 314926922, 313948363, 312852204, 311661601, 310557157, 309567153, 308625937, 307715118, 306733936, 305605769, 304414570, 303208709, 302041799, 301004708, 299970031, 298796713, 297562510, 296364218, 295241117, 294176012, 293116510, 292079687, 291080028, 290013224, 288786769, 287548453, 286507428, 285629034, 284771621, 283859491, 282953888, 282171994, 281579375, 281157941, 280669302, 279951125, 279258043, 278865755, 278641760, 278192729, 277479231, 276920825, 276638418, 276403576, 276139498, 275878191, 275635302, 275493175, 275467157, 275449783, 275471747, 275651664, 275990814, 276362628, 276754320, 277236044, 277690113, 277991802, 278270841, 278735787, 279401988, 280143768, 280880511, 281674564, 282552689, 283464879, 284446657, 285536110, 286624223, 287725568, 289028496, 290467262, 291733503]
3469.3B91733503R74477R54836J183242J431674J500219J319438J273125J498759J574665
3487.6C03443938J470179J492232J591951J670599J680970J674682J709401J648218
3504C16382170J571804J690120J868188J941383J914739J874507J939952K078742K249271
3522.3C33510876K260983K130747K156317K306014K413720K512395K525926K423346
3538.6C52240324K545685K842813K924741K747059K703934K899021L025979L023148
3554.9C74952704L090948L276437L413230L431768L488481L752082L897160L800035
3571.3D03102845L821075L989518M105121M217445M397899M504115M501402M533112
3587.6D37172532M598588M537970M619687M869611M963278M869461M762799M718482
$$ y = [291733503, 292707980, 293662816, 294846058, 296277732, 297777951, 299097389, 300370514, 301869273, 303443938, 304914117, 306406349, 307998300, 309668899, 311349869, 313024551, 314733952, 316382170, 317953974, 319644094, 321512282, 323453665, 325368404, 327242911, 329182863, 331261605, 333510876, 335771859, 337902606, 340058923, 342364937, 344778657, 347291052, 349816978, 352240324, 354786009, 357628822, 360553563, 363300622, 366004556, 368903577, 371929556, 374952704, 378043652, 381320089, 384733319, 388165087, 391653568, 395405650, 399302810, 403102845, 406923920, 410913438, 415018559, 419236004, 423633903, 428138018, 432639420, 437172532, 441771120, 446309090, 450928777, 455798388, 460761666, 465631127, 470393926, 475112408]
3603.9D75112408M705638M834771M949153M916072M882305M796297M857480N053938
3620.2E14108062M829705M450798M349231M667700M839360M402459M236400M275680
3636.5E50159395M216313M195809M128278L956020M011988M349709M182756L536999
3652.8E82737267L379345L712237L703594L380537L210127L120244K985239K980709
3669.2F09209299L107011K903462K654075K556026K403260K388596K473533K492190
3685.5F30187452K503157K338111K004445J862764J842320J805246J736462J680672
3701.8F45960629J708388J725495J632095J438438J250566J246333J286506J293183
3718.1F57541633J289427J232445J145780J099766J133441J168907J204670J133084
$$ y = [475112408, 479818046, 484652817, 489601970, 494518042, 499400347, 504196644, 509054124, 514108062, 518937767, 523388565, 527737796, 532405496, 537244856, 541647315, 545883715, 550159395, 554375708, 558571517, 562699795, 566655815, 570667803, 575017512, 579200268, 582737267, 586116612, 589828849, 593532443, 596912980, 600123107, 603243351, 606228590, 609209299, 612316310, 615219772, 617873847, 620429873, 622833133, 625221729, 627695262, 630187452, 632690609, 635028720, 637033165, 638895929, 640738249, 642543495, 644279957, 645960629, 647669017, 649394512, 651026607, 652465045, 653715611, 654961944, 656248450, 657541633, 658831060, 660063505, 661209285, 662309051, 663442492, 664611399, 665816069, 666949153]
3734.4F66949153R54330Q92579Q43883P02441Q11875J112878J021385Q26955P30336
3752.8F74845815P29978Q24094Q64207Q11041P26938P03454P54416P64847P58767P62820
3773.2F82546377P41661P17103O59406N65649M67598M62592N89132O96838P35998P31230
3793.6F88913584O60419N79000N01334M85659N10395M00006L82245N11706O02126O07192
3814F94153666O09279O24538M46558L27110L38912L21984L95239M44412M95434O66439
3834.4F98823571O39439L67701K62022K73466K66075K96652L84152L93570J96397K34604
3854.8G02137649M61876M22776L52681L12984L25918L46780K32518J70290J61469J88112
3875.2G05113053L34800L97503L99113L53634K16484J74940J87099J39892J08242J54853
$$ y = [666949153, 667903483, 668796062, 669639945, 670342386, 671154261, 672267139, 673288524, 674115479, 674845815, 675575793, 676399887, 677264094, 678075135, 678802073, 679505527, 680259943, 681024790, 681783557, 682546377, 683288038, 684005141, 684664547, 685230196, 685697794, 686160386, 686749518, 687446356, 688182354, 688913584, 689574003, 690153003, 690654337, 691139996, 691650391, 692050397, 692432642, 692944348, 693546474, 694153666, 694762945, 695387483, 695834041, 696161151, 696500063, 696822047, 697217286, 697661698, 698157132, 698823571, 699463010, 699830711, 700092733, 700366199, 700632274, 700928926, 701313078, 701706648, 701903045, 702137649, 702599525, 703022301, 703374982, 703687966, 704013884, 704360664, 704593182, 704763472, 704924941, 705113053, 705447853, 705845356, 706244469, 706598103, 706814587, 706989527, 707176626, 707316518, 707424760, 707579613]
3895.5G07579613K48432L25858K84732J24872M6908O2824J04964K16782K65300J56820
3915.9G09417105J07586K04086K32399J48833Q7499Q8811J03593J32084J43886R5605
3936.3G10761487Q3983J39773J41263J04070J30415J37508R2387R1434J03473Q1480
3956.7G11867273Q7857J27614J46925J30773J17778J37747J51932J08361O4910Q2493
3977.1G13023663Q1002P3135J27673J56939J16110R1315J10089J02878R0599J01626
3997.5G14075029
$$ y = [707579613, 707828045, 708153903, 708438635, 708563507, 708610415, 708673239, 708778203, 708994985, 709260285, 709417105, 709524691, 709728777, 709961176, 710110009, 710197508, 710286319, 710389912, 710521996, 710665882, 710761487, 710845470, 710985243, 711126506, 711230576, 711360991, 711498499, 711590886, 711682320, 711785793, 711867273, 711955130, 712082744, 712229669, 712360442, 712478220, 712615967, 712767899, 712876260, 712941170, 713023663, 713104665, 713177800, 713305473, 713462412, 713578522, 713669837, 713779926, 713882804, 713973403, 714075029]
##END=$$ End of the data block
