##TITLE=$$ Begin of the data block
##JCAMP-DX=5.00 $$ ACD/SpecManager v 10.08
##SPECTROMETER/DATA SYSTEM=Alpha
##DATE=22 Dec 2014 10:36:42
##DATA TYPE=INFRARED SPECTRUM
##DATA CLASS=XYDATA
##ORIGIN=
##OWNER=
##NPOINTS=1765
##FIRSTX=399.76428223
##LASTX=3997.64306641
##MAXX=3997.64306641
##MINX=399.76428223
##MAXY=0.86222541
##MINY=0.44263244
##XFACTOR=1.0000000000
##YFACTOR=1.000000000000000e-9
##FIRSTY=0.69941467
##DELTAX=2.03961372
##XUNITS=1/CM
##YUNITS=ARBITRARY UNITS
##XYDATA=(X++(Y..Y))
399.8F99414670m807174j729429j173913k268016j650036J392186L687799K798676
416.1F95664763l63171k528965j000106l45171k305984l516078k211035p93934j458525
434.4F81141794k637327j392186J598656L495873L161430K032518J783967K174855
450.8F91359580J842320N20467m94420n51462l65913j033962k247751k611935j765132
469.1F84651792j355052k509117l241897k159476n44071P2717n25593q20041p451M90070
489.5F74051881k95520j384795j434326q55088r41992j719236k079785j802325j817763
507.9F61721051k353251k981246l133535k810776l021539l611564l329158k100289
524.2F38379693q67963m08590l49998K77758J722931L002823L460407L619492L710330
$$ plain form
399.8 699414670 694607496 692878067 691704154 689436138 687786102 689178288 692866087 695664763
416.1 695664763 695301592 692772627 691772521 691427350 689121366 685605288 683394253 682600319 681141794
434.4 681141794 678504467 677112281 678710937 682206810 685368240 687400758 689184725 691359580
450.8 691359580 693201900 693722367 693227947 692676485 692310572 691276610 689028859 686416924 684651792
469.1 684651792 683296740 680787623 677545726 675386250 674842179 674914896 674389303 673569262 673561811 674051881
489.5 674051881 673756361 672371566 670937240 670082152 669140160 667420924 665341139 663538814 661721051
507.9 661721051 659367800 656386554 653253019 650442243 647420704 643809140 640479982 638379693
524.2 638379693 637511730 637103140 636753142 637030900 638753831 641756654 645217061 648836553 652546883
542.5F52546883L201604J744687q9586j122176r94444j002252k079606l344238l730655
560.9F45130217l510654l852546n124807n980194m970789k625823n81622O31094K114475
579.3F21229351M427135O131589N816936M270971L284991L117025K310514N01574p11680
597.6F50378406m75287L39150M98235k18987n61059M68195J812458J895487J107276
616F55243874J320719K893329M001260L430486K149760J919151K722740K979040J834571
634.3F78494930N20706P10488J713931J662374N07712j78516N74053J729965J550496
652.7F87286139L31759j6689J079678J926840J201510j31905m90606J264989K396346
671F94848061J364469L41952O19113J769424K050161R89020J4663K93672J129985R23037
$$ plain form
542.5 652546883 655748487 657493174 657403588 656281412 655286968 654284716 652205110 648860872 645130217
560.9 645130217 641619563 637767017 632642210 626662016 621691227 619065404 618483782 619114876 621229351
579.3 621229351 625656486 631788075 637605011 641875982 645160973 648277998 650588512 651090086 650378406
597.6 650378406 649903119 650242269 650740504 650521517 649960458 650428653 652241111 654136598 655243874
616 655243874 656564593 659457922 663459182 666889668 669039428 670958579 673681319 676660359 678494930
634.3 678494930 679015636 679726124 681440055 683102429 683610141 683431625 684005678 685735643 687286139
652.7 687286139 687617898 687601209 688680887 690607727 691809237 691677332 691186726 692451715 694848061
671 694848061 696212530 696554482 697173595 698943019 700993180 701982200 701996863 702290535 703420520 704343557
691.4G04343557n55813j627028j416087j035035j599550k588868k451956p86961R29416
709.8F93211675J399517J233458J855493L333568M436732M224121L402949L443479
726.1G16540992M174590M159332K906501J596570J492560K004921J660169K00033j131177
744.5G33604491j341582j150369j816154l126204l758371l220319k410472k193808
760.8G14587212k164722j277447O70672K656758L758073M273831M983008N917073O277680
779.1G39682138N443454M030823L320098L396273L243506K491772J836598K070785
795.4G65515447L007471L434777K805055K002120J865267K142728J977622J137495
811.8G83887982M63903O46949J053453P00891l11494j055837j103222j075745j747489
$$ plain form
691.4 704343557 703787744 702160716 700744629 699709594 698110044 695521176 693069220 692282259 693211675
709.8 693211675 694611192 695844650 697700143 701033711 705470443 709694564 713097513 716540992
726.1 716540992 720715582 724874914 727781415 729377985 730870545 732875466 734535635 734735668 733604491
744.5 733604491 732262909 731112540 729296386 726170182 722411811 719191492 716781020 714587212
760.8 714587212 712422490 711145043 711815715 714472473 718230546 722504377 727487385 733404458 739682138
779.1 739682138 745125592 749156415 752476513 755872786 759116292 761608064 763444662 765515447
795.4 765515447 768522918 771957695 774762750 776764870 778630137 780772865 782750487 783887982
811.8 783887982 784351885 784998834 786052287 786753178 786441684 785385847 784282625 783206880 781459391
830.1G81459391k938449l609360l326475k801120k816022l192484l055752k256631
846.4G57463098j704932k050280k791345l043354k743423k292156j412571O21736L616631
864.8G45663404O293059P634699P534325O597996N526126M325926K547681K24531j783669
883.2G84564078k738297k996206l381551l987252m122436l440559k655626k608657
899.5G58633494l149330l546953l638745m030466n065441o218433o809831o782174
915.8G19392121o513059o034196m964053l291905j621664n68986l7610N87463J527071
934.1F98475182K507687L239154L591776L567160K932369J218915j494229m472076
950.5G09565938o939888q613348r809793j0923504j2010455j2980938j3881267j4867305
$$ plain form
830.1 781459391 778520942 774911582 771585107 768783987 765967965 762775481 759719729 757463098
846.4 757463098 755758166 753707886 750916541 747873187 745129764 742837608 741425037 742046773 745663404
864.8 745663404 751956463 759591162 767125487 773723483 779249609 783575535 786123216 786347747 784564078
883.2 784564078 781825781 778829575 775448024 771460772 767338336 763897777 761242151 758633494
899.5 758633494 755484164 751937211 748298466 744268000 739202559 732984126 726174295 719392121
915.8 719392121 712879062 706844866 701880813 698588908 696967244 696398258 696360648 696948111 698475182
934.1 698475182 700982869 704222023 707813799 711380959 714313328 715532243 714038014 709565938
950.5 709565938 702626050 694012702 684202909 673279405 661268950 648288012 634406745 619539440
966.8F19539440j5994370j7080665j7929852j8503427j8731714j8351316j7109603
981.1D95838493j5093058j2592137r851694p111013m641235k662897j177013p7009
997.4D42632437O79940J041651R51707M69118j82479p03633q98063p22081k03490O10560
1017.8D43675667J506537K337575L063739L610014M014999M255951M153072L589660
1034.1D70207214K692461J809001J241565R55582Q77499J118213J764804K829194M162223
1052.4D87657756N474984O687582P903188R062529R926975R812593P608354K588213
1068.8E46722174m277528r814202j1089921q353055m184127o38962J713634L214478
1085.1E13292491M420579N536079O277681O299615N645990M624069L372371J940608
$$ plain form
966.8 619539440 603545070 586464405 568534553 550031126 531299412 512948096 495838493
981.1 495838493 480745435 468153298 458301604 451190591 446549356 443886459 442709446 442632437
997.4 442632437 443312377 444354028 445305735 445774853 445592374 444888741 443990678 443268597 443065107 443675667
1017.8 443675667 445182204 447519779 450583518 454193532 458208531 462464482 466617554 470207214
1034.1 470207214 472899675 474708676 475950241 476905823 477783322 478901535 480666339 483495533 487657756
1052.4 487657756 493132740 499820322 507723510 516786039 526713014 536525607 544133961 546722174
1068.8 546722174 542444646 532630444 521540523 513187468 509003341 508364379 510078013 513292491
1085.1 513292491 517713070 523249149 529526830 535826445 541472435 546096504 549468875 551409483
1101.4E51409483P64847N24401J446307K843499L680110L644288L215134K848923K483130
1119.8E72860122J883983J351893J620055K828419M102528M307508L106416J058280
1136.1E93119204j249909l633500n855917p347703p641077o834865n586207m425287
1152.4E50544739l225267j663566J47939J808643L234923M835248O927312R138882
1168.7E71748853J0731816J1445284J1699617J1904537J1974693J1515915J0458410
1183F51479125R313345Q407176P360637N732536L821254K398312J773536J517296J184642
1201.3F92987859R24230J176715J968920K770841L129840L166914L245771L303170
1217.7G12674260K875447J791895N45323k31385n34952q53658j346528j651824j475215
$$ plain form
1101.4 551409483 552174330 552698731 554145038 556988537 560668647 564312935 567528069 570376992 572860122
1119.8 572860122 574744105 576095998 577716053 580544472 584647000 588954508 592060924 593119204
1136.1 593119204 591869295 588235795 582379878 575032175 567391098 560556233 554970026 550544739
1152.4 550544739 547319472 545655906 545803845 547612488 550847411 555682659 562609971 571748853
1168.7 571748853 582480669 593925953 605625570 617530107 629504800 641020715 651479125
1183 651479125 660792470 669199646 676560283 682292819 686114073 688512385 690285921 691803217 692987859
1201.3 692987859 693912089 695088804 697057724 699828565 702958405 706125319 709371090 712674260
1217.7 712674260 715549707 717341602 717886925 717655540 717120588 716266930 714920402 713268578 711793363
1236G11793363j059711q08060o85573l78310K60949R53793J248539J102745R00865
1254.4G13328600Q98182Q97229O33836K98977L29494P81000J239836J265347Q51333
1272.7G20523834L99769J59442m8637m01497p49648q64804p23779n59986o38008q91626
1293.1G16205060j049399j041889j012206j062691j129270j090765r23693p34031o70374
1311.5G07490742p58290q01265p20561q16047j325488k107263k843261l327190l580451
1329.8F91210926l628910l329635k541601j538873q64089n19871j63019J87099L49820
1348.2F79161847J84595k26319o20901p68542o06180m65333q12590j196027q81851
1366.6F73768699l07619J47640M32432L70920K30372L59654M09305O20663J753688
$$ plain form
1236 711793363 710733652 709925592 709240019 708861709 709122658 710076451 711324990 712427735 713328600
1254.4 713328600 714226782 715124011 715757847 716056824 716386318 717167318 718407154 719672501 720523834
1272.7 720523834 720923603 721083045 721034408 720632911 719883263 719018459 718294680 717734694 717096686 716205060
1293.1 716205060 715155661 714113772 713101566 712038875 710909605 709818840 708895147 708161116 707490742
1311.5 707490742 706732452 705931187 705210626 704394579 703069091 700961828 698118567 694791377 691210926
1329.8 691210926 687582016 684252381 681710780 680171907 679307818 678787947 678624928 678812027 679161847
1348.2 679161847 679346442 679120123 678499222 677730680 677124500 676659167 675846577 674650550 673768699
1366.6 673768699 673461080 673608720 674041152 674412072 674642444 675002098 675411403 676032066 677785754
1384.9F77785754L328502L618300K675236J826644R14573J3113n97536r78172j143813
1403.3F87442601j432181j518488j250684j191556j193822p35402j85966k47836l54887
1421.6F79331779q3148K12669P66158J247406J207829J223862J516700J395404J072049
1440F87890708J041711R00805O82831K89023k74063n36441m02213o25073j522303j009524
1460.4F86435461L67343J620055K573013L644288N450725P380784O887912N512119
1476.7G19871700N166590N091846M769981M363775M549086M638434L563106K448380
1493G54462898K659917L131628K531051J922369K148927L109812L091455Q91328L16202
1511.4G74265587Q89540J518130J823187J768232J352727M43280J99258L87967O22451
$$ plain form
1384.9 677785754 681114256 684732556 687407792 689234436 690149009 690162122 689564586 688586414 687442601
1403.3 687442601 686010420 684491932 683241248 682049692 680855870 680120468 679934502 679686666 679331779
1421.6 679331779 679248631 679461300 680227458 681474864 682682693 683906555 685423255 686818659 687890708
1440 687890708 688932419 689833224 690516055 690805078 690531015 689994574 689592361 688967288 687444985 686435461
1460.4 686435461 686802804 688422859 690995872 694640160 700090885 707471669 714359581 719871700
1476.7 719871700 725038290 730130136 734900117 739263892 743812978 748451412 752014518 754462898
1493 754462898 757122815 760254443 762785494 764707863 766856790 769966602 773058057 773949385 774265587
1511.4 774265587 775155127 776673257 778496444 780264676 781617403 782060683 782259941 782647908 783270359
1529.7G83270359R25303N75661L73006J327336J802802j92225j467943j169443m20869
1548.1G85023987m6253j10149O1810O83307M34995k244234k270341j246512p51495
1566.4G79535115n46873j122773j243829q33094j424671j921475j528501j435101j513302
1584.8G67965496j462102j411975j571595j859487k144098k194524k006530k017558
1601.1G53297627k289057k394080k334118k555907k781152k532483k574145l315866
1617.4G32520819k727628j928926k440095k732217k430141k212763j340866j95443
1633.7G16512740j20402q01921m40597L87013J244247K056002K016247J770377K693355
1652.1G25317061K633810J221299J787663K879619L365279L025531K935589L800809
$$ plain form
1529.7 783270359 784195662 784771323 785144329 786471665 788274467 788082242 786614299 785444856 785023987
1548.1 785023987 784977734 784867585 784929395 785612702 786047697 783803463 781533122 780286610 779535115
1566.4 779535115 778988242 777865469 776621640 775788546 774363875 772442400 770913899 769478798 767965496
1584.8 767965496 766503394 765091419 763519824 761660337 759516239 757321715 755315185 753297627
1601.1 753297627 751008570 748614490 746280372 743724465 740943313 738410830 735836685 732520819
1617.4 732520819 729793191 727864265 725424170 722691953 720261812 718049049 716708183 716512740
1633.7 716512740 716392338 715590417 715149820 715536833 716781080 718837082 720853329 722623706 725317061
1652.1 725317061 727950871 729172170 730959833 733839452 737204731 740230262 743165851 746966660
1668.4G46966660M025042L069162L007591L184319L120839L544689M152298L885984
1684.7G74956584K390563K198995K548992K584934L047348L123581K519369J853228
1701.1G95223594J084804R69231R01103P90060J016915J350939J560927R90688k20120
1719.4H03668141l66747L9220M59015J080454J721501J986802J834750J140833J193821
1737.8H12757790J865268J890898J681566J954138K298772J970351J114786R41098
1754.1H26474667J361906J522422J333475R82404O77705R73284J454711J472771P53164
1772.4H37006509j1861J60873O46830P03215M22597L18050M76540Q52525J044571N33641
1792.8H42153490O1988L27111O06537M21047R9659J78396N17250O58631L84331P4625
$$ plain form
1668.4 746966660 750991702 754060864 757068455 760252774 763373613 766918302 771070600 774956584
1684.7 774956584 777347147 779546142 782095134 784680068 787727416 790850997 793370366 795223594
1701.1 795223594 796308398 797277629 798178732 798968792 799985707 801336646 802897573 803888261 803668141
1719.4 803668141 803301394 803340614 803799629 804880083 806601584 808588386 810423136 811563969 812757790
1737.8 812757790 814623058 816513956 818195522 820149660 822448432 824418783 825533569 826474667
1754.1 826474667 827836573 829358995 830692470 831674874 832352579 833325863 834780574 836253345 837006509
1772.4 837006509 836994648 837155521 837802351 838505566 838928163 839246213 839722753 840575278 841619849 842153490
1792.8 842153490 842215478 842542589 843149126 843570173 843669832 843848228 844365478 845024109 845408440 845483065
1813.2H45483065J93894M03344M14193M17471N01573N10454N05745L62218q8573j36733
1833.6H48566651J68920K76387L21686N23269M45247n3346k31386j16884o616Q1777
1854H49975705J54078J62959R5010R7096K99394N31554L29137k32517l11733k4736
1874.4H51075947J09732J26601J50680J91391K24590K79188K54572O0439M4346J53720
1894.8H52671206N6446l9041M2378J00673P8857P4207O4791L9637Q2433J70469J23263
1917.3H53465319p75N9068P4625j00434j50263l1889Q0169P0095j4782J371J83940
1939.7H53636444K99751Q1957j71244j56701J6391J55688J46448M5121N543R7335J84118
1962.1H54340851J80841P6830m6849Q404J04070N245j04666r954J40727J47879l58
$$ plain form
1813.2 845483065 845676959 846080303 846494496 846911967 847413540 847923994 848429739 848791957 848703384 848566651
1833.6 848566651 848735571 849011958 849333644 849856913 850302160 850248814 850017428 849900544 849893928 849975705
1854 849975705 850129783 850292742 850387752 850484848 850784242 851315796 851644933 851412416 851100683 851075947
1874.4 851075947 851185679 851312280 851462960 851654351 851878941 852158129 852412701 852473140 852517486 852671206
1894.8 852671206 852727652 852688611 852730989 852831662 852910519 852984726 853049517 853089154 853171587 853342056 853465319
1917.3 853465319 853464544 853523612 853598237 853497803 853347540 853315651 853395820 853465915 853451133 853452504 853636444
1939.7 853636444 853936195 854018152 853846908 853690207 853706598 853862286 854008734 854053855 854059398 854156733 854340851
1962.1 854340851 854521692 854598522 854551673 854560077 854664147 854669392 854564726 854554772 854695499 854843378 854843020
1984.6H54843020j26361o617J98782R2208j68264k10821q2553M9353K4617j50383k37167
2007H54225814j06394L4809k7180k06768l44336l64304l18765m29929n38885k31087
2027.4H51692975J48296J40726q6307k81572k83420r6798j0133j69993l25679k62022
2047.8H50466073m7386P1287m1127j99557j48654O7413J59383K9028q2076J4544J41620
2070.2H50430548J13607l1233j30296l5345J35958J45852O914n3227P2599K13861J61350
2092.7H51030588j848m5359P5579J85847J47641L1114q047Q2254J58370R2745l9518
2115.1H51709366o0141N9545J45495Q6724m1544q3148N364Q6129N5849k8252n9605
2137.5H51875782L9458J37985O5506m3393j1265R7931J24454M8697k1338L3974J87040
$$ plain form
1984.6 854843020 854716659 854710042 854908824 855001032 854832768 854621947 854539394 854588747 854613364 854462981 854225814
2007 854225814 854119420 854154229 854127049 853920281 853575945 853211641 852892876 852462947 851924062 851692975
2027.4 851692975 851841271 851981997 851895690 851614118 851330698 851233900 851223767 851053774 850728095 850466073
2047.8 850466073 850418687 850489974 850448847 850249290 850100636 850168049 850327432 850356460 850274384 850288928 850430548
2070.2 850430548 850544155 850512922 850382626 850347281 850483239 850629091 850636005 850582778 850655377 850869238 851030588
2092.7 851030588 851028740 850983381 851058960 851244807 851392448 851423562 851415515 851497769 851656139 851748884 851709366
2115.1 851709366 851649225 851708770 851854265 851940989 851899445 851816297 851821661 851907790 851963639 851935387 851875782
2137.5 851875782 851915240 852053225 852118731 852075338 852064073 852162004 852286458 852335155 852313817 852347791 852534831
2160H52534831K59816J67489K1100L7849K64764M13478K96950J49965J83582K98918
2180.4H54628742L25024K15590J19507K01047L35097L09169J56105Q0645J69873K76923
2200.8H56817722K52188J37686J00434K07663L14712K64347J17719Q2850K00809K86400
2221.2H58782530K19583R5666O7115J65820K52604J82569L6419K6107J59561K13146
2241.6H60201120J02699r656J9372J42812J88053R0003o676M1008J54734J61767M8280
2264H61133516l0339M0650J67430J64747P9870P0989J48178K11715J46270J6987k8312
2286.4H62121701K8849P4863m530r6380o9082n37K9088m4168k10523k86102k27154
2308.9H61316025j66118j44422j52349k09213k85148l13282l02315l61145m41610l42727
$$ plain form
2160 852534831 852794647 852962136 852983236 853021085 853285849 853699327 853996277 854146242 854329824 854628742
2180.4 854628742 854953766 855169356 855288863 855489910 855825007 856134176 856290281 856370926 856540799 856817722
2200.8 856817722 857069910 857207596 857308030 857515693 857830405 858094752 858212471 858295321 858496130 858782530
2221.2 858782530 859002113 859097779 859164894 859330714 859583318 859765887 859802306 859828413 859987974 860201120
2241.6 860201120 860303819 860294163 860313535 860456347 860644400 860734403 860727727 860768735 860923469 861085236 861133516
2264 861133516 861103177 861143827 861311257 861476004 861555874 861626863 861775041 861986756 862133026 862150013 862121701
2286.4 862121701 862150550 862225413 862220883 862124503 862055421 862054884 862083972 862039804 861829281 861543179 861316025
2308.9 861316025 861149907 861005485 860853136 860643923 860358775 860045493 859743178 859382033 858940423 858597696
2329.3H58597696j53780j63138l78847m19855j41144K4021N0246L60787N29468J06037
2349.7H58411491n28753r26196r13263o30677k64704N841J52231L16560M78923N76973
2370.1H56678426N86510M89294M87268O09518N94794M03405K05397P7784N067m6134
2390.4H60091329q6785j12235j14978r7751r5964j15752j59383j93655j80960k06768
2410.8H58727098k51472k26319j97351k01881k34962k81334k86817k74539k79427k82347
2431.2H56210649k87890l20673l42071k96474k44141k56598l02851l42846l56078l33249
2451.6H53127778k99633k70307k52366k82109l33547l19660k70307k59638k69234k66731
2472H50304246k59042k60591k54631k46942k43485k45870k67684k78592k41697j69098
$$ plain form
2329.3 858597696 858443916 858280778 857901931 857482076 857340932 857364953 857415199 857775986 858305454 858411491
2349.7 858411491 857882738 856956542 856043279 855412602 855147898 855153739 855305970 855622530 856101453 856678426
2370.1 856678426 857264936 857754230 858241498 858851016 859445810 859849215 860054612 860132396 860137463 860091329
2390.4 860091329 860004544 859892309 859777331 859679580 859583616 859467864 859308481 859114826 858933866 858727098
2410.8 858727098 858475626 858249307 858051956 857850075 857615113 857333779 857046962 856772423 856492996 856210649
2431.2 856210649 855922759 855602086 855260015 854963541 854719400 854462802 854159951 853817105 853461027 853127778
2451.6 853127778 852828145 852557838 852305472 852023363 851689816 851370156 851099849 850840211 850570977 850304246
2472 850304246 850045204 849784613 849529982 849283040 849039555 848793685 848526001 848247409 848005712 847836614
2492.4H47836614j39296j95861k42234j98960j34766j35779k00868k49028k03788j30654
2512.8H46005380j35839k16007k68936k31564j92702k23637k70426k85447k70486k74717
2533.2H43635619l27528l76999l72708l25441l14415l62098m02987l86596l32892l17871
2553.6H40116084l47734l57211l24130k82585k88546l58284m09961l56078k66909k76089
2574H36848557l55780l72052k92242k17616k61605l43859l12686k28525j83999j93596
2594.4H34086597k63870l04162k51472j91629k26021l37124l79205l20255l18230m21643
2614.8H31072986n01215n01454m47691l97265m85539o19710o24597n78940n71608o32405
2635.2H25712562p10488o81996o03199o16849o98208p30396o66916n80072n84484o57737
$$ plain form
2492.4 847836614 847697318 847501457 847259223 847060263 846925497 846789718 846588850 846339822 846136034 846005380
2512.8 846005380 845869541 845653534 845384598 845153034 844960332 844736695 844466269 844180822 843910336 843635619
2533.2 843635619 843308091 842931092 842558384 842232943 841918528 841556430 841153443 840766847 840433955 840116084
2553.6 840116084 839768350 839411139 839087009 838804424 838515878 838157594 837747633 837391555 837124646 836848557
2574 836848557 836492777 836120725 835828483 835610867 835349262 835005403 834692717 834464192 834280193 834086597
2594.4 834086597 833822727 833518565 833267093 833075464 832849443 832512319 832133114 831812859 831494629 831072986
2614.8 831072986 830571771 830070317 829622626 829225361 828739822 828120112 827495515 826916575 826344967 825712562
2635.2 825712562 825002074 824320078 823716879 823100030 822401822 821671426 821004510 820424438 819839954 819182217
2655.6H19182217o71089n96821n41687n86927o76632o70910n55038m78387n09322n60581
2676H13334823n58794n17726n02825n45740n67019n08189m58181m88281n49853n89847
2696.4H08048368n88835n54383n59985o31869o93619o71327o08147o17802o56724o25014
2716.8H01840663n37574m80771n21362n97954o14524n54502m58419m44770m86791m41790
2737.2G96702206l68535l74854m75585n57483m90308l73661l42846l87728m37558m36604
2757.6G92457044l90231l37363l18289l56912l93510l61502l35098l85642m78386n44966
2778G88555145n34832n21243n97417o77586o87301o82890p05243p51197q15868q92163
2798.4G81689405r37998r51767j019001j098394j104474j115620j202524j299620j331270
$$ plain form
2655.6 819182217 818511128 817914307 817372620 816785693 816109061 815438151 814883113 814404726 813895404 813334823
2676 813334823 812776029 812258303 811755478 811209738 810642719 810134530 809676349 809188068 808638215 808048368
2696.4 808048368 807459533 806905150 806345165 805713296 805019677 804348350 803740203 803122401 802465677 801840663
2716.8 801840663 801303089 800822318 800300956 799703002 799088478 798533976 798075557 797630787 797143996 796702206
2737.2 796702206 796333671 795958817 795483232 794925749 794435441 794061780 793718934 793331206 792893648 792457044
2757.6 792457044 792066813 791729450 791411161 791054249 790660739 790299237 789964139 789578497 789100111 788555145
2778 788555145 788020313 787499070 786901653 786224067 785536766 784853876 784148633 783397436 782581568 781689405
2798.4 781689405 780751407 779799640 778780639 777682245 776577771 775462151 774259627 772960007 771628737
2816.7G71628737j310467j291037j334429j467049j594603j617968j594067j652121
2833G59766996j798928j912713k003431k182365k422988k664626k811014k767981k557277
2851.4G38645673k262652j971603j713275j595915j756847k136171k581060k966046
2867.7G21662104l154218l204405l390253l598392l479838l136278k794742k441287
2884F96462691k054870j636863j197696q47101o70671o40512o95527p53760q14557
2902.4F87151134r80973j235783j468659j693249k052187k586842l008008l063500
2918.7F71061933k897739k636969k236486j640797q95023j58429O01530J456618K316475
2937F64971113L080487L639937L896832L889978L788293L717959L648400L509819L402472
$$ plain form
2816.7 771628737 770318270 769027233 767692804 766225755 764631152 763013184 761419117 759766996
2833 759766996 757968068 756055355 754051924 751869559 749446571 746781945 743970931 741202950 738645673
2851.4 738645673 736383021 734411418 732698143 731102228 729345381 727209210 724628150 721662104
2867.7 721662104 718507886 715303481 711913228 708314836 704834998 701698720 698903978 696462691
2884 696462691 694407821 692770958 691573262 690726161 690055490 689414978 688719451 687965691 687151134
2902.4 687151134 686170161 684934378 683465719 681772470 679720283 677133441 674125433 671061933
2918.7 671061933 668164194 665527225 663290739 661649942 660754919 660596490 661198020 662654638 664971113
2937 664971113 668051600 671691537 675588369 679478347 683266640 686984599 690632999 694142818 697545290
2955.4F97545290L491700L684997L694237L489673L311336L240764L165781L051401
2971.7G24675179K868592K636552K572715K553285K226769J791418J583874J524687
2988G42433071J483083J313209R65178P06733N30481L11852J54554J789j43171j67310
3008.4G47589469k05576m26233p77006j044512j113355j163185j266301j338482j391887
3026.8G38862932j368702j311481j379668j582981j704990j580477j484037j672446
3043.1G26778150j937986j970351j802027j762688j882851j946390j990437k014160
3059.4G11471260j932979j816630j741231j836300k076268k164900j991868j722575
3075.7F96188509j651763j879037k087235k111018k104878k075077k039730k116740
$$ plain form
2955.4 697545290 701036990 704721987 708416224 711905897 715217233 718457997 721623778 724675179
2971.7 724675179 727543771 730180323 732753038 735306323 737533092 739324510 740908384 742433071
2988 742433071 743916154 745229363 746194541 746901274 747431755 747743607 747898161 747899950 747756779 747589469
3008.4 747589469 747383893 746957660 746180654 745136142 744022787 742859602 741593301 740254819 738862932
3026.8 738862932 737494230 736182749 734803081 733220100 731515110 729934633 728450596 726778150
3043.1 726778150 724840164 722869813 721067786 719305098 717422247 715475857 713485420 711471260
3059.4 711471260 709538281 707721651 705980420 704144120 702067852 699902952 697911084 696188509
3075.7 696188509 694536746 692657709 690570474 688459456 686354578 684279501 682239771 680123031
3092.1F80123031k169788k071917j940787j956820k099931k109588j951932j895965
3108.4F63926303k027392j997948j770913j748801j916527k151668k356410k305448
3124.7F47651196k089799j985490k041221k079666j973152j802683j801490k040387
3141F31837308k180516k058924j931846j811981j695156j851618k118528k120197j980245
3159.4F14088297j897812j860857j857638j842678j828015j838386j818061j783192
3175.7E99361658j773119j779258j803637j793921j706123j648724j699329j760602
3192E85396945j739740j666427j588881j548588j574278j599729j576006j527369j465798
3210.3E71110129j447260j455069j404583j399398j475871j491248j446605j380682
$$ plain form
3092.1 680123031 677953243 675881326 673940539 671983719 669883788 667774200 665822268 663926303
3108.4 663926303 661898911 659900963 658130050 656381249 654464722 652313054 649956644 647651196
3124.7 647651196 645561397 643575907 641534686 639455020 637481868 635679185 633877695 631837308
3141 631837308 629656792 627597868 625666022 623854041 622158885 620307267 618188739 616068542 614088297
3159.4 614088297 612190485 610329628 608471990 606629312 604801297 602962911 601144850 599361658
3175.7 599361658 597588539 595809281 594005644 592211723 590505600 588856876 587157547 585396945
3192 585396945 583657205 581990778 580401897 578853309 577279031 575679302 574103296 572575927 571110129
3210.3 571110129 569662869 568207800 566803217 565403819 563927948 562436700 560990095 559609413
3226.7E59609413j270234j133204j098871j302839j478493j392841j273394j161456
3243E49498081j014828j077176j262247j211882j014471r61780j053870j085520j025200
3261.3E39791107r84371q93354o94692n83410p46072r83238j056611j055360j007736
3279.7E31786263q76009q16882q67129q16345o37352n95987p70152r73045j120270
3298E24313092j079798p90119n75006p36594j149535j420081j369238j182794j110196
3316.4E14899731j146972j147509j061142j006126j185834j400471j366258j244008
3332.7E05341411j111508j023352j182735j431107j506627j476884j332670j137495
3349D95139033j289577j638591j660645j435190j293511j336425j358420j158535j067996
$$ plain form
3226.7 559609413 558339179 557205975 556107104 554804265 553325772 551932931 550659537 549498081
3243 549498081 548483253 547406077 546143830 544931948 543917477 542955697 541901827 540816307 539791107
3261.3 539791107 538806736 537913382 537218690 536635280 535889208 534905970 533849359 532793999 531786263
3279.7 531786263 530910254 530093372 529226243 528409898 527772546 527176559 526406407 525433362 524313092
3298 524313092 523233294 522443175 521868169 521131575 519982040 518561959 517192721 516009927 514899731
3316.4 514899731 513752759 512605250 511544108 510537982 509352148 507951677 506585419 505341411
3332.7 505341411 504229903 503206551 502023816 500592709 499086082 497609198 496276528 495139033
3349 495139033 493849456 492210865 490550220 489115030 487821519 486485094 485126674 483968139 482900143
3367.4D82900143j369983j734823j711399j380801j199990j209677j186162j072854
3383.7D72034454r26047p30425m95732n91219r68963r43243m86165l16143p37489j104980
3404.1D64734048q69960n25683m86374n44250o04510n99712m40747l51936l60131k10613
3424.5D59740132M0025J83254J47790J92374L33160J39326k31475j97679J93447M93199
3444.9D61033553N29975M18037M17799N59359P03395Q38995R14275Q06183P95871J103193
3465.3D68120635J243054Q72225M06593M29303Q24362J171916J168371Q41587Q02577
3483.6D75880623J077086J056969Q78215R89109J231193J295507J171857J181245J271427
3502D86033231J035303Q04901R54002J206279J401842J397818J196176J153260J356811
$$ plain form
3367.4 482900143 481530160 479795337 478083938 476703137 475503147 474293470 473107308 472034454
3383.7 472034454 471108407 470377982 469882250 469291031 468322068 467378825 466892660 466576517 465839028 464734048
3404.1 464734048 463864088 463338405 462852031 462307781 461703271 461103559 460662812 460310876 459950745 459740132
3424.5 459740132 459780157 459963411 460111201 460303575 460636735 460776061 460544586 460346907 460540354 461033553
3444.9 461033553 461563528 461981565 462399364 462958723 463662118 464501113 465415388 466221571 467017442 468120635
3465.3 468120635 469363689 470235914 470642507 471071810 471896172 473068088 474236459 475078046 475880623
3483.6 475880623 476957709 478014678 478892893 479882002 481113195 482408702 483580559 484761804 486033231
3502 486033231 487068534 487873435 488827437 490033716 491435558 492833376 494029552 495182812 496539623
3520.4D96539623J579791J464486J150548J097501J245439J451790J695812J640737
3536.7E07865727J354039J523673J945675J891255J434445J320839J559794J639962
3553E20535409J702548J970350K183020K202809K170503K232969K367377K283693K176583
3571.3E39825261K328097K530754K635419K835632L095865L235102L152132K852678
3587.7E62490940K811074L024519L187597L280699L338992L335834L290653L277660
3604E88037968L293812L389239L496826L595352L618777L429055L320873L328681L096521
3622.3F18607104L030956L286242L520787L318786K934278K890348K918005K939224
3638.7F43445730L047526L169119L333450L570437L482521K643883K085745K307952
$$ plain form
3520.4 496539623 498119414 499583900 500734448 501831949 503077388 504529178 506224990 507865727
3536.7 507865727 509219766 510743439 512689114 514580369 516014814 517335653 518895447 520535409
3553 520535409 522237957 524208307 526391327 528594136 530764639 532997608 535364985 537648678 539825261
3571.3 539825261 542153358 544684112 547319531 550155163 553251028 556486130 559638262 562490940
3587.7 562490940 565302014 568326533 571514130 574794829 578133821 581469655 584760308 588037968
3604 588037968 591331780 594721019 598217845 601813197 605431974 608861029 612181902 615510583 618607104
3622.3 618607104 621638060 624924302 628445089 631763875 634698153 637588501 640506506 643445730
3638.7 643445730 646493256 649662375 652995825 656566262 660048783 662692666 664778411 667086363
3655F67086363K757728K719462K351105K240360K471328K650916K572954K409637K278268
3673.3F89538121K055705J664519J460016J603067K008200K471983K696097K037942
3689.6G05535650J111985J121759J400709J455307J457930J421749J361490J473486
3706G16340065J616895J478851J039505Q90136J044094J123906J083254J035750R74238
3724.3G26626694Q73089R52899J238645J556873J451433Q51512N49554O70195P12633
3742.7G35483527P21336R72390R03666M34696K42115N23805O93381N96285N03301O13630
3763.1G41688132P71165P40528N05328L08991L93808P05957R06110P12276M37200M14252
3783.5G47583747M45247M36723M47213N09799O84381Q38279Q32677O66261M02152L40999
$$ plain form
3655 667086363 669844091 672563553 674914658 677155018 679626346 682277262 684850216 687259853 689538121
3673.3 689538121 691593826 693258345 694718361 696321428 698329628 700801611 703497708 705535650
3689.6 705535650 706647635 707769394 709170103 710625410 712083340 713505089 714866579 716340065
3706 716340065 717956960 719435811 720475316 721365452 722409546 723533452 724616706 725652456 726626694
3724.3 726626694 727499783 728452682 729691327 731248200 732699633 733551145 734100699 734770894 735483527
3742.7 735483527 736204863 737177253 738080919 738515615 738757730 739281535 739974916 740571201 741074502 741688132
3763.1 741688132 742459297 743199825 743705153 744014144 744407952 745113909 746020019 746732295 747169495 747583747
3783.5 747583747 748028994 748465717 748912930 749422729 750107110 750945389 751778066 752444327 752846479 753187478
3803.9G53187478L03268J51813K43068N43117P58767P73550P26997N22614J35422Q8572
3824.3G57434666K67744L59893M50313O56903Q72433O70016J03474r7037J252J18017
3844.6G60837674L25561O08682P49469L16143k39551j1027L13163N27263N25415L25560
3865G64278352K72692K33948J32620J01507J27733K86281M19140M51624M26233J87576
3885.4G66917706P569R7692R9302R9897K93613M81307N51403L57627r5903l14594j23262
3907.9G68372357J21474K57552L53634L60668K04563P6890R7454J39892J13368J04189
3928.3G70202041J33335J05858N5194TJ44839K62737K23279J55032J90079J00017q524
3950.7G71619081N4300J06991R8228J39356J67727J05858N7399J09852J47104R2566
$$ plain form
3803.9 753187478 753490746 753642559 753885627 754428744 755187511 755961061 756688058 757210672 757346094 757434666
3824.3 757434666 757702410 758062303 758512616 759169519 760041952 760711968 760815442 760718405 760719657 760837674
3844.6 760837674 761163235 761771917 762521386 762837529 762597978 762586951 762900114 763427377 763952792 764278352
3865 764278352 764551044 764784992 764917612 765019119 765146852 765433133 765852273 766303897 766730130 766917706
3885.4 766917706 766925275 767022967 767122269 767222166 767515779 767997086 768548489 768906116 768810213 768495619 768372357
3907.9 768372357 768493831 768751383 769105017 769465685 769670248 769747138 769844592 769984484 770097852 770202041
3928.3 770202041 770335376 770441234 770496428 770551622 770696461 770959198 771182477 771337509 771527588 771627605 771619081
3950.7 771619081 771673381 771780372 771878600 772017956 772185683 772291541 772348940 772458792 772605896 772698462
3971.1G72698462J10567J82926J82033J22070O8009P0512M9711N7757J28924J20640
3991.5G73791611Q7500J02937J02699
3997.6G74084747
$$ plain form
3971.1 772698462 772809029 772991955 773173988 773296058 773364067 773434579 773484290 773542047 773670971 773791611
3991.5 773791611 773879111 773982048 774084747
3997.6 774084747
##END=$$ End of the data block
