##TITLE=$$ Begin of the data block
##JCAMP-DX=5.00 $$ ACD/SpecManager v 10.08
##SPECTROMETER/DATA SYSTEM=Alpha
##DATE=22 Dec 2014 10:36:42
##DATA TYPE=INFRARED SPECTRUM
##DATA CLASS=XYDATA
##ORIGIN=
##OWNER=
##NPOINTS=1765
##FIRSTX=399.76428223
##LASTX=3997.64306641
##MAXX=3997.64306641
##MINX=399.76428223
##MAXY=0.86299884
##MINY=0.44275165
##XFACTOR=1.0000000000
##YFACTOR=1.000000000000000e-9
##FIRSTY=0.69831932
##DELTAX=2.03961372
##XUNITS=1/CM
##YUNITS=ARBITRARY UNITS
##XYDATA=(X++(Y..Y))
399.8F98319316m623413j555026m58657j613200j786530O67453L056526K618968m24385
418.1F94201052k594352q12351p5043k154350l735304k641439p64072q85725k229154
436.5F78309262j524031J362264L377914L122390J905322J453459K311826K484440
452.8F92802846Q99554m48346o69897o02186j320421k375842k538740j743973j298904
471.2F82704091k309859l136158k145886n57304n6862o40631p75874N2154N30243q6367
491.5F73577547j061082j311719j062751j223147j805365k130926j937151j855492
507.9F61189914k265871k880871l118932k878428l069877l704787l367245j874030
524.2F38029873o14285l41773l43502K48552J610636K939821L580928L707170L542304
$$ plain form
399.8 698319316 693695903 692140877 691682220 690069020 688282490 688949943 692006469 694625437 694201052
418.1 694201052 691606700 690794349 690719306 688564956 684829652 682188213 681424141 680538416 678309262
436.5 678309262 676785231 678147495 681525409 684647799 686553121 688006580 690318406 692802846
452.8 692802846 693702400 693254054 692584157 691981971 690661550 688285708 685746968 684002995 682704091
471.2 682704091 680394232 677258074 675112188 674554884 674498022 673857391 673081517 673133671 673663914 673577547
491.5 673577547 672516465 671204746 670141995 668918848 667113483 664982557 663045406 661189914
507.9 661189914 658924043 656043172 652924240 650045812 646975935 643271148 639903903 638029873
524.2 638029873 637415588 637073815 636730313 636978865 638589501 641529322 645110250 648817420 652359724
542.5F52359724K991676J696825k5451r87828q72790r65834k085209l333092l728091
560.9F45049930l632605m054130n115389n738140m829645k668976p49112M46141K108991
579.3F20817065M480362O082654N822361M437387L462970L120661K233863N93185n74529
597.6F50475979n45859K49803O06596r6977n76794L72946J708270J813113J019418
616F55026495J287640L030300M170179L455460K083540J875758K799690L080785J821399
634.3F78631246M80950O78241J765073J865863O59526k30253M48704J678228J533926
652.7F87511504L19659n3584J003802J902699J214981j56760n57661J208782K426207
671F94819629J478732M50074O35148J777470K084732R85801k9147L08395J202345R28223
$$ plain form
542.5 652359724 655351400 657048225 657022774 656034946 655162156 654196322 652111113 648778021 645049930
560.9 645049930 641417325 637363195 632247806 626509666 621680021 619011045 618261933 618708074 620817065
579.3 620817065 625297427 631380081 637202442 641639829 645102799 648223460 650457323 651050508 650475979
597.6 650475979 649930120 650179923 650786519 650689542 650112748 650485694 652193964 654007077 655026495
616 655026495 656314135 659344435 663514614 666970074 669053614 670929372 673729062 676809847 678631246
634.3 678631246 679112196 679790437 681555510 683421373 684080899 683850646 684299350 685977578 687511504
652.7 687511504 687831163 687777579 688781381 690684080 691899061 691742301 691184640 692393422 694819629
671 694819629 696298361 696748435 697383583 699161053 701245785 702231586 702202439 702510834 703713179 704641402
691.4G04641402o06716j712322j503706j035273j511574k509892k474070q22603R79900
709.8F93445146J484335J265704J833737L343582M481375M219592L338695L419160
726.1G16831326M267812M229248K814293J501679J540244K056956J578748J00136j139223
744.5G33781219j317859j158774j863480l173351l791392l218353k348482k174378
760.8G14735150k232968j296759P36713K727390L823638M282295M904211N885839O360233
779.1G39925742N504191L973723L243565L414333L309488K529979J873076K095103
795.4G65869200K965629L354729K763807K010465J892328K184630K022087J193106
811.8G84255981M99011O03973J012743P09474l47912j111269j103163j101852j857042
$$ plain form
691.4 704641402 704034686 702322364 700818658 699783385 698271811 695761919 693287849 692465246 693445146
709.8 693445146 694929481 696195185 698028922 701372504 705853879 710073471 713412166 716831326
726.1 716831326 721099138 725328386 728142679 729644358 731184602 733241558 734820306 734920442 733781219
744.5 733781219 732463360 731304586 729441106 726267755 722476363 719258010 716909528 714735150
760.8 714735150 712502182 711205423 711942136 714669526 718493164 722775459 727679670 733565509 739925742
779.1 739925742 745429933 749403656 752647221 756061554 759371042 761901021 763774097 765869200
795.4 765869200 768834829 772189558 774953365 776963830 778856158 781040788 783062875 784255981
811.8 784255981 784754992 785358965 786371708 787081182 786733270 785622001 784518838 783416986 781559944
830.1G81559944l055692l656745l270149k701699k762199l161371l054797k287031
846.4G57610261j708447k060593k846002l079713k723872k285302j417696O66081L680766
864.8G45835483O314039P626593P565320O612837N439461M208505K485931K05218j773715
883.2G84519672k700388l004849l455222m010319m064560l420055k696872k622187
899.5G58545220l143847l577828l682256m047096n052388o197929o796539o780207
915.8G19267130o507933n996764m938424l319799j638949n46933k3305N72026J523792
934.1F98390841K543748L245354L546297L525973K915143J220763j522600m524649
950.5G09340870o949186q591473r782553j0910213j2037277j3022363j3925731j4917434
$$ plain form
830.1 781559944 778504252 774847507 771577358 768875659 766113460 762952089 759897292 757610261
846.4 757610261 755901814 753841221 750995219 747915506 745191634 742906332 741488636 742154717 745835483
864.8 745835483 752149522 759776115 767341435 773954272 779393733 783602238 786088169 786293387 784519672
883.2 784519672 781819284 778814435 775359213 771348894 767284334 763864279 761167407 758545220
899.5 758545220 755401373 751823545 748141289 744094193 739041805 732843876 726047337 719267130
915.8 719267130 712759197 706762433 701824009 698504210 696865261 696318328 696295023 696867049 698390841
934.1 698390841 700934589 704179943 707726240 711252213 714167356 715388119 713865519 709340870
950.5 709340870 702391684 693800211 684017658 673107445 661070168 648047805 634122074 619204640
966.8F19204640j5986025j7009318j7880380j8505692j8754900j8353760j7071158
981.1D95643407j5043080j2541741r775281p061392m660278k662719j120776k6494
997.4D42751646O87808J017839R32365M54098j94877o87570q85874p37696k37942N75036
1017.8D43674833J522541K368241L057480L617466M015237M202693M112125L586411
1034.1D70157027K681315J810014J289398J025587R28223J121909J750111K817631
1050.4D83581215M125953N447447O678313P881582R070337R965658R811878P549167
1066.7E44111550K533913m259289r741783j1035502q310258m136443o57797J653433
1083E10157824L202855M426420N526841O275117O294548N629659M605830L381431J984119
$$ plain form
966.8 619204640 603218615 586209297 568328917 549823225 531068325 512714565 495643407
981.1 495643407 480600327 468058586 458283305 451221913 446561635 443898916 442778140 442751646
997.4 442751646 443439454 444457293 445389658 445843756 445648879 444961309 444075435 443337739 443099797 443674833
1017.8 443674833 445197374 447565615 450623095 454240561 458255798 462458491 466570616 470157027
1034.1 470157027 472838342 474648356 475937754 476963341 477891564 479013473 480763584 483581215
1050.4 483581215 487707168 493154615 499832928 507714510 516784847 526750505 536562383 544111550
1066.7 544111550 546645463 542386174 532644391 521608889 513298631 509162188 508504391 510157824
1083 510157824 513360679 517787099 523313940 529589057 535883605 541513264 546119094 549500525 551484644
1101.4E51484644P77841N09381J466751K885402L698051L616392L178239K854049K498150
1119.8E72968900J883328J379609J663327K828599M068374M285991L116548J069546
1136.1E93264222j273632l672242n869985p313907p560015o788194n648732m510939
1152.4E50626576l220022j586556K19524J839518L221870M800439O929636R168505
1168.7E71999490J0722518J1421919J1720657J1943520J1986613J1499464J0432899
1183F51727080R294808Q376777P313729N711078L826619K408146J797200J531839J174390
1201.3F93161666R30190J203478J990914K788127L129542L136754L220260L294170
1217.7G12855101K852857J762151N35906k27630n38469q50856j319587j608372j441657
$$ plain form
1101.4 551484644 552262485 552771866 554238617 557124019 560822070 564438462 567616701 570470750 572968900
1119.8 572968900 574852228 576231837 577895164 580723763 584792137 589078128 592194676 593264222
1136.1 593264222 591990590 588318348 582448363 575134456 567574441 560786247 555137515 550626576
1152.4 550626576 547406554 545819998 546039522 547879040 551100910 555901349 562830985 571999490
1168.7 571999490 582722008 594143927 605864584 617808104 629794717 641294181 651727080
1183 651727080 661021888 669398665 676712394 682423472 686250091 688658237 690455437 691987276 693161666
1201.3 693161666 694091856 695295334 697286248 700074375 703203917 706340671 709560931 712855101
1217.7 712855101 715707958 717470109 718006015 717778385 717239916 716389060 715069473 713461101 712019444
1236G12019444j060844q36730p35640m17948L00646J035690J255214J045525Q64387
1254.4G13469744Q92579R11832O51539K81274L03447P99060J283824J292527Q46982
1272.7G20732808L89099J64569n2750m39823p87020q43346o71685n37216o23107q79169
1293.1G16452360j056433j036346j012504j098275j129687j047015r29892p89225p01547
1311.5G07651436p46905p84100p19726q12530j313150k089381k837062l361106l642500
1329.8F91344976l668010l300845k471984j479566q27312n25654k02536J64687L56853
1348.2F79390609J85132k43902o31213p79510o21259m46737p60972j163781q90434
1366.6F74037933l26275J45852M16994L33607K36094L93272M20451O21438J732826
$$ plain form
1236 712019444 710958600 710121870 709386230 708968282 709268928 710304618 711559832 712605357 713469744
1254.4 713469744 714362323 715274155 715925694 716206968 716510415 717309475 718593299 719885826 720732808
1272.7 720732808 721121907 721286476 721233726 720793903 720006883 719163537 718491852 717954636 717331529 716452360
1293.1 716452360 715395927 714359581 713347077 712248802 711119115 710072100 709142208 708352983 707651436
1311.5 707651436 706904531 706120431 705400705 704588175 703275025 701185644 698348582 694987476 691344976
1329.8 691344976 687676966 684376121 681904137 680424571 679597259 679071605 678869069 679033756 679390609
1348.2 679390609 679575741 679331839 678700626 677921116 677299857 676853120 676092148 674928367 674037933
1366.6 674037933 673711658 673857510 674274504 674608111 674844205 675237477 675657928 676279366 678012192
1384.9F78012192L265858L568470K687693J857460R11951n305n96225r77636j172662
1403.3F87551796j446366j468837j177073j140356j159250p12157j91629k84969m02093
1421.6F79569066j28448K06232Q19206J288354J181364J193464J546502J441300J073301
1440F88190341J017451Q78394O98924L28600k64704n69045m45366o26087j486898r87112
1460.4F86734498L85582J636267K579331L641248N434215P346094O860613N509317
1476.7G20127165N179286N092740M740656M341781M572511M665255L537417K413928
1493G54670739K638161L120125K547621J929999K134979L090679L058613R07778L83795
1511.4G74482489R53912J556933J838863J773417J337648M45127K32220L88205N99861
$$ plain form
1384.9 678012192 681278050 684846520 687534213 689391673 690303624 690298319 689702094 688724458 687551796
1403.3 687551796 686105430 684636593 683459520 682319164 681159914 680447757 680256128 679971159 679569066
1421.6 679569066 679440618 679646850 680466056 681754410 682935774 684129238 685675740 687117040 688190341
1440 688190341 689207792 690086186 690785110 691113710 690849006 690279961 689834595 689208508 687721610 686734498
1460.4 686734498 687120080 688756347 691335678 694976926 700411141 707757235 714617848 720127165
1476.7 720127165 725306451 730399191 735139847 739481628 744054139 748719394 752256811 754670739
1493 754670739 757308900 760429025 762976646 764906645 767041624 770132303 773190916 774098694 774482489
1511.4 774482489 775436401 776993334 778832197 780605614 781943262 782388389 782620609 783008814 783608675
1529.7G83608675R09865N35130L36588J357615J873135j78396j492560j191914m24803
1548.1G85333335l1173j02401M7267O39081M03643k168954k222538j264751p62760
1566.4G79870749n31078j125157j278698q66533j383304j851440j540660j482070j538813
1584.8G68272996j480222j420736j563728j845777k121150k169610k012848k061427
1601.1G53597498k320647k378762k325833k581000k791226k497077k495289l270447
1617.4G32937217k770007j958549k419352k740324k468467k208769j316428j93358
1633.7G16861963j14023p72000m24683L93629J274467K112448K052486J765609K675831
1652.1G25825727K639472J230658J787781K904952L406882L029347K938211L826201
$$ plain form
1529.7 783608675 784518540 785053670 785390258 786747873 788621008 788442612 786950052 785758138 785333335
1548.1 785333335 785302162 785199761 785247028 785886109 786289752 784120798 781898260 780633509 779870749
1566.4 779870749 779339671 778214514 776935816 776069283 774685979 772834539 771293879 769811809 768272996
1584.8 768272996 766792774 765372038 763808310 761962533 759841383 757671773 755658925 753597498
1601.1 753597498 751276851 748898089 746572256 743991256 741200030 738702953 736207664 732937217
1617.4 732937217 730167210 728208661 725789309 723048985 720580518 718371749 717055321 716861963
1633.7 716861963 716747940 715975940 715551257 715944886 717219353 719331801 721384287 723149896 725825727
1652.1 725825727 728465199 729695857 731483638 734388590 737795472 740824819 743763030 747589231
1668.4G47589231M024207L055036L010452L203332L144443L561795M155040L851175
1684.7G75594711K355755K191662K543509K568067L047049L172993K516806J751721
1701.1G95742273J044631R82583Q90911P75158J036823J404464J611173R99570k43843
1719.4H04243743l91542K4616M80354J120925J727581J968026J814008J118183J184940
1737.8H13290834J862348J893103J704871J985073K304435J959980J097679R08792
1754.1H27007115J349151J544476J350760R60887O42120R57251J455486J492858P98642
1772.4H37558746L8445J87040O35445O64830L91901L15070M92573Q65817J045823N31077
1792.8H42726767M9055L13937O18935M24862P0989J64986N18381O51717L81947O4075
$$ plain form
1668.4 747589231 751613438 754668474 757678926 760882258 764026701 767588496 771743536 775594711
1684.7 775594711 777950466 780142128 782685637 785253704 788300753 791473746 793990552 795742273
1701.1 795742273 796786904 797769487 798660398 799435556 800472379 801876843 803488016 804487586 804243743
1719.4 804243743 803852201 803876817 804357171 805478096 807205677 809173703 810987711 812105894 813290834
1737.8 813290834 815153182 817046285 818751156 820736229 823040664 825000644 826098323 827007115
1754.1 827007115 828356266 829900742 831251502 832212389 832854509 833811760 835267246 836760104 837558746
1772.4 837558746 837597191 837784231 838419676 839084506 839476407 839791477 840284050 841149867 842195690 842726767
1792.8 842726767 842775822 843089759 843708694 844133556 844204545 844369531 844887912 845539629 845921576 845985651
1813.2H45985651J82629M19557M34816M27961N17249N25117N13554L59475j04427j57714
1833.6H49103868J52051K81632L24309N02050M41194k6643k11359j11997j2219Q2791
1854H50525677J67787J71662J03175R5666K83420N36978L53098k42174l57389n7817
1874.4H51580083J12951J38641J49309J85073K18808K84612K83778R2685L6061J00255
1894.8H53182256J5795j8954Q7679J25527Q8990Q4460O5326P093L5703J60218J53124
1917.3H53987217J2517L9279O8844p8380j25707q821J11461Q9526k6047k0206J76489
1939.7H54226172L00646P1466j75715j46389K8968J76788J48832L815k6524J14918
1960.1H54722977K22861J77801M3035m1008K0325R4116K6643o7055r358J15215J22190
$$ plain form
1813.2 845985651 846168280 846587837 847022653 847450614 847967863 848492980 849006534 849366009 849261582 849103868
1833.6 849103868 849255919 849537551 849861860 850363910 850805104 850778461 850567102 850455105 850442886 850525677
1854 850525677 850693464 850865126 850968301 851063967 851347387 851884365 852237463 851995289 851637900 851580083
1874.4 851580083 851693034 851831675 851980984 852166057 852384865 852669477 852953255 853045940 853082001 853182256
1894.8 853182256 853198051 853179097 853266776 853392303 853481293 853565753 853631079 853638172 853673875 853834093 853987217
1917.3 853987217 853999734 854039013 854107857 854029477 853903770 853894949 854006410 854095936 854069889 854049683 854226172
1939.7 854226172 854526818 854598284 854422569 854276180 854305148 854481936 854630768 854634583 854608059 854722977
1960.1 854722977 854945838 855123639 855166674 855125666 855145991 855240107 855266750 855199695 855190337 855305552 855427742
1982.5H55427742j0192j05381K0504J99616Q2910j67132k20895j09195M1663N0664
2002.9H55210304j28031k39431j24395J79l9161j55985k68281l35753l52025m66942
2023.3H53100479n28932j94132J56402J14560j20163k97665k76685j07825l2901j54019
2043.7H51659119k98321k62678n0366Q6963j9669j72556j18911O4612J33752J8120
2064.1H51040065r9480k2888J30236J39952o199j13845l1054J11401J20044J4603l2485
2086.6H51250350P2897K03490J71781L338n9545Q0227J95861J48595K5868k7478O8844
2109H52134228J85072J43647k3603o7234O8009J46389N2810q5235q4639M2618J23143
2131.4H52635205P4208l0816o7949J6391R8765N2452l0994k921J03950J51158R0360
$$ plain form
1982.5 855427742 855417550 855312169 855332673 855532289 855615199 855448067 855227172 855117977 855159640 855210304
2002.9 855210304 855082273 854842842 854718447 854718626 854679465 854523480 854255199 853919446 853567421 853100479
2023.3 853100479 852571547 852377415 852533817 852648377 852528214 852230549 851953864 851846039 851813138 851659119
2043.7 851659119 851360798 851098120 851047754 851134717 851115048 850942492 850823581 850888193 851021945 851040065
2064.1 851040065 850940585 850917697 851047933 851187885 851181686 851067841 851036787 851148188 851268232 851282835 851250350
2086.6 851250350 851323247 851526737 851698518 851701856 851642311 851722538 851918399 852066994 852092862 852065384 852134228
2109 852134228 852319300 852462947 852439344 852372110 852440119 852586508 852639318 852554083 852469444 852512062 852635205
2131.4 852635205 852709413 852678597 852610648 852627039 852725804 852778256 852747262 852744341 852848291 852999449 853089809
2153.9H53089809p033K0444J74165K43783J54913L6895O1512K60413L83973K75433
2174.3H54694307J68383K41280L46422L17871J98782J34289J96457K80619K59518J51456
2194.6H56989384R6917J78218K78592K68936J63913J14023K03372K94744K53201J46270
2215H58987570J32680K35259K96653K02000P4446P4267J79112K43426J52886L933Q584
2237.5H60590816J41561J93238J08838K146P331J30832K19047J31011j4603R299J45316
2259.9H61664832J68144M4346j1802R1672J86027J50442M9412J7702J23501K39611
2280.3H62723887K07782O7174m7385k3783N2572J7464o1095o5267k3127r417p8142
2302.7H62760663j96934k47061k07186j38521r9122j36495k33591k91764k60890k35140
$$ plain form
2153.9 853089809 853082776 853103220 853277385 853521168 853676081 853712976 853774488 854034901 854418874 854694307
2174.3 854694307 854862690 855103970 855450392 855768263 855967045 856101334 856297791 856578410 856837928 856989384
2194.6 856989384 857086301 857264519 857543111 857812047 857975960 858089983 858293355 858588099 858841300 858987570
2215 858987570 859120250 859355509 859652162 859854162 859928608 860002875 860181987 860425413 860578299 860582232 860590816
2237.5 860590816 860732377 860925615 861034453 861036599 861043930 861174762 861393809 861524820 861510217 861519516 861664832
2259.9 861664832 861832976 861877322 861865520 861957192 862143219 862293661 862343073 862360775 862484276 862723887
2280.3 862723887 862931669 862998843 862951458 862927675 862980247 862997711 862936616 862871349 862848222 862838805 862760663
2302.7 862760663 862563729 862316668 862109482 861970961 861871839 861735344 861501753 861209989 860949099 860713959
2323.1H60713959k87891l54588l10719j94370j83344k90871l20673k07067j02937J9610
2343.5H58481109L39508M70102P4148m82380q17478q26180n76019k10405K7240J28627
2363.9H56608272K53379L75450M87685N48899M83870M70579N38409M98235L60847K26497
2384.3H60852122J16289K2769o8724j26124j36196j17660r8884j10805j29282j65999
2404.7H60037506k02537j95265k04324k12312j75476j72615k04862k43663l02911l14236
2425.1H57809305k70426k56419k68400k64704k68102l01421l31938l22997l15488l30806
2445.5H54878604l29196l10540k98023k84255k61188k78711l15726l10957k93613k80439
2465.9H51915956k76983k68996k34604k20775k43664k76149k97546k62856k18869k48730
$$ plain form
2323.1 860713959 860426068 860071480 859760761 859566391 859383047 859092176 858771503 858564436 858461499 858481109
2343.5 858481109 858820617 859290719 859364867 858882487 858065009 857238829 856662810 856452405 856479645 856608272
2363.9 856608272 856861651 857237101 857724786 858273685 858757555 859228134 859766543 860264778 860625625 860852122
2384.3 860852122 860968411 860991180 860922456 860796332 860660136 860542476 860443592 860332787 860203505 860037506
2404.7 860037506 859834969 859639704 859435380 859223068 859047592 858874977 858670115 858426452 858123541 857809305
2425.1 857809305 857538879 857282460 857014060 856749356 856481254 856179833 855847895 855524898 855209410 854878604
2445.5 854878604 854549408 854238868 853940845 853656590 853395402 853116691 852800965 852490008 852196395 851915956
2465.9 851915956 851638973 851369977 851135373 850914598 850670934 850394785 850097239 849834383 849615514 849366784
2486.3H49366784k84076k42769j66536j46568j91271k12967j80364j46568j55866j99795
2506.7H47440004k17080j79231j32620j41144k24114k73942k19405j74344k22981k95162
2527.1H45359981l05533k80559l00587l50415l59297l26276l00825l15785l50118l74555
2547.5H42096031l63946l25978l21269l78788m20630l52025k53677k48194l31580m16398
2567.9H38683546l88265l00765k85030l24308l49343l05534k31385k59936l32594l14474
2588.3H35591912k56777k11298k03550k59578k79546k13146j64151k37346l72589l87907
2608.7H33006024l04877k96653l96132m97639n06699m49002m28081n16057o24716o28710
2629.1H28357458n67257n73695o63757p06852o46710n52654n46337o60061p51615o99997
$$ plain form
2486.3 849366784 849082708 848839939 848673403 848526835 848335564 848122597 847942233 847795665 847639799 847440004
2506.7 847440004 847222924 847043693 846911073 846769929 846545815 846271873 846052468 845878124 845655143 845359981
2527.1 845359981 845054448 844773889 844473302 844122887 843763590 843437314 843136489 842820704 842470586 842096031
2547.5 842096031 841732085 841406107 841084838 840706050 840285420 839933395 839679718 839431524 839099944 838683546
2567.9 838683546 838295281 837994516 837709486 837385178 837035835 836730301 836498916 836238980 835906386 835591912
2588.3 835591912 835335135 835123837 834920287 834660709 834381163 834168017 834003866 833766520 833393931 833006024
2608.7 833006024 832701147 832404494 832008362 831510723 831004024 830555022 830126941 829610884 828986168 828357458
2629.1 828357458 827790201 827216506 826552749 825845897 825199187 824646533 824100196 823440135 822688520 821988523
2649.5H21988523n99325o22809p07209o83188n77390n16355n51284o52432o79374n66244
2669.9H15832913m88043n19097n60105n51104m90844m57049n16057n79893n37217m63307
2690.3H10670197m77612n53250o04928n97715n65708n62012n96285o68228o99162o31988
2710.7H04713309o09338o73116o72757n61595m60923m84943n79417n93245n16236m66764
2731.1G99094975m73261m70042m42684m20511m17947m58062m89891m50670l93808l68655
2751.4G94709444m08411m67002m29273l41475k90811k94387l62575m11511l77834l60429
2771.8G90965736m21763n12063n53131n06401m93169n85914o57797o53684o55055p18534
2792.2G85208225p97152q34465q67725r17256r69708j048028j095772j086116j108825
$$ plain form
2649.5 821988523 821389198 820766389 820059180 819375992 818798602 818282247 817730963 817078531 816399157 815832913
2669.9 815832913 815344870 814825773 814265668 813714564 813223720 812766671 812250614 811670721 811133504 810670197
2690.3 810670197 810192585 809639335 809034407 808436692 807870984 807308972 806712687 806044459 805345297 804713309
2710.7 804713309 804103971 803430855 802758098 802196503 801735580 801250637 800671220 800077975 799561739 799094975
2731.1 799094975 798621714 798151672 797708988 797288477 796870530 796412468 795922577 795471907 795078099 794709444
2751.4 794709444 794301033 793834031 793404758 793063283 792772472 792478085 792115510 791703999 791326165 790965736
2771.8 790965736 790543973 790031910 789478779 788972378 788479209 787893295 787235498 786581814 785926759 785208225
2792.2 785208225 784411073 783576608 782708883 781791627 780821919 779773891 778678119 777592003 776483178
2810.6G76483178j184702j277625j337648j323819j306832j373052j488209j567125
2826.9G65624166j581371j583696j656890j797676j901924k002240k215504k472043
2843.2G50412822k667904k757251k727569k561807k255321j935899j716673j651228
2859.5G32139170j796365k142012k591133k982735l173650l255546l445685l603935
2875.9G09148109l468633l140449k775729k422929k103865j688898j186192q15153
2892.2F91546261o39140o13511o80506p36177q27551j039565j254975j402975j602888
2910.5F82748973k008080k578914l003955l097773k978146k704561k253294j616597
2926.8F62507653q58068j20700O18935J445115K309978L065943L596127L863752L883660
$$ plain form
2810.6 776483178 775298476 774020851 772683203 771359384 770052552 768679500 767191291 765624166
2826.9 765624166 764042795 762459099 760802209 759004533 757102609 755100369 752884865 750412822
2843.2 750412822 747744918 744987667 742260098 739698291 737442970 735507071 733790398 732139170
2859.5 732139170 730342805 728200793 725609660 722626925 719453275 716197729 712752044 709148109
2875.9 709148109 705679476 702539027 699763298 697340369 695236504 693547606 692361414 691546261
2892.2 691546261 690907121 690293610 689613104 688876927 688049376 687009811 685754836 684351861 682748973
2910.5 682748973 680740893 678161979 675158024 672060251 669082105 666377544 664124250 662507653
2926.8 662507653 661649585 661528885 662147820 663592935 665902913 668968856 672564983 676428735 680312395
2945.2F80312395L796637L739655L674269L524125L413200L512680L711939L728390
2961.5G09413290L522873L321469L236770L183604L057658K840400K653658K616883
2977.8G33846605K519965K193391J876772J705527J584709J483738J290381R34184
2994.2G47435272O80566N74112M01139J70469o7174j99914j55807j58191m18901q14021
3014.5G47447550j061141j111388j152993j248479j347363j414418j367092j284718
3030.9G37459958j336515j548052j711250j609981j497924j663923j902044j916111
3047.2G24274158j782238j787901j911402j944720j955986j985431j933515j846195
3063.5G09126770j785933j876355k103865k162993j963913j681745j597226j845717
$$ plain form
2945.2 680312395 684109032 687848687 691522956 695047081 698460281 701972961 705684900 709413290
2961.5 709413290 712936163 716257632 719494402 722678006 725735664 728576064 731229722 733846605
2977.8 733846605 736366570 738559961 740436733 742142260 743726969 745210707 746501088 747435272
2994.2 747435272 748115838 748689950 749091089 749261558 749194384 748994470 748838663 748680472 748261571 747447550
3014.5 747447550 746386409 745275021 744122028 742873549 741526186 740111768 738744676 737459958
3030.9 737459958 736123443 734575391 732864141 731254160 729756236 728092313 726190269 724274158
3047.2 724274158 722491920 720704019 718792617 716847897 714891911 712906480 710972965 709126770
3063.5 709126770 707340837 705464482 703360617 701197624 699233711 697551966 695954740 694109023
3079.8F94109023k103448k154172k153694k122641k099335k179921k176285k002656
3096.1F77116871j859427j932680k129078k113581j904368j880050k059102k024651
3112.4F61213934j779794j756609j971662k210259k348125k272785k057373j933098
3128.8F44884229k014220k140820k060652j822650j800955k065301k174973k039135
3145.1F28765523j932501j803220j680374j838624k111078k144456k046108j966357
3161.4F13242805j902282j866281j814485j787245j803398j796067j799226j832187
3177.7E98641634j819074j781762j759648j727522j706659j701236j697064j701235
3194E84747434j668096j609981j617670j623869j577139j554549j554548j508356j440405
$$ plain form
3079.8 694109023 692005575 689851403 687697709 685575068 683475733 681295812 679119527 677116871
3096.1 677116871 675257444 673324764 671195686 669082105 667177737 665297687 663238585 661213934
3112.4 661213934 659434140 657677531 655705869 653495610 651147485 648874700 646817327 644884229
3128.8 644884229 642870009 640729189 638668537 636845887 635044932 632979631 630804658 628765523
3145.1 628765523 626833022 625029802 623349428 621510804 619399726 617255270 615209162 613242805
3161.4 613242805 611340523 609474242 607659757 605872512 604069114 602273047 600473821 598641634
3177.7 598641634 596822560 595040798 593281150 591553628 589846969 588145733 586448669 584747434
3194 584747434 583079338 581469357 579851687 578227818 576650679 575096130 573541582 572033226 570592821
3212.4E70592821j450479j457990j418948j437664j474082j475513j423717j291334
3228.7E59163094j137495j128138j346409j500547j400053j271427j198590j089513
3245E49090922j076639j204729j208901j056314r66430j033782j095593j018942r36985
3263.4E39492607q89301p52390o19411p56621j024664j090169j011491r31680q62181
3281.7E31554699q44419q60155q04007o99758o87421q06510r70364j078486j023829
3300.1E23779750p99120o36339p77304j128018j398086j407087j197279j065492j109958
3318.4E14261067j129747j042068r91106j184880j408875j367331j234591j125753
3334.8E04776716j080394j253604j446367j428842j398892j354008j201481j279056
$$ plain form
3212.4 570592821 569142342 567684352 566265404 564827740 563353658 561878145 560454428 559163094
3228.7 559163094 558025599 556897461 555551052 554050505 552650452 551379025 550180435 549090922
3245 549090922 548014283 546809554 545600653 544544339 543577909 542544127 541448534 540429592 539492607
3263.4 539492607 538603306 537850916 537231505 536474884 535450220 534360051 533348560 532416880 531554699
3281.7 531554699 530710280 529850125 529046118 528346360 527658939 526852429 525882065 524803579 523779750
3300.1 523779750 522980630 522344291 521566987 520438969 519040883 517633796 516436517 515371025 514261067
3318.4 514261067 513131320 512089252 511098146 509913266 508504391 507137060 505902469 504776716
3334.8 504776716 503696322 502442718 500996351 499567509 498168617 496814609 495613128 494334072
3351.1D94334072j597703j680910j458258j314342j380652j359671j113236j027644
3367.4D83401656j359343j749158j743377j429110j229078j210302j201540j093865
3383.7D72385883q95470o53207m57853o35922j035780r72420m76360l14057p59810
3402.1D66185004j129449r03875n51909m62800m80235n44011n60433m42803l82751
3420.4D60726738l71754j98007O4016J81794R2923J19061L16053K19643j15752j55836
3440.8D60878879J62154M53383M45932L18200M20212O29157P28190Q20011R05096Q01474
3461.2D66562688P91729J113117J220107Q20160M50193N59152Q73297J107991J111835
3479.6D74610269Q64238Q47816J084775J050621R00358J022071J206755J245201J170784
$$ plain form
3351.1 494334072 492736369 491055459 489597201 488282859 486902207 485542536 484429300 483401656
3367.4 483401656 482042313 480293155 478549778 477120668 475891590 474681288 473479748 472385883
3383.7 472385883 471490413 470837206 470379353 469743431 468707651 467735231 467258871 466944814 466185004
3402.1 466185004 465055555 464151680 463599771 463136971 462656736 462112725 461552292 461109489 460726738
3420.4 460726738 460354984 460156977 460220993 460402787 460495710 460614771 460930824 461150467 461034715 460878879
3440.8 460878879 461041033 461494416 461940348 462258548 462678760 463307917 464036107 464856118 465761214 466562688
3461.2 466562688 467354417 468467534 469687641 470507801 470957994 471517146 472390443 473498434 474610269
3479.6 474610269 475474507 476322323 477407098 478457719 479358077 480380148 481586903 482832104 484002888
3497.9D84002888J155526J204967J063615R09537J009792J193345J355201J358896
3514.2D93253767J211525J177251J348704J597673J491844J160085J120329J267374
3530.6E03628552J445889J648665J575589J361132J624346K043485J947046J444995
3546.9E16719699J283884J563549J718283J724779J864076K108276K291024K284288
3563.2E31557858K250314K401709K354205K144575K223790K508580K729655K909124
3579.5E51079810L119111L279865L256559K997458K828956K952516L205061L352940
3595.8E76072276L383696L324270L203154L230214L374278L487110L487766L527939
3612.1F03090703L602803L524423L429651L307402L061831L078044L314316L473222
$$ plain form
3497.9 484002888 485158414 486363381 487426996 488336533 489346325 490539670 491894871 493253767
3514.2 493253767 494465292 495642543 496991247 498588920 500080764 501240849 502361178 503628552
3530.6 503628552 505074441 506723106 508298695 509659827 511284173 513327658 515274704 516719699
3546.9 516719699 518003583 519567132 521285415 523010194 524874270 526982546 529273570 531557858
3563.2 531557858 533808172 536209881 538564086 540708661 542932451 545441031 548170686 551079810
3579.5 551079810 554198921 557478786 560735345 563732803 566561759 569514275 572719336 576072276
3595.8 576072276 579455972 582780242 585983396 589213610 592587888 596074998 599562764 603090703
3612.1 603090703 606693506 610217929 613647580 616954982 620016813 623094857 626409173 629882395
3628.5F29882395L255844K944410K985895L019512K969622L030062L155589L308535
3644.8F54551864L536164L468574K667784K159238K357304K691925K620697K365470
3661.1F76419020K318859K516150K669275K599597K434135K283334K030313J610458
3677.4F94881141J462698J654685K038836K461612K657593K022326J099109J047731
3693.7G09325731J327216J454413J509190J486540J390099J450479J585842J484274
3710G21013784J095355R22382J021027J114071J112163J037955R59993Q93294R67861
3728.4G30137885J225173J551926J446605P88271N12064P19607P97391P52032R49382
3746.7G38880336R45568N13316K49862M66466N98371M93646M44412O17564Q04484P65979
$$ plain form
3628.5 629882395 633138239 636082649 639068544 642088056 645057678 648087740 651243329 654551864
3644.8 654551864 658088028 661556602 664224386 666383624 668740928 671432853 674053550 676419020
3661.1 676419020 678737879 681254029 683923304 686522901 688957036 691240370 693270683 694881141
3677.4 694881141 696343839 697998524 700037360 702498972 705156565 707178891 708278000 709325731
3693.7 709325731 710652947 712107360 713616550 715103090 716493189 717943668 719529510 721013784
3710 721013784 722109139 723031521 724052548 725166619 726278782 727316737 728276730 729170024 730137885
3728.4 730137885 731363058 732914984 734361589 735149860 735661924 736381531 737178922 737930954 738880336
3746.7 738880336 739825904 740339220 740589082 741055548 741653919 742147565 742591977 743209541 744014025 744780004
3767.1G44780004M98891K74420M03583P72476R52125O51180K93434L46124M99547M98116
3787.5G49969900M70400N41687P23063Q65341Q42094O69360L95060L19719L10660J58667
3807.9G55265951K12789N23865P69556P80820P31171M86671N7996J04785L29435L48389
3828.3G59611428M03702O60539R38356P67886J26720j61290m1187P0750K65062O04272
3848.7G63246238Q07286L37243k45989K2352L29196N68867N89967L46482K89619K42948
3869.1G66534209P4327K1637J05381L37720M72247M09246L26574J46031M7505J40011
3889.5G68614888R0897O4969L24905N81265N64039K88248n7877k25544j38461K5749
3909.9G70133078K04742L35813K93374J67012J09613J32501J54912J06872J31726K11000
$$ plain form
3767.1 744780004 745278895 745553315 745956898 746729374 747681499 748332679 748626113 748972237 749471784 749969900
3787.5 749969900 750440300 750981987 751705050 752570391 753412485 754081845 754476905 754796624 755107284 755265951
3807.9 755265951 755478740 756002605 756772161 757552981 758284152 758770823 758828819 758933604 759263039 759611428
3828.3 759611428 760015130 760675669 761614025 762381911 762508631 762347341 762306154 762376904 762641966 763246238
3848.7 763246238 764053524 764390767 764144778 764167130 764496326 765065193 765655160 766001642 766291261 766534209
3869.1 766534209 766608536 766630173 766735554 767073274 767545521 767954767 768281341 768427372 768474877 768614888
3889.5 768614888 768705785 768770754 769095659 769676924 770240963 770529211 770471334 770245790 770107329 770133078
3909.9 770133078 770337820 770673633 770967007 771134019 771243632 771376133 771531045 771637917 771769643 771980643
3930.3G71980643J52171J7941J4603J49369K09987J41979J63376K23637J21474J4245
3950.7G73189425K0862Q6963J69993J95741J59324R0360O1155Q9526J05917J15693
3971.1G74284959J35898J30356R5665P3672J32799K15947J46807L0398N8472J09613
3991.5G75414586Q4817O5685M6253
3997.6G75611341
$$ plain form
3930.3 771980643 772132814 772150755 772165358 772314727 772524714 772666693 772830069 773053706 773175180 773189425
3950.7 773189425 773210287 773297250 773467243 773662984 773822308 773912668 773973823 774063349 774169266 774284959
3971.1 774284959 774420857 774551213 774646878 774720550 774853349 775069296 775216103 775246501 775304973 775414586
3991.5 775414586 775499403 775565088 775611341
3997.6 775611341
##END=$$ End of the data block
