##TITLE=$$ Begin of the data block
##JCAMP-DX=5.00 $$ ACD/SpecManager v 10.08
##SPECTROMETER/DATA SYSTEM=Alpha
##DATE=22 Dec 2014 10:36:42
##DATA TYPE=INFRARED SPECTRUM
##DATA CLASS=XYDATA
##ORIGIN=
##OWNER=
##NPOINTS=1765
##FIRSTX=399.76428223
##LASTX=3997.64306641
##MAXX=3997.64306641
##MINX=399.76428223
##MAXY=0.86379600
##MINY=0.44265494
##XFACTOR=1.0000000000
##YFACTOR=1.000000000000000e-9
##FIRSTY=0.69862396
##DELTAX=2.03961372
##XUNITS=1/CM
##YUNITS=ARBITRARY UNITS
##XYDATA=(X++(Y..Y))
399.8F98623955m944265j822769p87616j865983j593649R74357L026783K513945r5665
418.1F94029093k455116j267969l86059k062679l358304k288878o13511q41260k400517
436.5F78354800j981318J133084L595173L229618J899899J748144K485395K202570
452.8F92667365M78983p19070n64933l03805j142919k367020k548933j627505j266300
471.2F82605863k340973k959728k039254p58826k93971p24136q38340M3690O94335
489.5F73388660m4763j297653j556396j054526q79645j485646k052784j837969j813113
507.9F61366165k541244l266931l142655k604306k890169l494799l189624k063036
524.2F38173401r11712m15027k88487L45111J792967L143966L515900L464996L532649
$$ y = [698623955, 693679690, 691856921, 691069305, 689203322, 687609673, 688584030, 691610813, 694124758, 694029093, 691573977, 690306008, 689919949, 687857270, 684498966, 682210088, 681596577, 680755317, 678354800, 676373482, 677506566, 681101739, 684331357, 686231256, 687979400, 690464795, 692667365, 693146348, 692427278, 691862345, 691558540, 690415621, 688048601, 685499668, 683872163, 682605863, 680264890, 677305162, 675265908, 674507082, 674213111, 673488975, 672650635, 672694325, 673388660, 673343897, 672046244, 670489848, 669435322, 668555677, 667070031, 665017247, 663179278, 661366165, 658824921, 655557990, 652415335, 649811029, 646920860, 643426061, 640236437, 638173401, 637261689, 636846662, 636558175, 636903286, 638696253, 641840219, 645356119, 648821115, 652353764]
542.5F52353764L054678J657009L7372r54091j061559j096070j965821l178060l635227
560.9F45211995l562510m059673n236864n847633m717588k458513o64294M53770K027631
579.3F21146321M332006O064415N848587M335999L355980L155887K307058N10871o89328
597.6F50367796m38749M27127O12497j43230n51283M26054J722514J761556J001656
616F55185938J296401K904475M044473L553748K346694K091229K793253K967775J748919
634.3F78932905L71158N59748J726508J841545N68390k51174O13153J818239J490772
652.7F87671244K61247N8472J155496J947403J244247q3983m79698J169026K281189
671F95224643J381218M72605P02322J708686J934707R80974J23858L97921J154363
$$ y = [652353764, 655408442, 657065451, 657102823, 656148732, 655087173, 653991103, 652025282, 648847222, 645211995, 641649485, 637589812, 632352948, 626505315, 621787727, 619329214, 618664920, 619118690, 621146321, 625478327, 631542742, 637391329, 641727328, 645083308, 648239195, 650546253, 651057124, 650367796, 649929047, 650356174, 650968671, 650825441, 650274158, 650700212, 652422726, 654184282, 655185938, 656482339, 659386814, 663431287, 666985035, 669331729, 671422958, 674216211, 677183986, 678932905, 679304063, 679863811, 681590319, 683431864, 684000254, 683749080, 684362233, 686180472, 687671244, 687932491, 687990963, 689146459, 691093862, 692338109, 692254126, 691774428, 692943454, 695224643, 696605861, 697078466, 697780788, 699489474, 701424181, 702405155, 702529013, 702926934, 704081297]
689.4G04081297Q88765n53787j654565j526892j076222j505852k458930k401173q07226
707.7F92985415R05753J398027J246094J859367L342271M446209M203200L398120L499151
726.1G17283607M226028M113913K812803J575231J543105K037227J608372J28627j166165
744.5G34162748j354456j174569j892328l178001l746271l190339k392769k230823
760.8G15003192k261817j356483O91891K761901L850817M272044M917562N892277O336152
779.1G40107536N497933M002869L276229L458798L355026K459347J722038K066135
795.4G65945911L102065L502070K774477J908780J810729K187193K074658J200796
811.8G84506679M18126N46575J077592Q00669l38316j153290j147151j118660j865625
$$ y = [704081297, 704970062, 704416275, 702761710, 701234818, 700158596, 698652744, 696193814, 693792641, 692985415, 693891168, 695289195, 696535289, 698394656, 701736927, 706183136, 710386336, 713784456, 717283607, 721509635, 725623548, 728436351, 730011582, 731554687, 733591914, 735200286, 735328913, 734162748, 732808292, 731633723, 729741395, 726563394, 722817123, 719626784, 717234015, 715003192, 712741375, 711384892, 712076783, 714838684, 718689501, 722961545, 727879107, 733771384, 740107536, 745605469, 749608338, 752884567, 756343365, 759698391, 762157738, 763879776, 765945911, 769047976, 772550046, 775324523, 777233303, 779044032, 781231225, 783305883, 784506679, 784924805, 785471380, 786548972, 787349641, 787011325, 785858035, 784710884, 783592224, 781726599]
830.1G81726599l080666l665150l289163k751886k816797l203094l044963k251923
846.4G57622957j712382k065897k809286l033519k673804k235174j417280O14643L633142
864.8G45923400O302953P626176P515549O547928N488038M325807K495766J03533j880050
883.2G84449100k772748l045619l477573m013717m054844l431321k705216k601802
899.5G58346260l110886l546059l674030m051388n067229o238043o825745o785572
915.8G19047308o500185n981326m928708l304839j618266n34415k1398N89609J550078
934.1F98297858K528787L192544L508806L546059K952397J201451j586855m547834
950.5G09093213o912708q577347r841502j1016488j2117922j3032973j3900995j4900506
$$ y = [781726599, 778645933, 774980783, 771691620, 768939734, 766122937, 762919843, 759874880, 757622957, 755910575, 753844678, 751035392, 748001873, 745328069, 743092895, 741675615, 742290258, 745923400, 752226353, 759852529, 767368078, 773916006, 779404044, 783729851, 786225617, 786329150, 784449100, 781676352, 778630733, 775153160, 771139443, 767084599, 763653278, 760948062, 758346260, 755235374, 751689315, 748015285, 743963897, 738896668, 732658625, 725832880, 719047308, 712547123, 706565797, 701637089, 698332250, 696713984, 696179569, 696158171, 696747780, 698297858, 700826645, 704019189, 707527995, 711074054, 714026451, 715227902, 713641047, 709093213, 702180505, 693603158, 683761656, 672745168, 660627246, 647594273, 633693278, 618792772]
966.8F18792772j6002774j7072320j7929375j8477559j8647075j8231749j7036140
981.1D95395780j5073181j2550443r742379o983787m565328k636046j153707l5971
997.4D42654938O98536J026392R46492M89444j67042o93649q99762p51824k28077O12676
1017.8D43688124J558394K393096L038317L559381L998846M222780M086316L548592
1034.1D70093846K700180J848459J312822J035274R14186J113862J766920K822458
1050.4D83608007M111201N422413O656289P882327R066224R913087R730220P507861
1066.7E43897629K546370m220486r677768j0952234q252919m133880o55710J662373
1083E10213375L177703M418790N558729O285846O274641N589545M542529L334105J996219
$$ y = [618792772, 602789998, 585717678, 567788303, 549310744, 530663669, 512431920, 495395780, 480322599, 467772156, 458029777, 451045990, 446480662, 443844616, 442690909, 442654938, 443353474, 444379866, 445326358, 445815802, 445648760, 444955111, 444055349, 443303525, 443075448, 443688124, 445246518, 447639614, 450677931, 454237312, 458236158, 462458938, 466545254, 470093846, 472794026, 474642485, 475955307, 476990581, 477904767, 479018629, 480785549, 483608007, 487719208, 493141621, 499797910, 507680237, 516746461, 526659548, 536389768, 543897629, 546443999, 542223513, 532545745, 521593511, 513340592, 509206712, 508551002, 510213375, 513391078, 517809868, 523368597, 529654443, 535929084, 541518629, 546061158, 549395263, 551391482]
1101.4E51391482Q47400N92649J496195K832055L635884L620326L196061K826750K487540
1119.8E72926342J942873J432419J644671K773702M023016M253924L072440J039565
1136.1E93108952j238346l613770n858839p338762p563829o748796n602240m475594
1152.4E50668776l175378j565158J94967J824021L263533M869461O930471R097874
1168.7E72108567J0675907J1412501J1696637J1912346J1993706J1539221J0460555
1183F51799440R303213Q379340P285416N654573L804565K418518J795947J537919J203597
1201.3F93182528R65059J234412J995206K755821L093362L120958L227473L322541
1217.7G12897360K856374J709461M95136k02536m86911q30531j339436j627326j444280
$$ y = [551391482, 552238882, 552831531, 554327726, 557159781, 560795665, 564415991, 567612052, 570438802, 572926342, 574869215, 576301634, 577946305, 580720007, 584743023, 588996947, 592069387, 593108952, 591870606, 588256836, 582397997, 575059235, 567495406, 560746610, 555144370, 550668776, 547493398, 545928240, 546123207, 547947228, 551210761, 556080222, 563010693, 572108567, 582784474, 594196975, 605893612, 617805958, 629799664, 641338885, 651799440, 661102653, 669481993, 676767409, 682421982, 686226547, 688645065, 690441012, 691978931, 693182528, 694147587, 695381999, 697377205, 700133026, 703226388, 706347346, 709574819, 712897360, 715753734, 717463195, 717958331, 717755795, 717268884, 716438353, 715098917, 713471591, 712027311]
1236G12027311j064837q32140p05063l82007K96832R93311J222730J047432R05156
1254.4G13508725R44734R28581O32941K77639L23534P94112J258314J292229Q73565
1272.7G20834374M02630J59740l9756m11391p75636q52882o71506n30064o39201q86142
1293.1G16590166j050234j057744j005232j040340j132905j111627r46283p51913o65247
1311.5G07828641p39932p94351p26521q29041j337350k104222k834857l321171l569662
1329.8F91571534l606737l283620k490044j503944q48889n41866k11001J64450L66330
1348.2F79616213J90377k36273o13391p62999o19590m74811q10742j204312q95977
1366.6F74188495l08693J52409M12286L35157K33411L90292M22298O12319J720488
$$ y = [712027311, 710962474, 710130334, 709425271, 709043264, 709340096, 710333407, 711556137, 712603569, 713508725, 714453459, 715382040, 716014981, 716292620, 716616154, 717410266, 718668580, 719960809, 720834374, 721237004, 721396744, 721356988, 720945597, 720169961, 719317079, 718645573, 718115509, 717476308, 716590166, 715539932, 714482188, 713476956, 712436616, 711303711, 710192084, 709245801, 708493888, 707828641, 707088709, 706294358, 705567837, 704738796, 703401446, 701297224, 698462367, 695141196, 691571534, 687964797, 684681177, 682191133, 680687189, 679838300, 679296434, 679085433, 679249883, 679616213, 679806590, 679570317, 678956926, 678193927, 677574337, 677099526, 676288784, 675084472, 674188495, 673879802, 674032211, 674444497, 674779654, 675013065, 675403357, 675825655, 676437974, 678158462]
1384.9F78158462L254712L543317K652645J848996R44078J1265o24061j011490j171172
1403.3F87606752j421511j461268j190901j155078j157999o89805j53899k41339l54052
1421.6F79780900q5592K08199P89464J283884J209497J213432J543581J429618J069903
1440F88442886J025498Q91328P07388L30984k78175n82099m20987n77212j480400j015842
1460.4F87043369L60250J629114K606512L673553N434513P306874O831825N516290
1476.7G20402300N169452N066156M757583M398406M619419M679024L523350K416492
1493G55032182K662241L133297K547801J917004K106130L101349L143966R16899L09467
1511.4G74870336Q85546J534879J847089J762032J340628M85837K35737L66747N86629
$$ y = [678158462, 681413174, 684956491, 687609136, 689458132, 690402210, 690413475, 689789414, 688777924, 687606752, 686185241, 684723973, 683533072, 682377994, 681219995, 680530190, 680376291, 680134952, 679780900, 679695308, 679903507, 680692971, 681976855, 683186352, 684399784, 685943365, 687372983, 688442886, 689468384, 690359712, 691067100, 691398084, 691119909, 690537810, 690116823, 689539611, 688059211, 687043369, 687403619, 689032733, 691639245, 695312798, 700747311, 708054185, 714886010, 720402300, 725571752, 730637908, 735395491, 739793897, 744413316, 749092340, 752615690, 755032182, 757694423, 760827720, 763375521, 765292525, 767398655, 770500004, 773643970, 774560869, 774870336, 775755882, 777290761, 779137850, 780899882, 782240510, 782726347, 782962084, 783328831, 783915460]
1529.7G83915460R18090N92173L91125J361609J847625j75834j479089j192451m06921
1548.1G85771787q106j27316O676O56903M60148k180696k264261j265764p45237n49674
1568.5G79754460j159191j265347q40307j427114j910507j532138j464903j531422
1584.8G68623531j447916j438379j657665j915753k138496k163231j989186k009809
1601.1G53863096k293467k426923k350628k528250k744794k509534k529622l247976
1617.4G33231902k716482j935899k412557k735198k481222k239049j332402j72794
1633.7G17206299o2525p35998m10259M00782J278698K140403K098203J770734K665401
1652.1G26351738K680540J253367J778960K917230L436029L038823K937854L846705
$$ y = [783915460, 784833550, 785425723, 785816848, 787178457, 789026082, 788850248, 787371159, 786178708, 785771787, 785763681, 785636365, 785643041, 786299944, 786760092, 784579396, 782315135, 781049371, 780304134, 779754460, 778595269, 777329922, 776489615, 775062501, 773151994, 771619856, 770154953, 768623531, 767175615, 765737236, 764079571, 762163818, 760025322, 757862091, 755872905, 753863096, 751569629, 749142706, 746792078, 744263828, 741519034, 739009500, 736479878, 733231902, 730515420, 728579521, 726166964, 723431766, 720950544, 718711495, 717379093, 717206299, 717143774, 716407776, 715997517, 716398299, 717676997, 719817400, 721915603, 723686337, 726351738, 729032278, 730285645, 732064605, 734981835, 738417864, 741456687, 744394541, 748241246]
1668.4G48241246M039407L024637K988041L211856L147482L556133M165232L876388
1684.7G76250422K336919K157808K533376K567708L031969L129363K491892J788258
1701.1G96287715J066030R64522Q78155P71046J018762J378477J599312J017630k21074
1719.4H04760575l92914K5928M96626J144708J762926J996875J806438J082599J157701
1737.8H13841462J849294J899004J711964J967252K276718J938284J068234Q90672
1754.1H27442884J365304J570642J376808R73761O32584R74357J477898J470446P59483
1772.4H38044167K2530J89662O43671O65843L90887L30508N15342Q97646J077294N29170
1792.8H43306720N5373L31104O01351L96073M7207J37150N10871O52254L68774P4387
$$ y = [748241246, 752280653, 755305290, 758293331, 761505187, 764652669, 768208802, 772374034, 776250422, 778587341, 780745149, 783278525, 785846233, 788878202, 792007565, 794499457, 796287715, 797353745, 798318267, 799196422, 799967468, 800986230, 802364707, 803964019, 804981649, 804760575, 804367661, 804393589, 804890215, 806034923, 807797849, 809794724, 811601162, 812683761, 813841462, 815690756, 817589760, 819301724, 821268976, 823545694, 825483978, 826552212, 827442884, 828808188, 830378830, 831755638, 832729399, 833361983, 834336340, 835814238, 837284684, 838044167, 838066697, 838256359, 838900030, 839565873, 839956760, 840287268, 840802610, 841700256, 842777550, 843306720, 843362093, 843693197, 844294548, 844690621, 844737828, 844874978, 845385849, 846038103, 846406877, 846481264]
1813.2H46481264K10106M10438M06205M28736N44250N50986N07235L32296j09732j36673
1833.6H49625111J72674K61605K84731M97282M53591k4378k19583j26720o020J00315
1854H51018608J60455J52469J01328J14024L08513N54800L71218k18868l50595p0333
1874.4H52141619R3043J23262J45674J92880K30074K89500K90096R8467L2961J02282
1894.8H53739858K2530l3974O3836J33574J01984O2704M9114K3127N8055J78813J66893
1917.3H54566514L3141O3359M7505j32918j45793R060J36137J12057j7941k8611J91927
1939.7H54834437L45350Q6426k10344j88530J0252J60575J29879J2397p987J09136
1960.1H55281591K04385J85251P0631m3869K206J08719L7908r3460k6762J37329J58191
$$ y = [846481264, 846691370, 847101808, 847508013, 847936749, 848480999, 849031985, 849539220, 849871516, 849761784, 849625111, 849797785, 850059390, 850344121, 850841403, 851294994, 851270616, 851051033, 850924313, 850918293, 851018608, 851179063, 851331532, 851432860, 851546884, 851855397, 852410197, 852781415, 852562547, 852211952, 852141619, 852234662, 852357924, 852503598, 852696478, 852926552, 853216052, 853506148, 853604615, 853637576, 853739858, 853762388, 853728414, 853792250, 853925824, 854027808, 854090512, 854139626, 854162753, 854220808, 854399621, 854566514, 854599655, 854663014, 854710519, 854577601, 854431808, 854440868, 854577005, 854689062, 854671121, 854642510, 854834437, 855179787, 855266213, 855055869, 854867339, 854877591, 855038166, 855168045, 855180442, 855172455, 855281591, 855485976, 855671227, 855741858, 855697989, 855700195, 855808914, 855846822, 855753362, 855726600, 855863929, 856022120]
1982.5H56022120Q463j18553o795J89960Q4281j71244j98126n4956N4658p749j76489
2005H55625570k22027q0348K5988o0379k10166k98024l28123l35276m69566n63979
2025.4H53083670k17438J84834J62363r2029k89202k70486r5665l3736j82569l17514
2045.8H51932228k41816k2114P6771o1393k02060j23083P8320J54555L5823q0943l100
2068.2H51543188J52946J41143m5716j44840j6391J37389J20342l219m1545P7963J98543
2090.6H52119803J45734j3590n0485J03652K25067J54019J4841j3232R0659J77860
2111H52954328J02103n9247o0260R9241J67608O6460n3108o0916K4617Q2075M2260
2133.5H53305161l8862m5657P4386J57714N7876o8605k5272J05023J47462Q3983R179
$$ y = [856022120, 856030583, 855912030, 855905235, 856095195, 856179476, 856008232, 855810106, 855755150, 855809808, 855802059, 855625570, 855403543, 855323195, 855349183, 855288804, 855078638, 854780614, 854452491, 854117215, 853647649, 853083670, 852866232, 853051066, 853213429, 853121400, 852832198, 852561712, 852466047, 852432311, 852249742, 851932228, 851690412, 851668298, 851745069, 851683676, 851481616, 851358533, 851436853, 851591408, 851627231, 851546288, 851543188, 851696134, 851837277, 851791561, 851646721, 851630330, 851767719, 851888061, 851884842, 851843297, 851921260, 852119803, 852265537, 852251947, 852201462, 852305114, 852530181, 852684200, 852699041, 852685809, 852776468, 852954328, 853056431, 852997184, 852936924, 853036165, 853203773, 853270233, 853217125, 853156209, 853180826, 853262901, 853305161, 853266299, 853220642, 853295028, 853452742, 853510618, 853442013, 853416741, 853521764, 853669226, 853753209, 853762388]
2155.9H53762388M7684J62482K04802J40607N6267R7215K75374L60965K57969J75476
2176.3H55541229K34604L38018L28779J85132R3937J89901L17573K83718J59860J29282
2196.7H57802033K14100K88725K42532J05142P0512K30551L69847K86341J21891Q8155
2217.1H59819829J93775K93374K23100P7427O0081J56522K33531J73748K7358L2127
2237.5H61290872J86801K30134R8586j9491K4557J62780K01881P0274m3094L5763J69158
2259.9H62408221J62840M5120o020R0421J96218J65045O7354M0292J24157K14636J69456
2282.3H63677740M2200j3411L2723N6744l994o7711p3135j5854L9875l0279k09630
2304.8H63435268k98857k15650r4235o9737j44422k57314k95162k55406k77638l53396
$$ y = [853762388, 853810072, 853972554, 854177356, 854317963, 854374230, 854471445, 854746819, 855107784, 855365753, 855541229, 855775833, 856113851, 856442630, 856627762, 856721699, 856911600, 857229173, 857512891, 857672751, 857802033, 858016133, 858304858, 858547390, 858652532, 858723044, 858953595, 859323442, 859609783, 859731674, 859819829, 860013604, 860306978, 860530078, 860607505, 860667586, 860824108, 861057639, 861231387, 861258745, 861290872, 861477673, 861707807, 861806393, 861786902, 861811459, 861974239, 862176120, 862246394, 862203300, 862239063, 862408221, 862571061, 862616181, 862610161, 862700582, 862896800, 863061845, 863129199, 863169491, 863293648, 863508284, 863677740, 863719940, 863706529, 863739252, 863795996, 863792002, 863724291, 863651156, 863635302, 863675177, 863644898, 863435268, 863136411, 862920761, 862826526, 862756789, 862612367, 862355053, 862059891, 861804485, 861526847, 861173451]
2325.2H61173451l73840k85030j84953k10881l08752l08335j77860r4176k5451K87533
2345.6H59491706M88400J47164m31239q40843q88467o13034k64644o1691J07169L48687
2366H57483208N33700N71251N27442M58657M71771N35667M91202L67761K39968J07705
2386.4H61788332n185q2016j21117j14858p3910o6876j09553j44661j81556j91271
2406.8H60697329j65522j92940k42055k35140j98364j94908k53677l02136k85923k69533
2427.2H58357131k76803k75851k81393l08454l19839l02315k76923k77340l05653l32475
2447.6H55400085l53157l41833k93910k67387k75492k63930k45928k54155k52366k57313
2467.9H52594614k84195k93195k81751k68400k66612k60770k28763k20775k68579k91526
$$ y = [861173451, 860799611, 860514581, 860329628, 860118747, 859809995, 859501660, 859323800, 859229624, 859204173, 859491706, 859980106, 860127270, 859696031, 858855188, 857966721, 857353687, 857089043, 857027352, 857134521, 857483208, 858016908, 858588159, 859115601, 859574258, 860046029, 860581696, 861072898, 861440659, 861680627, 861788332, 861783147, 861701131, 861580014, 861465156, 861391246, 861324370, 861214817, 861070156, 860888600, 860697329, 860531807, 860338867, 860096812, 859861672, 859663308, 859468400, 859214723, 858912587, 858626664, 858357131, 858080328, 857804477, 857523084, 857214630, 856894791, 856592476, 856315553, 856038213, 855732560, 855400085, 855046928, 854705095, 854411185, 854143798, 853868306, 853604376, 853358448, 853104293, 852851927, 852594614, 852310419, 852017224, 851735473, 851467073, 851200461, 850939691, 850710928, 850490153, 850221574, 849930048]
2488.3H49930048k46644j75595j46032j87933k13444j69635j23859j42812k07007k30491
2508.7H48086596j75536j21892j44779k14994k64287k48432k24174k51770k86698k84374
2529.1H45869660k54094k67387l39329l71039l24607k73883l04401l82543m13417l81053
2549.5H42557907l29018l23176l57211l48210k88367k51830k98619l81231l99590l32475
2569.9H39248180k72750l04521l63111l69012l16680k51234k56121l19123l20971k41995
2590.3H36232662j88350k18630k72274k56181j91629j85430k90573l90827l38972k55883
2610.7H33643913l08573m30703m95851m85182m37975m16338n06461o26445o18577n46098
2631.1H28771710n73158o76811o89625o13213n88477o45816p10666p18594o65962n97239
$$ y = [849930048, 849683404, 849507809, 849361777, 849173844, 848960400, 848790765, 848666906, 848524094, 848317087, 848086596, 847911060, 847789168, 847644389, 847429395, 847165108, 846916676, 846692502, 846440732, 846154034, 845869660, 845615566, 845348179, 845008850, 844637811, 844313204, 844039321, 843734920, 843352377, 842938960, 842557907, 842228889, 841905713, 841548502, 841200292, 840911925, 840660095, 840361476, 839980245, 839580655, 839248180, 838975430, 838670909, 838307798, 837938786, 837622106, 837370872, 837114751, 836795628, 836474657, 836232662, 836044312, 835825682, 835553408, 835297227, 835105598, 834920168, 834629595, 834238768, 833899796, 833643913, 833335340, 832904637, 832408786, 831923604, 831485629, 831069291, 830562830, 829936385, 829317808, 828771710, 828198552, 827521741, 826832116, 826218903, 825630426, 824984610, 824273944, 823555350, 822889388, 822292149]
2651.5H22292149n82457o46114o76453o08444n54383n95629o57857o43670n69701n03779
2671.9H16253662n07355n41746n20468m82142m72307n05746n65767n60462n02706m81307
2692.3H11113656n34833o23166o19829n33462n40137o46234o98030o47544n98789o27517
2712.7H05044115o66142o32346n35190m73678n12600n90205o04391n35846m65452m74155
2733.1G99554110m94779m41014m00544m11927m48406m98474m81128l94106l46244m03881
2753.5G95233607m52935l99709l41892l19302l12567l62039m16279l85999l53575l92974
2773.9G91496336m55141n19335n31673n09143n72741o41108o38067o77526p58708q06808
2794.3G85386086q27969q52525q97348r54628j038134j104772j101613j117945j208424
$$ y = [822292149, 821709692, 821063578, 820387125, 819778681, 819224298, 818628669, 817970812, 817327142, 816757441, 816253662, 815746307, 815204561, 814684093, 814201951, 813729644, 813223898, 812658131, 812097669, 811594963, 811113656, 810578823, 809955657, 809335828, 808802366, 808262229, 807615995, 806917965, 806270421, 805671632, 805044115, 804377973, 803745627, 803210437, 802736759, 802224159, 801633954, 801029563, 800493717, 800028265, 799554110, 799059331, 798618317, 798217773, 797805846, 797357440, 796858966, 796377838, 795983732, 795637488, 795233607, 794780672, 794380963, 794039071, 793719769, 793407202, 793045163, 792628884, 792242885, 791889310, 791496336, 791041195, 790521860, 789990187, 789481044, 788908303, 788267195, 787629128, 786951602, 786192894, 785386086, 784558117, 783705592, 782808244, 781853616, 780815482, 779710710, 778609097, 777491152, 776282728]
2812.6G76282728j292825j323521j311302j302183j368821j489937j572430j592815
2828.9G65028894j593947j652599j778662j879275j996279k225816k477348k672076
2845.3G48752892k796531k775609k572417k266527j959562j716495j647651j802742
2861.6G31215358k134025k587974k996624l185451l255367l437221l609538l500998
2877.9G06508160l192664k826809k434135k055943j640797j193583q72194o97911o11603
2896.3F90982521o60539p59244q39174r90927j217783j436650j665533k058923k599538
2914.6F78754210l004014l088951k940238k653479k231717j622498q61049j33574N95748
2933F62814438J445413K309501L062964L634214L912270L886283L783106L752709L668904
$$ y = [776282728, 774989903, 773666382, 772355080, 771052897, 769684076, 768194139, 766621709, 765028894, 763434947, 761782348, 760003686, 758124411, 756128132, 753902316, 751424968, 748752892, 745956361, 743180752, 740608335, 738341808, 736382246, 734665751, 733018100, 731215358, 729081333, 726493359, 723496735, 720311284, 717055917, 713618696, 710009158, 706508160, 703315496, 700488687, 698054552, 695998609, 694357812, 693164229, 692292035, 691594124, 690982521, 690321982, 689562738, 688723564, 687732637, 686514854, 685078204, 683412671, 681353748, 678754210, 675750196, 672661245, 669721007, 667067528, 664835811, 663213313, 662352264, 662218690, 662814438, 664259851, 666569352, 669632316, 673266530, 677178800, 681065083, 684848189, 688600898, 692269802]
2951.3F92269802L500640L430248L531515L697694L742873L576339L362298L253817
2967.6G20365226L177166L070653K897680K687692K625883K566695K233028J836837
2984G41460860J640975J579225J531244J334250R31501O56247N89490M47333K16663
3002.3G50387788j4007j62244j62602j94013m22895p60257j007736j106500j162112
3020.7G45395422j225472j318991j418233j385092j294732j349807j552880j702726
3037G34147489j621365j511574j640201j895308j963497j805245j765371j888215j918018
3055.3G18138695j928151j998842j965820j845837j768410j844645k059281k153754
3071.7G02573955k010822j745641j650632j868427k070665k095282k124488k122880
$$ y = [692269802, 695770442, 699200690, 702732205, 706429899, 710172772, 713749111, 717111409, 720365226, 723542392, 726613045, 729510725, 732198417, 734824300, 737390995, 739624023, 741460860, 743101835, 744681060, 746212304, 747546554, 748478055, 749134302, 749723792, 750171125, 750387788, 750373781, 750211537, 750048935, 749854922, 749432027, 748671770, 747664034, 746557534, 745395422, 744169950, 742850959, 741432726, 740047634, 738752902, 737403095, 735850215, 734147489, 732526124, 731014550, 729374349, 727479041, 725515544, 723710299, 721944928, 720056713, 718138695, 716210544, 714211702, 712245882, 710400045, 708631635, 706786990, 704727709, 702573955, 700563133, 698817492, 697166860, 695298433, 693227768, 691132486, 689007998, 686885118]
3088F86885118k072393k130807k166271k053320j905263j925170k139092k170145j938701
3106.3F68383956j865208k047718k046823j812101j762449j938761k191603k359867
3122.6F52359426k284527k085566j976967k026320k115130k052605j840532j782000
3139F36195779k042413k227962k101362j937747j809120j721799j887560k149999k155423
3157.3F18162394k008200j932681j899242j859069j847804j860678j827121j785934
3173.6F03141665j785993j794517j806080j800359j763820j739026j735746j741887
3189.9E88974237j733720j704216j679182j640260j601577j605391j619339j579881
3206.3E75810671j533508j534462j510799j458705j438021j442314j463234j488447
$$ y = [686885118, 684812725, 682681918, 680515647, 678462327, 676557064, 674631894, 672492802, 670322657, 668383956, 666518748, 664471030, 662424207, 660612106, 658849657, 656910896, 654719293, 652359426, 650074899, 647989333, 646012366, 643986046, 641870916, 639818311, 637977779, 636195779, 634153366, 631925404, 629824042, 627886295, 626077175, 624355376, 622467816, 620317817, 618162394, 616154194, 614221513, 612322271, 610463202, 608615398, 606754720, 604927599, 603141665, 601355672, 599561155, 597755075, 595954716, 594190896, 592451870, 590716124, 588974237, 587240517, 585536301, 583857119, 582216859, 580615282, 579009891, 577390552, 575810671, 574277163, 572742701, 571231902, 569773197, 568335176, 566892862, 565429628, 563941181]
3222.6E63941181j470983j381517j262307j157641j161456j400888j581610j427054
3238.9E53097725j252234j182795j068532j091123j264453j263201j083493r66489
3255.2E43925405j028061j098991j023710r35673q75712p39217o19947p67887j016378
3273.6E35819829j057983j017392r86456r17554q64566q67963q28564o96599o60181
3291.9E27922571p80642r38773j094521j090943q45433o39319p44343j088321j371205
3310.3E19329071j390815j229346j146137j181066j157880j055598j023949j199960
3326.6E09944320j379907j351417j282453j176357j061619j186847j411021j487970
3342.9D99606729j503289j394004j152098j239538j601219j678378j483470j353979
$$ y = [563941181, 562470198, 561088681, 559826374, 558668733, 557507277, 556106389, 554524779, 553097725, 551845491, 550662696, 549594164, 548503041, 547238588, 545975387, 544891894, 543925405, 542897344, 541798353, 540774643, 539838970, 538963258, 538224041, 537604094, 536836207, 535819829, 534761846, 533744454, 532757998, 531840444, 530975878, 530107915, 529279351, 528582752, 527922571, 527141929, 526203156, 525108635, 524017692, 523172259, 522532940, 521788597, 520700276, 519329071, 517938256, 516708910, 515562773, 514381707, 513223827, 512168229, 511144280, 509944320, 508564413, 507212996, 505930543, 504754186, 503692567, 502505720, 501094699, 499606729, 498103440, 496709436, 495557338, 494317800, 492716581, 491038203, 489554733, 488200754]
3359.2D88200754j391679j357019j123369j052916j355380j744926j762092j415372
3375.5D76998001j192718j179547j202821j148194r73344p25031m62174n57036r54657
3393.9D68602479r29386m70966l32624p78436j136005r09478n52296m53443m99338
3412.3D62540507n87940o03378m57138l52710l37929j97500K5094J56373J38908J84268
3432.7D60508555L41803K08288j49995j69128J70857M63337M90129L76701M20421N52476
3453.1D63213444O31928P85738R18925Q03471Q05050J157552J281530Q47429L85642
3471.4D70830709M83066Q86917J166999J146764Q63701Q27163J092464J083672Q94904
3489.8D79276359R54181J153857J287728J240999J194089J242250J078576Q80093R82046
$$ y = [488200754, 486809075, 485452056, 484328687, 483275771, 481920391, 480175465, 478413373, 476998001, 475805283, 474625736, 473422915, 472274721, 471301377, 470576346, 470114172, 469557136, 468602479, 467673093, 467202127, 466869503, 466091067, 464955062, 464045584, 463493288, 463039845, 462540507, 461952567, 461349189, 460892051, 460539341, 460201412, 460003912, 460029006, 460185379, 460324287, 460508555, 460850358, 461058646, 460908651, 460739523, 460910380, 461373717, 461863846, 462240547, 462660968, 463213444, 463845372, 464631110, 465550035, 466353506, 467158556, 468316108, 469597638, 470445067, 470830709, 471313775, 472200692, 473367691, 474514455, 475378156, 476205319, 477297783, 478381455, 479276359, 480230540, 481384397, 482672125, 483913124, 485107213, 486349463, 487428039, 488308132, 489290178]
3508.1D89290178J195520J363486J340419J166731J188308J436562J647055J488328
3524.4E00116587J199305J175225J268386J436949J673937J627624J421332J627505
3540.8E11546850J990199J937270J477778J297832J554131J710892J792550J994550
3557.1E25302052K153337K217055K247274K310216K426982K351046K210080K288759
3573.4E43506801K535820K759218K954007L146886L283084L262698L001035K864480
3589.7E67314029K977311L139079L314257L498017L488541L322244L297686L348410
3606E93699574L426850L488660L537655L606141L556966L486574L349483L069461L082156
3624.4F24303520L333449L512085L316998K959967K915621K930700K956629L077686
$$ y = [489290178, 490485698, 491849184, 493189603, 494356334, 495544642, 496981204, 498628259, 500116587, 501315892, 502491117, 503759503, 505196452, 506870389, 508498013, 509919345, 511546850, 513537049, 515474319, 516952097, 518249929, 519804060, 521514952, 523307502, 525302052, 527455389, 529672444, 531919718, 534229934, 536656916, 539007962, 541218042, 543506801, 546042621, 548801839, 551755846, 554902732, 558185816, 561448514, 564449549, 567314029, 570291340, 573430419, 576744676, 580242693, 583731234, 587053478, 590351164, 593699574, 597126424, 600615084, 604152739, 607758880, 611315846, 614802420, 618151903, 621221364, 624303520, 627636969, 631149054, 634466052, 637426019, 640341640, 643272340, 646228969, 649306655]
3640.7F49306655L173113L311872L589273L571152K712608K068698K254963K719760
3657F72708094K714694K378523K284348K504706K649844K552688K409518K270877K009154
3675.4F94482446J649737J537621J722574K096713K473950K584160J916647J084447
3691.7G09548295J091420J372576J487732J497388J417994J353920J512527J662731
3708G20944583J477182J019419Q67307J029432J146972J133024J092494R95040Q36968
3726.4G30542421R33409J277208J622618J466453P81417M83214O54281P31349P26103
3744.7G39218473R66967R58323M61578J63973M85718P14541O01351M82142N80191P35224
3765.1G45368481P47800N59508L55065L98219O84380R03666O91057L91304M23372M59611
$$ y = [649306655, 652479768, 655791640, 659380913, 662952065, 665664673, 667733371, 669988334, 672708094, 675422788, 677801311, 680085659, 682590365, 685240209, 687792897, 690202415, 692473292, 694482446, 696132183, 697669804, 699392378, 701489091, 703963041, 706547201, 708463848, 709548295, 710639715, 712012291, 713500023, 714997411, 716415405, 717769325, 719281852, 720944583, 722421765, 723441184, 724308491, 725337923, 726484895, 727617919, 728710413, 729705453, 730542421, 731475830, 732753038, 734375656, 735842109, 736623526, 737106740, 737761021, 738492370, 739218473, 740185440, 741143763, 741605341, 741769314, 742255032, 742969573, 743570924, 744053066, 744633257, 745368481, 746116281, 746675789, 747030854, 747429073, 748113453, 749017119, 749708176, 750099480, 750522852, 750982463]
3785.5G50982463M01199M22418N52953P65085Q96096Q27015O17027L77178L58939L16858
3805.9G56517231J02699J64330N42641Q43465Q49307P75158N02527K4974M5360K74598
3826.3G60642290L54946M38392O51300R00388P17818J41681r7692m113J25646L03031
3846.7G64173687N78463P28547K50578k54393P7785L72231N35845N02765K68102K32518
3867.1G67466128K68817J76012P8440J18852L26991M49061M28140L66629J58965N5552
3887.5G69893587J81794J26123M0293K89261N77391N95152L28660q7381l11434j62661
3907.9G71470785O9618K35141L36408L07381J71841R0360J33515J55866J10328J39654
3928.3G73220897J74045J12593M8697O5804J53899K20359J59382J11759J82033J53482
$$ y = [750982463, 751383662, 751806080, 752359033, 753124118, 754020214, 754847229, 755464256, 755841434, 756200373, 756517231, 756619930, 756784260, 757326901, 758170366, 759019673, 759794831, 760297358, 760322332, 760367692, 760642290, 760997236, 761435628, 762086928, 762987316, 763705134, 763846815, 763749123, 763745010, 763870656, 764173687, 764752150, 765480697, 765731275, 765476882, 765554667, 765926898, 766462743, 766965508, 767233610, 767466128, 767734945, 767910957, 767989397, 768108249, 768435240, 768884301, 769312441, 769679070, 769838035, 769893587, 770075381, 770201504, 770241797, 770531058, 771108449, 771703601, 772032261, 771944880, 771633446, 771470785, 771540403, 771775544, 772111952, 772419333, 772591174, 772681534, 772815049, 772970915, 773081243, 773220897, 773394942, 773507535, 773556232, 773622036, 773775935, 773996294, 774155676, 774267435, 774449468, 774602950]
3948.7G74602950N8353P1942O8307K0266J03474K23457J66059M6968O6042J60516J87695
3971.1G75776029J26183N0664N7041J06037J67668J88172O9558m112Q8691J37747R2089
3993.5G76855767J05798J52409
3997.6G77113974
$$ y = [774602950, 774661303, 774733245, 774801552, 774821818, 774925292, 775148749, 775314808, 775361776, 775427818, 775588334, 775776029, 775902212, 775952876, 776009917, 776115954, 776283622, 776471794, 776541352, 776537240, 776625931, 776763678, 776855767, 776961565, 777113974]
##END=$$ End of the data block
