##TITLE=5 $$ Begin of the data block
##JCAMP-DX=5.00 $$ ACD/SpecManager v 10.08
##SPECTROMETER/DATA SYSTEM=Alpha
##DATE=19 Mar 2014 09:16:06
##DATA TYPE=INFRARED SPECTRUM
##DATA CLASS=XYDATA
##ORIGIN=
##OWNER=
##NPOINTS=1765
##FIRSTX=399.75695801
##LASTX=3997.56933594
##MAXX=3997.56933594
##MINX=399.75695801
##MAXY=0.87941527
##MINY=0.51470983
##XFACTOR=1.0000000000
##YFACTOR=1.000000000000000e-9
##FIRSTY=0.78901178
##DELTAX=2.03957629
##XUNITS=1/CM
##YUNITS=ARBITRARY UNITS
##XYDATA=(X++(Y..Y))
399.8G89011776O59287r11951o62446n15043j256347p86901O9261n46396j533031q99673
$$ 789011776 789671063 788759112 788096666 787581623 786325276 785538375 785607636 785061240 783528209 782628536
420.2G82628536r4414o12199p98225m4286J90019l70681k32995n1141p42554p92325
$$ 782628536 782534122 781921923 781123698 781079412 781269431 780898750 780665755 780614614 779872060 779079735
440.5G79079735J16051K02953o95884o64115j8954j82629n10871j66357j42574q05378
$$ 779079735 779195786 779398739 778702855 778038740 778019786 777837157 777326286 777159929 777017355 776211977
460.9G76211977p11977l7790j31190o10947l21865P7128l97861o59764n3167P2360
$$ 776211977 775500000 775462210 775331020 774720073 774398208 774475336 774077475 773417711 773364544 773436904
481.3G73436904o07491p52508k09153K6167j37389j7822Q2731l66747n36203j09792
$$ 773436904 772829413 772076905 771867752 771893919 771756530 771738708 771821439 771454692 770918489 770808697
501.7G70808697l35396j079261r16123m50909q09074j162708p34031m79162q75473
$$ 770808697 770473301 769394040 768477917 768027008 767217934 766055226 765321195 764842033 763966560
520.1G63966560p38501O2406K18689k39074M5717M77731r0420k61605P58410R93669
$$ 763966560 763228059 763290465 763509154 763270080 763315797 763793528 763703108 763441503 764199913 765193582
540.5G65193582Q0823k0980M93705p0870p79450j19865M08113l90828o63936K59817
$$ 765193582 765274405 765253425 765747130 765676260 764896810 764776945 765185058 764794230 764130294 764390111
560.9G64390111L26455m37558r6023N78046l2425m84884K80023L88979m35233j22189
$$ 764390111 764716566 764279008 764182985 764761031 764728606 764243722 764523745 764912724 764477491 764355302
581.3G64355302Q17418M03047l16859K99454Q72135J59085m8935Q76545Q65043K4378
$$ 764355302 765172720 765575767 765258908 765558362 766430497 766589582 766540647 767417192 768282235 768306613
601.7G68306613L35693R70126K27510n30898j5438Q7381p84993l26932J309454J584232
$$ 768306613 768642306 769612432 769839942 769309044 769293606 769380987 768595994 768269062 769578516 771162748
622.1G71162748J129389J722932K182722J243293P19190J639187J913786R64284J003623
$$ 771162748 772292137 774015069 776197791 777441084 778160274 779799461 781713247 782677531 783681154
640.4G83681154J853764J509726Q32498J391054J877188J082361P17282J444579J363933
$$ 783681154 785534918 787044644 787877142 789268196 791145384 792227745 792945027 794389606 795753539
658.8G95753539M32610N19931M36426j279056m77195K822935K475977R12547P79927
$$ 795753539 796186149 796706080 797142506 795863450 795386255 798209190 800685167 801597714 802377641
677.1H02377641J573503J334667N92769R31024J373232O70790J41621O97434P70092
$$ 802377641 803951144 805285811 805878580 806809604 808182836 808853626 808995247 809692681 810462773
695.5H10462773j26720j71423O53804N82456J17958P05898J268744P41661N92053J294672
$$ 810462773 810336053 810164630 810818434 811400890 811518848 812224746 813493490 814235151 814827204 816121876
715.9H16121876J194239M43160P53344J542091J250148P67290J368285J818597J118839
$$ 816121876 817316115 817759275 818512619 820054710 821304858 822072148 823440433 825259030 826377869
734.2H26377869O91533J181543J116514L54945M71771J025915N33998q7678L35574
$$ 826377869 827069402 828250945 829367459 829722404 830194175 831220090 831754088 831666410 832001984
752.6H32001984N98669j23799l83675K52426J90318m90785l15428J20819m74453j098454
$$ 832001984 832600653 832476854 832093179 832345605 832535923 832045138 831729710 831850529 831376076 830277622
773H30277622n23269O3717l7730O00219K022028K487063K012730K040863K198637J397073
$$ 830277622 829754353 829818070 829780340 830380559 832402587 834889650 836902380 838943243 841141880 842538953
793.4H42538953O63519R43601R43720K29717J22249M35412j46330r76443p60794l50296
$$ 842538953 843202472 844146073 845089793 845319510 845441759 845877171 845730841 844754398 843993604 843643308
813.8H43643308o33955m46916P08520J323760R97961J005530J290202Q07703K81095
$$ 843643308 843009353 842562437 843270957 844594717 845592678 846598208 847888410 848696113 848977208
832.1H48977208P62999J153171O19293K91347N85794M51506j61350k76327q7023l62754
$$ 848977208 849740207 850893378 851512671 851804018 852389812 852841318 852679968 852403641 852316618 851953864
852.5H51953864o25729k92361m7982l40044m13061k0981K9207l15070l14474N3584
$$ 851953864 851328135 851035774 850987792 850647748 850234687 850213706 850242913 849927843 849613369 849666953
872.9H49666953K18749K08914L76702L53753j86443p01129p54595p32124r33051r00507
$$ 849666953 849885702 850094616 850471318 850825071 850638628 849937499 849182904 848450780 847517729 846617222
893.3H46617222m35472o0677O4373K71022M68612K64942j69277l22103l23415n63443
$$ 846617222 846181750 846121073 846185446 846456468 846925080 847190022 847020745 846698642 846375227 845811784
913.7H45811784p39395n02825k29359k04742p7963K59281L01003j2636j10030n4241
$$ 845811784 845072389 844569564 844340205 844135463 844057500 844316781 844617784 844605148 844495118 844440877
934.1H44440877l84569q01205p10547n73278r33170j176953r54450r88841j465201
$$ 844440877 844056308 843255103 842544556 841971278 841038108 839861155 838906705 837917864 836452663
952.5H36452663j687467j661062j982212k324820k055585j683534j828372k033949
$$ 836452663 834765196 833104134 831121922 828797102 826741517 825057983 823229611 821195662
968.8H21195662k090037k640128l489792l652454l349066l535270l884316l582596
$$ 821195662 819105625 816465497 812975705 809323251 805974185 802438915 798554599 794972003
985.1G94972003l168405l283023l208757k712786k824068l566086l927887m031539
$$ 794972003 791803598 788520575 785311818 782599032 779774964 776208878 772280991 768249452
1001.4G68249452m564464n034089m777491m445076m587233m489362l952384l789425
$$ 768249452 763684988 758650899 753873408 749428332 744841099 740351737 736399353 732609928
1017.7G32609928l994227l813505l359556l163934k877474k080142j300097r98914
$$ 732609928 728615701 724802196 721442640 718278706 715401232 713321090 712020993 711022079
1034.1G11022079p48158l70621m52459j080334j514435j552463j695275j781404j279235
$$ 711022079 710273921 709903300 709450841 708370507 706856072 705303609 703608334 701826930 700547695
1052.4G00547695n24580n9247L88384J079380J456440J221835Q89421M71830m17948
$$ 700547695 700023115 699963868 700352252 701431632 702888072 704109907 704999328 705471158 705053210
1070.8G05053210j195132j005352j14858Q18729J870632L061951L676593L373504K779841
$$ 705053210 703858078 702852726 702737868 703556597 705427229 708489180 712165773 715539277 718319118
1089.1G18319118K189517J224339K17557l636L52264O03735J063764K080262K871215
$$ 718319118 720508635 721732974 721950531 721946895 722299159 722902894 723966658 726046920 728918135
1107.5G28918135K941609L016531L380895L355562K962053K870322K870678K398491
$$ 728918135 731859744 734876275 738257170 741612732 744574785 747445107 750315785 752714276
1123.8G52714276J882196J900017J979649J530349J022637P94232K44379n28097o61612
$$ 752714276 754596472 756496489 758476138 760006487 761029124 761823356 762067735 761539638 760878026
1142.2G60878026l55422l39985k00391N38171J129090J211226J584232K373934K740443
$$ 760878026 760522604 760182619 759982228 760520399 761649489 762860715 764444947 766818881 769559324
1160.5G69559324K757787L228546L808617L678382L334760L386677L187418K462864
$$ 769559324 772317111 775545657 779354274 783032656 786367416 789754093 792941511 795404375
1176.8G95404375K053141K084673J739680J133562J034319J060963N61535J14083K16604
$$ 795404375 797457516 799542189 801281869 802415431 803449750 804510713 805072248 805186331 805402935
1195.2H05402935J98125k03788k22683J55449J12414j92701p3553M4287m25339q52108
$$ 805402935 805601060 805397272 805174589 805330038 805442452 805249751 805176198 805220485 804795146 803943038
1215.6H03943038p41601p84159j215815j260579r29713r71854j189947r15647m90903
$$ 803943038 803201437 802417278 801201463 799940884 799011171 798039317 796849370 795933723 795442820
1233.9G95442820n05507n15342r5964J53423j1325Q6367M66645M62889K45452L71814
$$ 795442820 794937313 794421971 794326007 794479430 794468105 794554472 795021117 795484006 795729458 796101272
1254.3G96101272N46754M10974M00185P50542R30488P70211Q27015J107633R98735
$$ 796101272 796648026 797059000 797459185 798209727 799140215 799910426 800737441 801845074 802843809
1272.7H02843809O82712P38740Q59797O65545N83351Q51273R16720N49674L16977L63410
$$ 802843809 803526521 804265261 805125058 805790603 806373954 807225227 808141947 808691621 809008598 809372008
1293.1H09372008J77204k07662k93493k55227m95554o86645n41508m95553p51734p93278
$$ 809372008 809549212 809341550 809048057 808792830 808297276 807610631 807069123 806573570 805821836 805028558
1313.5H05028558m65989k91467k93374n0366J91987N9306j19448o0617p1824k57671
$$ 805028558 804562569 804271102 803977728 803927362 804119349 804178655 804059207 803998590 803926766 803669095
1333.9H03669095k49505l8624n722p7426Q6426K32876K5630k44677k75493l10123n13196
$$ 803669095 803419590 803380966 803375244 803297818 803384244 803617120 803642750 803398073 803122580 802812457 802299261
1356.3H02299261o27756o49631q54611j104296j063287q96811q61824r01580q96335
$$ 802299261 801671505 801021874 800167263 799062967 797999680 797102869 796241045 795339465 794443130
1374.7G94443130r76443j395047k194702k383232p57694J500010J859426O14524m12464
$$ 794443130 793466687 792071640 789876938 787493706 786736012 788236022 790095448 790709972 790297508
1393G90297508r62019j013100q07166o19590l98100j13964j5199j23858r5666J18613
$$ 790297508 789335489 788322389 787515223 786895633 786497533 786383569 786368370 786244512 786148846 786267459
1413.4G86267459K59161L99173Q04722R67205Q58903Q23915Q60631R43422P77841N21719
$$ 786267459 786526620 786925793 787730515 788697720 789556623 790380538 791241169 792184591 792962432 793484151
1433.8G93484151O95885Q76367N64933M71472N84364N56886M73738M48227L35932J90258
$$ 793484151 794180036 795056403 795621336 796092808 796677172 797234058 797707796 798156023 798491955 798682213
1454.2G98682213O86884J773536J670480J264333J690448K505243K936124L555954
$$ 798682213 799369097 801142633 802813113 804077446 805767894 808273137 811209261 814765215
1470.5H14765215M761219M723012L311336K306045J934587J609386R74118N60045M77732
$$ 814765215 819526434 824249446 827560782 829866827 831801414 833410800 834384918 834944963 835422695
1488.9H35422695J44660l89695n64337n04553o73890q98481q75890q33213r55999r41277
$$ 835422695 835567355 835177660 834613323 834108770 833434880 832536399 831660509 830827296 829871297 828930020
1509.3H28930020q07225p80344o35624j35184K90156L55243K33233J98901R6142k37643
$$ 828930020 828122795 827342451 826706827 826571643 826861799 827217042 827450275 827649176 827745318 827507675
1529.7H27507675l05176k5869r8407m32253k20537K77102J38700l7134J21892K50936
$$ 827507675 827202499 827176630 827078223 826645970 826425433 826702535 826841235 826804101 826925993 827176929
1550.1H27176929J04308J7285O020p9870j58787l23057o15776j004934j419008j622140
$$ 827176929 827281237 827298522 827304542 827224672 827065885 826742828 826127052 825122118 823703110 822080970
1570.5H22080970j683533k138794k731502k625942k703369l204524l398061l497720
$$ 822080970 820397437 818258643 815527141 812901199 810197830 806993306 803595245 800097525
1586.8H00097525l835142m163146m187583m193247m346967m374444m278183m337668
$$ 800097525 796262383 792099237 787911654 783718407 779371440 774996996 770718813 766381145
1603.1G66381145m424096m323065m251540m268527m168033m138232l927886k856672
$$ 766381145 761957049 757633984 753382444 749113917 744945884 740807652 736879766 734023094
1619.4G34023094k135575j890778j504660j032173m38393O9321M77373J376510K122700
$$ 734023094 731887519 729996741 728492081 727459908 727021515 727090836 727568209 728944719 731067419
1637.8G31067419K193034K334535K587080L563046M141748K892256L285110N430520
$$ 731067419 733260453 735594988 738182068 741745114 745886862 748779118 752064228 757494748
1654.1G57494748M026949K913475L530920M472553M503906L643036L846824M473388
$$ 757494748 761521697 764435172 767966092 772438645 776942551 780585587 784432411 788905799
1670.4G88905799L740669L570914L895879L107846K334058K477526L447533K890706
$$ 788905799 792646468 796217382 800113261 803221107 805555165 808032691 811480224 814370930
1686.7H14370930J875520J818418J571596J356781J226008R81927P93993P7724m83393
$$ 814370930 816246450 818064868 819636464 820993245 822219253 823201180 823995173 824072897 823589504
1705.1H23589504n82576p18355p31409l89516l5107J98483K98679J87397o3240k96772
$$ 823589504 823006928 822288573 821557164 821167648 821132541 821331024 821629703 821817100 821753860 821457088
1725.5H21457088k77340j76788l08692j44005L01421K57492M07993J040757J778841
$$ 821457088 821179748 821002960 820694268 820550263 820851684 821109176 821517169 822557926 824336767
1743.8H24336767K382457L002406M081606M776836M171729L854871M008770L679275
$$ 824336767 826719224 829721630 833803236 838580072 842751801 846606672 850615442 854294717
1760.1H54294717L291786K707362K254427J958072J493215J510084J549065R88543
$$ 854294717 857586503 860293865 862548292 864506364 865999579 867509663 869058728 870047271
1776.5H70047271O30975P36356P44700M77314L75331M86970M32789L13759L86059M27127
$$ 870047271 870678246 871414602 872159302 872636616 873011947 873498917 873931706 874245465 874631524 875058651
1796.9H75058651K81215K35080L95239M06086K19405J65105L46780L16620Q9585J23799
$$ 875058651 875339866 875574946 875970185 876376271 876595676 876760781 877107561 877424181 877513766 877637565
1817.2H77637565K99931J79469m947J24276J97887L7194M7385K19882J79291j20Q762
$$ 877637565 877937496 878116965 878112018 878236294 878434181 878471375 878518760 878738642 878917933 878917813 878926575
1839.7H78926575J04964K5809l9578R3699J54257R060m8578J00970Q8096q6248m7803
$$ 878926575 879031539 879057348 879017770 879111469 879265726 879274786 879226208 879327178 879415274 879329026 879281223
1862.1H79281223R0599j4663j24812M3452J09494q4877j55151L4988P9453j03415j12533
$$ 879281223 879371822 879357159 879232347 879275799 879385293 879300416 879145265 879180253 879259706 879156291 879043758
1884.6H79043758K3663m9353j62780k1219J05023m3690j70112k5570L5047j18732j15573
$$ 879043758 879067421 879018068 878855288 878834069 878939092 878895402 878725290 878699720 878734767 878616035 878500462
1907H78500462L8445q047j64747j34468k2471r6441j81794k2292N4181j04666j47462
$$ 878500462 878538907 878530860 878366113 878231645 878209174 878112733 877930939 877908647 877962828 877858162 877710700
1929.4H77710700l7312r0123k35676j42098k325j13189k07543n7221O795j55270j88887
$$ 877710700 877673388 877583265 877347589 877205491 877203166 877089977 876882434 876825213 876832008 876676738 876487851
1951.9H76487851n2512j00433k35796j19925K0802r7155j98961p7605j3292j21593
$$ 876487851 876435339 876334906 876099110 875979185 875999987 875902832 875703871 875626266 875612974 875491381
1972.3H75491381j48952n7400q4400j82628r6739J9610r0837k08438q3983m291j63853
$$ 875491381 875342429 875285029 875200629 875018001 874921262 874940872 874850035 874641597 874557614 874553323 874389470
1994.7H74389470k15054o7890n2034j73927j39594l4928j18852k30789j44780o0618
$$ 874389470 874174416 874106526 874054492 873880565 873740971 873706043 873587191 873356402 873211622 873151004
2015.1H73151004j27077j38819m9174p6651j80066j11163N842n0009j35600q0526m2558
$$ 873151004 873023927 872885108 872835934 872759283 872579217 872468054 872473896 872423887 872288287 872207761 872165203
2037.5H72165203j36554j25706L0398M8220q0168q2612K4199J2279p0155l3557M5121
$$ 872165203 872028649 871902943 871933341 871981561 871901393 871818781 871842980 871855259 871785104 871751547 871796668
2060H71796668N9l1411M0292L7492n2154m9890L9459N2333o140K504P5042P7546J9133
$$ 871796668 871796727 871765316 871805608 871843100 871790946 871741056 871780515 871832848 871826708 871829212 871904254 871981800 872000933
2086.5H72000933M5538Q2194L4690M6015J08302P8141N782K7061P7366K7121j9968
$$ 872000933 872046471 872128665 872163355 872209370 872317672 872395813 872401595 872428656 872506022 872533143 872513175
2108.9H72513175M1604Q8334M1247K2888P7367R5069L4332J4127P2360P4505R120R775
$$ 872513175 872554779 872643113 872684360 872707248 872784615 872879684 872914016 872928143 873000503 873075008 873084128 873093903
2133.4H73093903R2864J08421M6194M3869Q1360N4121J5259O0737J10328O8069K4139
$$ 873093903 873186767 873295188 873341382 873385251 873466611 873520732 873535991 873596728 873707056 873775125 873799264
2155.8H73799264O0857P3254K4676L0041P0810M8518K2054P1228J15514N8293P510
$$ 873799264 873860121 873933375 873958051 873988092 874058902 874107420 874129474 874200702 874316216 874374509 874382019
2178.2H74382019J00434J63078N2095j0133O5267P4029J2100O9558J61827P0572m0472
$$ 874382019 874482453 874645531 874697626 874687493 874752760 874826789 874838889 874908447 875070274 875140846 875100374
2200.7H75100374L8564J01150J0848j9253Q8871J06036j072j2696L7193q643n6922
$$ 875100374 875138938 875240088 875250936 875231683 875320554 875426590 875425518 875412822 875450015 875441372 875384450
2223.1H75384450K9027R3401j9431q0049L3974N3704o3598l8564P4446n96j22249m7863
$$ 875384450 875413477 875506878 875487447 875407398 875441372 875495076 875431478 875392914 875467360 875466764 875344515 875296652
2247.6H75296652K0802r4473j20342M5419N4717j09434q2612O6876j192j33753l7133
$$ 875296652 875317454 875222981 875102639 875148058 875202775 875093341 875010729 875077605 875076413 874942660 874905527
2270H74905527O5863j4663k7657O0201N722j06275o9976l8981j96397l05534j72913
$$ 874905527 874971390 874956727 874929070 874989271 874994993 874888718 874818742 874779761 874583364 874277830 874104917
2292.5H74104917j26779l20375l82781k49743l15369n90205o74426o00875o73413o99163
$$ 874104917 873978138 873657763 873274982 873025239 872709870 872119665 871445239 870844364 870170951 869471788
2312.9H69471788n28812o42121j078427j147270p82847o44505q56996q56936m67956
$$ 869471788 868942976 868300855 867222428 866075158 865292311 864647806 863790810 862933874 862465918
2331.2H62465918k83122m89652n49436l83913k01822L93331J560748J633167m6372
$$ 862465918 862182796 861693144 861143708 860759795 860557973 860951304 862512052 864145219 864098847
2349.6H64098847j830340k479612k190113j547635o16133J72317O93083J243174J671493
$$ 864098847 862268507 859788895 857598782 856051147 855435014 855607331 856300414 857543588 859215081
2367.9H59215081J724541J670718J811266J892030J654923J356662J145839Q18968
$$ 859215081 860939622 862610340 864421606 866313636 867968559 869325221 870471060 871290028
2384.2H71290028L54230N6267L2842J2935j18018j47223p5638j22845k05398j25706
$$ 871290028 871644258 871700525 871733367 871746302 871628284 871481061 871405423 871282578 871077180 870951474
2404.6H70951474k7359j38342k41518j24932o5863j78456k03729j09970j17660k09093
$$ 870951474 870924115 870785773 870544255 870419323 870353460 870175004 869971275 869861305 869743645 869534552
2425H69534552j68681o8486j09374j68741j11163q3446j66893j89603j06632j37985
$$ 869534552 869365871 869297385 869188011 869019270 868908107 868824661 868657768 868468165 868361533 868223548
2445.4H68223548k37525j34885J133j14918k47717j75536j27911k23518k27272r1374
$$ 868223548 867986023 867851138 867852271 867737353 867489636 867314100 867186189 866962671 866735399 866644025
2465.8H66644025p6234j85490j82033j18136j66476j87516r5248r6143k12550k25663
$$ 866644025 866567791 866382301 866200268 866082132 865915656 865728140 865632892 865536749 865324199 865098536
2486.2H65098536j23799j02997j64151j39952o6220q8096j55032j71005j66595j81377
$$ 865098536 864974737 864871740 864707589 864567637 864501417 864413321 864258289 864087284 863920689 863739312
2506.6H63739312j50264o5386p3314j56223j43707q3029j30654j97828j28209l8445
$$ 863739312 863589048 863523662 863450348 863294125 863150418 863067389 862936735 862738907 862610698 862572253
2527H62572253r8646j82748j34110j07825j83344j64688m9471n6684j34111j09613
$$ 862572253 862473607 862290859 862156749 862048924 861865580 861700892 861651421 861594737 861460626 861351013
2547.4H61351013o4671j13427j79291j40012p6770j26779j87338j34289q3208j23382
$$ 861351013 861286342 861172915 860993624 860853612 860776842 860650063 860462725 860328436 860245228 860121846
2567.8H60121846j37687r9957j33693k20239k08318j35303j46687j78575j14143q2553
$$ 860121846 859984159 859884202 859750509 859530270 859321952 859186649 859039962 858861387 858747244 858664691
2588.2H58664691j79410k11536j32084j46449k35379j94072j06812j98781k90513j59145
$$ 858664691 858485281 858273745 858141661 857995212 857759833 857565761 857458949 857260168 856969655 856810510
2608.6H56810510p0035j91331k31624j00255r2566k40624k36392j15990j57536k57134
$$ 856810510 856740475 856549144 856317520 856217265 856124699 855884075 855647683 855531693 855374157 855117023
2629H55117023j90496r8289j50024j71364j09493j65821k58684j67966n2571j55330
$$ 855117023 854926527 854828238 854678214 854506850 854397357 854231536 853972852 853804886 853752315 853596985
2649.4H53596985k71201j77383r8646k00212k42054j01149n3943j90615k19286q3387
$$ 853596985 853325784 853148401 853049755 852849543 852607489 852506340 852452397 852261782 852042496 851959109
2669.8H51959109q4281k15888j57118l4868j56820k88308j93178j30058k05636j67370
$$ 851959109 851874828 851658940 851501822 851466954 851310134 851021826 850828648 850698590 850492954 850325584
2690.2H50325584n6624j47641k52366j26123q0764k71142l04759r0062n6744k66075
$$ 850325584 850268960 850121319 849868953 849742830 849662066 849390924 849086165 848996103 848939359 848673284
2710.6H48673284k99632j59085k07305l04044j60574n1082j82867k77340k04563j82033
$$ 848673284 848373652 848214567 848007262 847703218 847542644 847491562 847308695 847031355 846826792 846644759
2731H46644759k43485j66774l1650j22070k57850j41322k4677j31666k05696j43289
$$ 846644759 846401274 846234500 846202850 846080780 845822930 845681608 845656931 845525265 845319569 845176280
2751.4H45176280j61648k74062k57671j51038k13981l26574k25663j32740k72751l02195
$$ 845176280 845014632 844740570 844482899 844331861 844117880 843791306 843565643 843432903 843160152 842857957
2771.8H42857957j15156j80066m31418m18008k79367l23832l72052k39491k31445m55380
$$ 842857957 842742801 842562735 842131317 841713309 841433942 841110110 840738058 840498567 840267122 839811742
2792.2H39811742n05745l31760l69727n99444n81026m19915m77195n81681n38111n57542
$$ 839811742 839305997 838974237 838604510 838005066 837424040 837004125 836526930 835945249 835407138 834849596
2812.5H34849596p04527p36832o44446o97255q79586r33528q97526r93670j156032
$$ 834849596 834145069 833408237 832763791 832066536 831186950 830253422 829355896 828362226 827206194
2830.9H27206194j210808j288057j554548k010286k655030l477037m318296m869879
$$ 827206194 825995386 824707329 823152781 821142495 818487465 815010428 810692132 805822253
2847.2H05822253m872739m162550k718568q65102P81238J712680J935423J702666J102209
$$ 805822253 800949514 796786964 794068396 793203294 793984532 795697212 797632635 799335301 800437510
2865.6H00437510L14593j90019k26319k25783l83675m20272m30107o47128q86023r92059
$$ 800437510 800752103 800562084 800335765 800109982 799726307 799306035 798875928 798228800 797342777 796350718
2886G96350718j112760j295805j350998j318813j441598j628101j678764j727879j942873
$$ 796350718 795237958 793942153 792591155 791272342 789830744 788202643 786523879 784796000 782853127
2904.3G82853127k261460k597332l040731l693998m374623m739225m642368m066467
$$ 782853127 780591667 777994335 774953604 771259606 766884983 762145758 757503390 753436923
2920.6G53436923l010690j702249l82841Q55088J867593K629995L243387L700197L933727
$$ 753436923 750426233 748723984 748341143 749196231 751063824 753693819 756937206 760637403 764571130
2939G64571130L936231L687621L123819K325595J562178J021862O85275N69105P58409
$$ 764571130 768507361 772194982 775318801 777644396 779206574 780228436 780913711 781482816 782241225
2957.4G82241225J212418J721084K093554K346575K511263K562761K537013K398014
$$ 782241225 783453643 785174727 787268281 789614856 792126119 794688880 797225893 799623907
2973.7G99623907K113223J834869J560628J181961Q80897P60972O91652O36876M64797
$$ 799623907 801737130 803571999 805132627 806314588 807195485 807956457 808648109 809284985 809749782
2992H09749782R2447k19882m42445p14302r28044j021147r18806n52177j07408J49072
$$ 809749782 809842229 809622347 809179902 808465600 807537556 806516409 805597603 805045426 804938018 805087090
3012.4H05087090K01642K28882K56121K06828J07169o4492k74479l25024k72394l04043
$$ 805087090 805288732 805517614 805773735 805980563 806087732 806023240 805748761 805423737 805151343 804847300
3032.8H04847300m55916n95450n14686m02630n24759p47621q38697p47919o62744o87838
$$ 804847300 804391384 803795934 803281248 802878618 802353859 801606238 800767541 800019622 799356878 798669040
3053.2G98669040p18236p68602q23199p51794n99503m86493n73278q19504q82030o94215
$$ 798669040 797950804 797182202 796359003 795607209 795007706 794521213 793947935 793128431 792246401 791552186
3073.6G91552186m66704m04239o11067q41617q86083q99136r07660r17315j051068
$$ 791552186 791085482 790681243 790070176 789228559 788342476 787443340 786535680 785618365 784567297
3092G84567297j098931q95799p17520q14498j025438j051068q90136q26419r83536
$$ 784567297 783468366 782572567 781855047 781040549 780015111 778964043 778073907 777247488 776263952
3110.3G76263952j023590q24988p81775j001239j302659j521885j470149j254320j142919
$$ 776263952 775240362 774415374 773633599 772632360 771329701 769807816 768337667 767083347 765940428
3128.7G65940428j215160j339376j319528j190722j198291j431108j597941j531482
$$ 765940428 764725268 763385892 762066364 760875642 759677351 758246243 756648302 755116820
3145G55116820j440048j332998j229048j428842j788736j845062j670241j608551j680851
$$ 755116820 753676772 752343774 751114726 749685884 747897148 746052086 744381845 742773294 741092443
3163.4G41092443j722097j699686j692951j731991j765669j755416j789689j880646
$$ 741092443 739370346 737670660 735977709 734245718 732480049 730724633 728934944 727054298
3179.7G27054298j896262j865685j865208j848817j871825j969099k019584j989126
$$ 727054298 725158036 723292351 721427143 719578326 717706501 715737402 713717818 711728692
3196G11728692j968622j982927k006770k027034k010167k002358k009511j972318j966000
$$ 711728692 709760070 707777143 705770373 703743339 701733172 699730814 697721303 695748985 693782985
3214.3F93782985k012670k024114k039254k107203k143562k106010k037466j945019
$$ 693782985 691770315 689746201 687706947 685599744 683456182 681350172 679312706 677367687
3230.7F77367687j913309k089023k284468k249062k101183j992047j941919j981437
$$ 677367687 675454378 673365355 671080887 668831825 666730642 664738595 662796676 660815239
3247F60815239k094090k095938j924515j814663j888096j950205j922845j896799j815617
$$ 660815239 658721149 656625211 654700696 652886033 650997937 649047732 647124887 645228088 643412471
3265.3F43412471j632571j505137j627028j825809j876116j878560j834869j748145
$$ 643412471 641779900 640274763 638647735 636821926 634945810 633067250 631232381 629484236
3281.6F29484236j729905j720012j654148j554310j529932j668632j879156k041578
$$ 629484236 627754331 626034319 624380171 622825861 621295929 619627297 617748141 615706563
3298F15706563k008736j725853j492500j661420k047837k276897k300859k204000k156497
$$ 615706563 613697827 611971974 610479474 608818054 606770217 604493320 602192461 599988461 597831964
3316.3E97831964k168297k123535k036929k003968k188563k436817k430737k268314
$$ 597831964 595663667 593540132 591503203 589499235 587310672 584873855 582443118 580174804
3332.6E80174804k148807k099812k196014k376199k443016k449929k367914k148747
$$ 580174804 578025997 575926185 573730171 571353972 568910956 566461027 564093113 561944366
3348.9E61944366k223611k583802k651572k426148k270102k304912k328157k106786
$$ 561944366 559720755 557136953 554485381 552059233 549789131 547484219 545156062 543049276
3365.3E43049276j919866k136647k527774k518236k093673j797497j719177j664281
$$ 543049276 541129410 538992763 536464989 533946753 531853080 530055583 528336406 526672125
3381.6E26672125j570761j363099r99212o21915o57141j047314j081943n98967k67387
$$ 526672125 525101364 523738265 522739053 522117138 521459997 520412683 519330740 518731773 518464386
3399.9E18464386n63561r68159q11994m02331k00749j80184k70725k86519p0334J65105
$$ 518464386 517900825 516932666 516120672 515718341 515517592 515337408 515066683 514780164 514709830 514874935
3420.3E14874935K80738M06504O08146P93993Q40605Q79526J001417R68039P95901
$$ 514874935 515155673 515562177 516170323 516964316 517804921 518684447 519685864 520653903 521449804
3438.7E21449804Q66533J225471J578868J720726J620114J587808J790404J992464
$$ 521449804 522316337 523541808 525120676 526841402 528461516 530049324 531839728 533832192
3455E33832192K121211K215683K170145K181113K458871K653479K388418J985729K034545
$$ 533832192 535953403 538169086 540339231 542520344 544979215 547632694 550021112 552006841 554041386
3473.4E54041386K378463K629221K633214K409696K328039K503931K585232K531887
$$ 554041386 556419849 559049070 561682284 564091980 566420019 568923950 571509182 574041069
3489.7E74041069K566278K693295K800882K726555K647280K741278K705156K539576
$$ 574041069 576607347 579300642 582101524 584828079 587475359 590216637 592921793 595461369
3506E95461369K610087K839863L022552K996564K804041K810120L018558L229857L135502
$$ 595461369 598071456 600911319 603933871 606930435 609734476 612544596 615563154 618793011 621928513
3524.4F21928513K837777K836049K977788L062189L273249L354311L084242L012121
$$ 621928513 624766290 627602339 630580127 633642316 636915565 640269876 643354118 646366239
3540.7F46366239L278374L425360L185809K880990K968550L179073L139675L124475
$$ 646366239 649644613 653069973 656255782 659136772 662105322 665284395 668424070 671548545
3557F71548545L296018L298998L016949L109216L832162L947735L378629L246308L506600
$$ 671548545 674844563 678143561 681160510 684269726 688101888 692049623 695428252 698674560 702181160
3575.3G02181160L684700L802359L858686L703415L695488M033565L976763L547311
$$ 702181160 705865860 709668219 713526905 717230320 720925808 724959373 728936136 732483447
3591.7G32483447L658712L993153L948569L836453L821493L638088L458143L703415
$$ 732483447 736142159 740135312 744083881 747920334 751741827 755379915 758838058 762541473
3608G62541473L906369L727377L438532L105521L352523L783524L195167K365887K218067
$$ 762541473 766447842 770175219 773613751 776719272 780071795 783855319 787050486 789416373 791634440
3626.3G91634440L132284L696799K847553K433777K427399K384007K337932K008140
$$ 791634440 794766724 798463523 801311076 803744853 806172252 808556259 810894191 812902331
3642.6H12902331J508355J521111K473772K757608J552582J170576J809180J770734
$$ 812902331 814410686 815931797 818405569 821163177 822715759 823886335 825695515 827466249
3659H27466249J172960Q78573P09116N42760P72655Q98182M74632O96957J087904Q37803
$$ 827466249 828639209 829517782 830226898 830769658 831542313 832440495 832915127 833612084 834699988 835537791
3679.4H35537791O96600O16252N73158R06945J135230P68661N41210M98712L55781
$$ 835537791 836234391 836850643 837423801 838330746 839465976 840234637 840775847 841274559 841630340
3697.7H41630340L38614N92231N52059J44422j9491K53260P56323O69718J42515q7619
$$ 841630340 841968954 842561185 843113244 843257666 843238175 843491435 844247758 844917476 845059991 844972372
3718.1H44972372m8518J5020O9380J49489M0411j24633O5744N30839P98047M00900
$$ 844972372 844923854 844938874 845008254 845157743 845198154 845073521 845139265 845670104 846468151 846869051
3738.5H46869051l79025n07355K81572L59833j22308K56598O03199K45392n245J04964
$$ 846869051 846490026 845982671 846264243 846624076 846501768 846758366 847361565 847606957 847601712 847706676
3758.9H47706676J53064j6749k4259M6671J46448K56598J17898o1929k2650J46032
$$ 847706676 847859740 847842991 847818732 847865403 848011851 848268449 848386347 848324418 848301768 848447800
3779.3H48447800P3731o3658N2988N4360n6505p5698j46747j41621j77204k05755J52707
$$ 848447800 848521531 848457873 848510861 848565221 848508716 848433018 848286271 848144650 847967446 847761691 847914398
3801.7H47914398J59442M590K39610J16945k63334k91645p570o4850o1154L07441J56700
$$ 847914398 848073840 848078430 848318040 848434985 848171651 847880006 847872436 847807586 847746432 848053873 848210573
3824.2H48210573o7949j00970j75059j73748j25885n662J30415R9957J23739J80542
$$ 848210573 848142624 848041654 847866595 847692847 847566962 847561300 847691715 847791672 847915411 848095953
3844.6H48095953j04606o05941q06570l3080R28283L71217k26795k94686j64211m827
$$ 848095953 847991347 847385406 846578836 846545756 847474039 847845256 847618461 847323775 847159564 847154737
3865H47154737q3268m4048K09153J97291m589k72751k05875Q7142O7353O6400r1076
$$ 847154737 847071469 847027421 847236574 847433865 847429276 847156525 846950650 847037792 847105145 847171545 847080469
3887.4H47080469k82228J9133J65403j23441k49505j39713P093J69038J53005p8737
$$ 847080469 846798241 846817374 846982777 846859336 846609831 846470118 846477211 846646249 846799254 846720517
3907.8H46720517j63198r1731r0897q9527K4259O0320l8325l7671j609j16527j55091
$$ 846720517 846557319 846465588 846374691 846285164 846309423 846369743 846331418 846293747 846292138 846175611 846020520
3930.2H46020520N5313J64151m709j08063j6868O3240J3590j1384M5240J013j00970
$$ 846020520 846075833 846239984 846235275 846127212 846110344 846173584 846187174 846175790 846221030 846222043 846121073
3952.7H46121073p0513R537K206j1206j5617n1259n2214l8505j5080M590l1293m4226
$$ 846121073 846050560 846060097 846062303 846051097 846035480 845984221 845932007 845893502 845878422 845883012 845851719 845807493
3977.1H45807493L934P5101R8348k4259j48296q2493L2127M1842L0518N6684
$$ 845807493 845811427 845886528 845984876 845960617 845812321 845729828 845761955 845803797 845834315 845890999
3997.5H45890999
$$ 845890999
##END=$$ End of the data block
