##TITLE=$$ Begin of the data block
##JCAMP-DX=5.00 $$ ACD/SpecManager v 10.08
##SPECTROMETER/DATA SYSTEM=Alpha
##DATE=22 Dec 2014 10:36:42
##DATA TYPE=INFRARED SPECTRUM
##DATA CLASS=XYDATA
##ORIGIN=
##OWNER=
##NPOINTS=1765
##FIRSTX=399.76428223
##LASTX=3997.64306641
##MAXX=3997.64306641
##MINX=399.76428223
##MAXY=0.85606360
##MINY=0.44868663
##XFACTOR=1.0000000000
##YFACTOR=1.000000000000000e-9
##FIRSTY=0.67883962
##DELTAX=2.03961372
##XUNITS=1/CM
##YUNITS=ARBITRARY UNITS
##XYDATA=(X++(Y..Y))
399.8F78839624k553582k122045j728356o30796P42317J586735J114666j02162o52611
418.1F74493790l29614k39730r57072j959383k140165j634240j511573j773656j355708
436.5F62592649L03746J770138J965285K118110L146470L495574K172887O44923Q5532
454.8F78295314J36435l28838j393319j726508j270950j415670k590835l275811k196730
473.2F64233088q48352j134217j836062j276731K43544Q00848k70903r94682k22683
491.5F58693850N36084m38690j950800j985312j036405j118005k562225l118634j866877
509.9F45152986j356721k870321m331350l763259k061129j761853k609968k117336
526.2F24281049J59085J661956J181960P59363K552867M975975M923403K652526J254439
$$ plain form
399.8 678839624 676286042 674163997 672435641 671804845 672547162 674133897 675248563 675146401 674493790
418.1 674493790 674164176 673924446 672967374 671007991 668867826 667233586 665722013 663948357 662592649
436.5 662592649 662896395 664666533 666631818 668749928 671896398 675391972 677564859 678209782 678295314
454.8 678295314 678431749 678102911 676709592 674983084 673712134 672296464 669705629 666429818 664233088
473.2 664233088 663384736 662250519 660414457 659137726 659381270 660182118 659911215 658916533 658693850
491.5 658693850 659229934 658791244 656840444 654855132 653818727 652700722 650138497 647019863 645152986
509.9 645152986 643796265 640925944 636594594 632831335 630770206 629008353 626398385 624281049
526.2 624281049 624440134 626102090 627284050 628043413 630596280 635572255 640495658 643148184 644402623
544.6F44402623J736999J455486q08835k554954k078235j155317k140879m222155m852712
562.9F29782021l989339m081786n446791n311787k516866N24342J632452J945019L617704
581.3F16154969O083667O620646M674255K889514K801478K628923R77993p16210o39259
599.6F41475976N87403P37489l52145o79433O37710J965463J746774R65953J672625
618F48757815L466905L964483K881825K180100K834320L343165K385139R52065P69913
636.4F71535730J605273J713514O87540R3042Q54254J635552J129925J74761L44634
654.7F79774225J363992J568139O85513J04964L84211J036227J525760R78052Q00670
673.1F88221753J424253J781523J268327O51777P87675J233161R58442J51933k21670
$$ plain form
544.6 644402623 646139622 647595108 646786273 644231319 642153084 640997767 638856888 634634733 629782021
562.9 629782021 625792682 621710896 616264105 610952318 608435452 608959794 610592246 612537265 616154969
581.3 616154969 622238636 628859282 633533537 636423051 639224529 641853452 642831445 642115235 641475976
599.6 641475976 642063379 642800868 642448723 641769290 642407000 644372463 646119237 647085190 648757815
618 648757815 652224720 656189203 659071028 661251128 664085448 667428613 669813752 670765817 671535730
636.4 671535730 673141003 674854517 675542057 675635099 676489353 678124905 679254830 679429591 679774225
654.7 679774225 681138217 682706356 683391869 683496833 683881044 684917271 686443031 687421083 688221753
673.1 688221753 689646006 691427529 692695856 693347633 694135308 695368469 696326911 696478844 696257174
691.4F96257174j84357m82261j441300k490938k598524j849771j242101q54313j37329
709.8F84976280J067102K306223K956330L125787L543019M289985M641533M296422
726.1G11202681L649175L287733L227413K841651J892030R61125O63638N79417k05874
744.5G28098989j695514k804339k925635k893269l459096m011154l584742k305150
760.8G04420090j225412o53088L61919K325297M319310N215525N276382N616248O162286
779.1G31818557N849600M487872L213703L079653L460229K980947J920700J859307
795.4G58670568L062726L820836L007531J810909J786053K438307K084791P46489J25468
813.8G77553678P41124J107335J08778j241386j405060r15348j557649l301620m285753
$$ plain form
691.4 696257174 696072817 695590556 694149256 691658318 689059794 687210023 685967922 685113609 684976280
709.8 684976280 686043382 688349605 691305935 694431722 697974741 702264726 706906259 711202681
726.1 711202681 714851856 718139589 721367002 724208653 726100683 727061808 727725446 728304863 728098989
744.5 728098989 726403475 723599136 720673501 717780232 714321136 710309982 706725240 704420090
760.8 704420090 703194678 702541590 702903509 705228806 709548116 714763641 720040023 725656271 731818557
779.1 731818557 737668157 742156029 745369732 748449385 751909614 754890561 756811261 758670568
795.4 758670568 761733294 765554130 768561661 770372570 772158623 774596930 776681721 777428210 777553678
813.8 777553678 778294802 779402137 779510915 778269529 776864469 775949121 774391472 771089852 766804099
832.2G66804099l724813l004671l478407m265786l712058k287209j800239k579748
848.5G41951168l087342k422393j849711k516329l148854j659214J817882M903078
864.8G33988285O100833O555915P510484P782220N876124K872527R03964K1458j346052
883.2G70265758l546476n050063m781723l897489l978550m559696m274547l217637
899.5G36959577k880454l925622n083203n262196n232573o115079p441044p720291
915.8F93299115o594062n210519m295051l303766j720786j22309N69880N93781J101256
934.1F74317539K361119L363549L318727K549172J561343p5519k974391o475031r092510
952.5F68853998j0292768j1028469j2197435j3414979j3988137j4146090j4592111
$$ plain form
832.2 766804099 763079286 760074615 756596208 752330422 748618364 746331155 744530916 741951168
848.5 741951168 738863826 736441433 734591722 732075393 728926539 727267325 729085207 733988285
864.8 733988285 740089118 746645033 754155517 761937737 767813861 770686388 771590352 771611810 770265758
883.2 770265758 766719282 761669219 756887496 752990007 749011457 744451761 740177214 736959577
899.5 736959577 734079123 730153501 725070298 719808102 714575529 708460450 701019406 693299115
915.8 693299115 686705053 681494534 677199483 673895717 672174931 672052622 672622502 673216283 674317539
934.1 674317539 676678658 680042207 683360934 685910106 687471449 687395930 684421539 677946508 668853998
952.5 668853998 658561230 647532761 635335326 621920347 607932210 593786120 579194009
966.8E79194009j5462160j6133964j6031384j5415967j4775276j3870329j2103885
981.1D75401044r556234p008433m990697l339231j671762j48057P35431R95100J144141
999.4D51561302J398802J391291P95335n4479n27113m96179k62082K1428N18858J325280
1019.8D55672443K173126K715021K934188L129244L459394L553211L029406K189189
1036.1D78855222J550764J209230R59247P98494R54836J561344K473026L421992M394710
1054.5D96178865N492688O637931P664680Q441329Q605599P171095L037929l084719
1070.8E40145397q097827r283066p019281l714562j052737Q09729K311826L508031
1087.1E17607510M261911M698992M931092M828453M153967K900898J551211Q23498
$$ plain form
966.8 579194009 563731849 547597885 531566501 516150534 501375258 487504929 475401044
981.1 475401044 465844810 458836377 453845680 450506449 448834687 448686630 449422061 450417161 451561302
999.4 451561302 452960104 454351395 455146730 455092251 454565138 454068959 453806877 453828305 454347163 455672443
1019.8 455672443 457845569 460560590 463494778 466624022 470083416 473636627 476666033 478855222
1036.1 478855222 480405986 481615216 482574463 483372957 484327793 485889137 488362163 491784155 496178865
1054.5 496178865 501671553 508309484 515974164 524415493 533021092 540192187 543230116 540145397
1070.8 540145397 532047570 522764504 515745223 512030661 510977924 511787653 514099479 517607510
1087.1 517607510 521869421 526568413 531499505 536327958 540481925 543382823 544934034 545757532
1103.4E45757532R38833J511037K198220K928674L455937L466606K972901K236426
1119.8E65466166J692950J607597J885355K453208L257990L730118L109395J271665
1136.1E84474444j202464l543436n314589o362498o642341o236971n339324m178643
1152.4E45654178k955616j741707n08845P38502K004802L357589M869878O429851P805944
1170.7E65654576Q900225R732664J0247409J0419369J0317087R970963R426832Q632183
1187.1F43301308P440090N961895M557312L377318K369344J643062J370967J495778
1203.4F71517074J787424K119482K569377L168762L659129L735304L377199K813459
1219.7F94747210K182543J381755M20451l85106p79867q72552r50575j101315j060188
$$ plain form
1103.4 545757532 546696365 548207402 550405622 553334296 556790233 560256839 563229740 565466166
1119.8 565466166 567159116 568766713 570652068 573105276 576363266 580093384 583202779 584474444
1136.1 584474444 583271980 579728544 574413955 568051457 561409116 555172145 549832821 545654178
1152.4 545654178 542698562 540956855 540448010 541186512 543191314 546548903 551418781 557848632 565654576
1170.7 565654576 574554801 584287465 594534874 604954243 615271330 625242293 634669125 643301308
1187.1 643301308 650741398 656703293 661260605 664637923 667007267 668650329 670021296 671517074
1203.4 671517074 673304498 675423980 677993357 681162119 684821248 688556552 691933751 694747210
1219.7 694747210 696929753 698311508 698731959 698346853 697566986 696694434 695743859 694642544 693582356
1238.1F93582356o86467k56657N0962M12523R48608J438856J565993J343906J100719
1256.4F99500799J041889J026810Q55207P20978R83894J451492J545727J157522P08580
1274.8G08992898M47155J88231k43247o34014o75202m78565m95851q79109j214743
1293.1G05007553j182437j071393j225233j455248j377880j078308r81510j139700
1309.4F95495844j180589r07779o50525p97987j183212j438618j700520k346158l288746
1327.8F82001710l906906l739476l102779k570212k122045j268029j71006L76165K84493
1346.2F65781915k8491j70708j53183l14296o78062r88841j111150j017809q09491
1364.5F60509884p77602o75082k66194J7941J37150K89082L92199L58045M34637J163364
$$ plain form
1238.1 693582356 692895889 692639232 692690194 693102717 694051325 695490181 697056174 698400080 699500799
1256.4 699500799 700542688 701569498 702424705 703145683 704129577 705581069 707126796 708284318 708992898
1274.8 708992898 709440053 709628284 709385037 708751023 708075821 707597256 707101405 706222296 705007553
1293.1 705007553 703825116 702753723 701528490 700073242 698695362 697617054 696635544 695495844
1309.4 695495844 694315255 693407476 692756951 691958964 690775752 689337134 687636614 685290456 682001710
1327.8 682001710 678094804 674355328 671252549 668682337 666560292 665292263 665121257 665497422 665781915
1346.2 665781915 665753424 665582716 665429533 665115237 664437175 663448334 662337184 661319375 660509884
1364.5 660509884 659732282 659057200 658791006 658808947 658946097 659235179 659627378 659985423 660420060 661583424
1384.9F61583424K543211L285646K528608J291394L44217p2956k29240m66048r19283
1403.3F69888973j216173j054168r74655j134038j193940j107753r56893m65929P9095
1421.6F61864519K71440N11706P20858P90298Q47519P89821J012861J618803J548588
1440F69976413J187623R42588O36220K25305k39372p33256j250446j900673j361370
1458.3F67483032J97708P27296J372040K497792L039181L615737N521059O842613O322801
1476.7F97619259N546213N075156M853010M267097L652811L703594M165232L574670
1493G32457042K731919K675176K859354K582431J812219J068235J612305K569735K221167
1511.4G52589583J609326J072347R45091R55940J213490J484633J181543J055479R72569
$$ plain form
1384.9 661583424 664126635 667412281 669940889 671232283 671576500 671503544 671274304 670808256 669888973
1403.3 669888973 668672800 667618632 666643977 665509939 664315999 663208246 662251353 661785424 661864519
1421.6 661864519 662135959 662647665 663368523 664158821 665006340 665796161 666809022 668427825 669976413
1440 669976413 671164036 672106624 672742844 672968149 672728777 671995521 670745075 668844402 667483032
1458.3 667483032 667680740 668408036 669780076 672277868 675317049 678932786 684453845 691296458 697619259
1476.7 697619259 703165472 708240628 713093638 717360735 721013546 724717140 728882372 732457042
1493 732457042 735188961 737864137 740723491 743305922 745118141 746186376 747798681 750368416 752589583
1511.4 752589583 754198909 755271256 756216347 757172287 758385777 759870410 761051953 762107432 763080001
1529.7G63080001O21676M64082M10736j90556o06716J97351O48677M67837J46866j13010
1550.1G65126944l10839o86466j130224j393079k09034M84705j49906n58435o57380
1568.5G60516286m87149k96891o62863p48515j34170j79350o27637p87497q26418r71496
1588.9G54794300j205862j378298j420021j431942j612425j897812k032756k114833
1605.2G41700351k346515k609969k627015k634883l183007l520191k498388k186715
1621.5G20093668k614379k496660k461434k353489j733005j421034j193226j77145
1637.8G05643296L77655L34263J22249J69993J044988J306236J327038K829552L052652
1656.2G16207922K422809K423406K880335L178835K685725K674699L462434L382385
$$ plain form
1529.7 763080001 763701677 764165759 764576495 764385939 763779223 763976574 764625251 765093088 765239954 765126944
1550.1 765126944 764816105 764129639 762999415 761606336 761397302 761882007 761732101 761173666 760516286
1568.5 760516286 760029137 759732246 759069383 758320868 758186698 758007348 757379711 756592214 755765796 754794300
1588.9 754794300 753588438 752210140 750790119 749358177 747745752 745847940 743815184 741700351
1605.2 741700351 739353836 736743867 734116852 731481969 728298962 724778771 722280383 720093668
1621.5 720093668 717479289 714982629 712521195 710167706 708434701 707013667 705820441 705643296
1637.8 705643296 706020951 706355214 706477463 706647456 707692444 708998680 710325718 713155270 716207922
1656.2 716207922 718630731 721054137 723934472 727113307 729799032 732473731 735936165 739318550
1672.5G39318550L290951L642142L251135K573311K427042L766894M155338L327966
1688.8G65753329L082216K524852K167642K225578K305806K982378K708793K161324
1705.1G85911918K275645K074719J613557J139641P45773R34840J417756J236021R94086
1723.5G98343956J067758R89974P98583O12557Q33451J464606J272559J029849J137912
1741.9H07551205J144171J047730J060307J470983J961887J686216J320481J341820
1758.2H18584800J224458J148224J117229Q21174N47528L69131N31316J083255J150310
1776.5H26577425Q06212N31495M95911O28411P30098M44352k026K57909Q71718P71403
1796.9H32112908L25799K91407P05779Q62420N49137J74284K52843O23584O54459L76403
$$ plain form
1672.5 739318550 742609501 746251643 749502778 752076089 754503131 758270025 762425363 765753329
1688.8 765753329 768835545 771360397 773528039 775753617 778059423 781041801 783750594 785911918
1705.1 785911918 788187563 790262282 791875839 793015480 793761253 794696093 796113849 797349870 798343956
1723.5 798343956 799411714 800401688 801200271 801812828 802646279 804110885 805383444 806413293 807551205
1741.9 807551205 808695376 809743106 810803413 812274396 814236283 815922499 817242980 818584800
1758.2 818584800 819809258 820957482 822074711 822895885 823443413 823812544 824343860 825427115 826577425
1776.5 826577425 827383637 827915132 828411043 829039454 829769552 830213904 830211878 830469787 831341505 832112908
1796.9 832112908 832438707 832730114 833435893 834298313 834847450 835021734 835274577 835898161 836552620 836929023
1817.3H36929023K41816K85566K96951K31087L6835R4414O43850P57992L12805O9559
1837.7H39899898J46567J07110k4080J13427L16263M42266M14252J18375r7155O7710
1858.1H41504633L51310K53022j78039m31478o8426N72979N17309Q6546P8141L76583
1878.5H43062580L77118N8890p6950J06394K70129K23815K3723M3153L63529L79503
1898.9H44831884k086j99497K3246K21073Q5950p2300K1577J52051Q9765p4744j32978
1921.3H44943941J27077M48227K94685q5950j12355J86742K68876m2736l28183j47105
1941.7H45553219L15905L55840K5391l4511K19882L14295P4089j38164J8239K93732
1962.1H46997917K12371j10507j15573J96457L23176J10745j51813r6321J87755K46405
$$ plain form
1817.3 836929023 837170839 837456405 837753356 837984443 838021278 838115692 838759542 839517534 839830339 839899898
1837.7 839899898 840046465 840153575 840129495 840242922 840559185 841001451 841415703 841534078 841436923 841504633
1858.1 841504633 841855943 842108965 841930926 841499448 841431022 842004001 842521310 842607856 842685997 843062580
1878.5 843062580 843439698 843498588 843421638 843528032 843798161 844021976 844045699 844088852 844452381 844831884
1898.9 844831884 844829798 844630301 844653547 844874620 844960570 844888270 844909847 845061898 845151663 845076919 844943941
1921.3 844943941 845071018 845519245 845813930 845727980 845615625 845802367 846071243 846028507 845700324 845553219
1941.7 845553219 845869124 846224964 846250355 846215844 846435726 846750021 846824110 846685946 846704185 846997917
1962.1 846997917 847210288 847099781 846984208 847180665 847503841 847614586 847462773 847366452 847554207 847800612
1982.5H47800612m0471k33412o0260J39534P7844r3579q9944J19627J69277q9228k62499
2005H47437501j08123R0420l5405l52084m29690k01881p0989k83182n59330m52876
2025.4H45034361L1292J98543j57713l77834j80006l815j84000m06026l01064k6106
2045.8H43627632M4644j54019k76744q2135J44124O2227j62840j60635J00613K39968
2066.2H43382835M6730j47759m2081J75535J51933q3805j34885J04547K58267Q8334
2086.6H43799651j39058o3896J94788K41160K7120r2685R1195K93851J96755l8922
2106.9H44509959m4644J66476K26498K0563j32858j4067J75595J13547j33574j57416
2127.3H44730079Q3149J81138q404j61827j1205K20418J43051j15991j41680O3836
$$ plain form
1982.5 847800612 847760141 847526729 847466469 847606003 847683847 847590268 847500324 847619951 847789228 847700000 847437501
2005 847437501 847329378 847419798 847384393 847032309 846602619 846400738 846329749 846046567 845487237 845034361
2025.4 845034361 845065653 845264196 845106483 844728649 844548643 844544828 844360828 843954802 843653738 843627632
2045.8 843627632 843672276 843518257 843241513 843159378 843303502 843365729 843202889 843042254 843142867 843382835
2066.2 843382835 843429565 843281806 843239725 843415260 843567193 843483388 843348503 843453050 843711317 843799651
2086.6 843799651 843660593 843596697 843791485 844032645 844059765 843967080 844058275 844352126 844548881 844509959
2106.9 844509959 844465315 844631791 844858289 844878852 844745994 844731927 844907522 845021069 844887495 844730079
2127.3 844730079 844813228 844994366 844985962 844824135 844812930 845033348 845176399 845060408 844918728 844982564
2147.7H44982564J71364M1008q6248M4882K67506K56479O5088J9133J74701K59400
2168.1H46195877J96218J61231K45988L80516L77357K13385J36673K81155M12703K88427
2188.5H48889530R9718J41025L03268L10898J64926R3758K04742L16859K70247J82211
2208.9H50977182J94192K58625K46703J62840J40489K21550K77460J94251R1791J21892
2229.3H52886975J86860J64271J01268R9540J54614J44601M8518J2756J12354J96875
2249.7H54108632J36375L3200M1425J48714J79112O5326k503R9301J94550J21116K1935
2272.2H55147183P8916J71602J23859J8656L4809J69635K08080O1512o3777j1146Q3685
2294.6H56023014M0590q4817j18136q35P6056l1412j36375p4208L8862j9252k05219
$$ plain form
2147.7 844982564 845153928 845194936 845108688 845153570 845421076 845677555 845742643 845761776 845936477 846195877
2168.1 846195877 846392095 846553326 846799314 847179830 847557187 847770572 847907245 848188400 848601103 848889530
2188.5 848889530 848989248 849130273 849433541 849744439 849909365 850003123 850207865 850524724 850794971 850977182
2208.9 850977182 851171374 851429999 851676702 851839542 851980031 852201581 852479041 852673292 852765083 852886975
2229.3 852886975 853073835 853238106 853339374 853438914 853593528 853738129 853786647 853799403 853911757 854108632
2249.7 854108632 854245007 854278207 854319632 854468346 854647458 854712784 854710281 854809582 855004132 855125248 855147183
2272.2 855147183 855226099 855397701 855521560 855540216 855575025 855744660 855952740 856014252 855950475 855939329 856023014
2294.6 856023014 856063604 855978787 855860651 855859816 855935872 855904460 855768085 855693877 855732739 855713487 855508268
2317H55508268k38657q0347p272j70112l13520j74701Q6069O139l85105m81725j86324
2339.5H53562713j3471q6963J3828K61843K38121q1241m92394o04809l04698L5166
2359.9H52528095M9532j53005j2935L41773K70188m6491q0109J63555K98083J19150
2380.2H53477836q7798j490J90675J13607k06530l44277j10447P4267j00374l19719
2400.6H52685750k37406j6391n8711l31342m12524k01165l8862j81735m16219l77417
2421H50413978j46568j30415l80456m91679k89857j29223k67744m66228m28497k30134
2441.4H47453177j84178l74198n00501l56793j79172k67624m71235m48465k28047j54198
2461.8H44288766l49104m74453l10898j39415k13027l79264l76881k25424j93715l35873
$$ plain form
2317 855508268 855269611 855189264 855181992 855011880 854698360 854523659 854609728 854615867 854230762 853749037 853562713
2339.5 853562713 853549242 853462279 853476107 853737950 853976071 853894830 853402436 852797627 852492929 852528095
2359.9 852528095 852577627 852424622 852411687 852753460 853023648 852977157 852897048 853060603 853358686 853477836
2380.2 853477836 853390038 853388548 853579223 853692830 853486300 853142023 853031576 853105843 853005469 852685750
2400.6 852685750 852448344 852431953 852373242 852041900 851629376 851428211 851389349 851207614 850791395 850413978
2421 850413978 850267410 850136995 849756539 849264860 848975003 848845780 848578036 848111808 847683311 847453177
2441.4 847453177 847268999 846894801 846394300 846037507 845858335 845590711 845119476 844671011 844442964 844288766
2461.8 844288766 843939662 843465209 843154311 843014896 842801869 842422605 842045724 841820300 841626585 841290712
2482.2H41290712m10139k83897j04129j21177l08454l46601j53362m0055j73867l02135
2502.6H39046896k02895n6863j17898k69830k72870j64568j18554k01702l21925k95698
2523H37024093j64926k10226m17650m71353l05295j86920k99037m59492m20928k93613
2543.4H33794653l28600m70817m63128l04818k44260l69430m72426l79622k43426k79724
2563.8H30238402m19855m42207l18468k46584l38674m43577l77298k32279k50042l77714
2584.2H26791704l77775k64704k04503k47062l02791k81751j96040j74463k79307l39985
2604.6H24123323k90692k70486l66211m91559m69804l72887m25875n90563o40630n39065
2625H19665551m89712n98251o98090o61790n86868o03854p35224q00788o70254n72145
$$ plain form
2482.2 841290712 840880573 840596676 840492547 840371370 840062916 839716315 839562953 839522898 839349031 839046896
2502.6 839046896 838844001 838787138 838669240 838399410 838126540 837961972 837843418 837641716 837319791 837024093
2523 837024093 836859167 836648941 836231291 835759938 835454643 835267723 834968686 834509194 834088266 833794653
2543.4 833794653 833466053 832995236 832532108 832227290 831983030 831613600 831141174 830761552 830518126 830238402
2563.8 830238402 829818547 829376340 829057872 828811288 828472614 828029037 827651739 827419460 827169418 826791704
2584.2 826791704 826413929 826149225 825944722 825697660 825394869 825113118 824917078 824742615 824463308 824123323
2604.6 824123323 823832631 823562145 823195934 822704375 822234571 821861684 821435809 820845246 820204616 819665551
2625 819665551 819175839 818577588 817879498 817217708 816630840 816026986 815291762 814490974 813820720 813248575
2645.4H13248575o85513q05319p38084n96702n75244o75977p49290o70612n07950n13733
2665.8H06730151o83009o93799n32686m71235n41925n96106n53727m69446m96388n97834
2686.2H01093996n82695m65095m32849n49198o46770n95927n15818o05584p74741p46310
2706.6G95179009n63263n15461o79732p97212o70195m81009m87089o41287o61969m95791
2727G89186001m17352n57303o77526n29707k84552l21985n76079o18040l88503k58208
2747.4G84556746m28080o16491n09381k81573k74300m59135n03301l12627j95026l37243
2767.8G80639589n18799m63188k98321l73244o21736o87838n35786m32849n49316p50900
2788.2G75407612p73370o52611o77824q62956r90331r57072q90076j020670j228810
$$ plain form
2645.4 813248575 812563062 811757743 811019659 810422957 809847713 809171736 808422446 807751834 807243884 806730151
2665.8 806730151 806047142 805353343 804820657 804349422 803807497 803211391 802657664 802188218 801691830 801093996
2686.2 801093996 800511301 800046206 799613357 799064159 798417389 797821462 797305644 796700060 795925319 795179009
2706.6 795179009 794615746 794100285 793420553 792623341 791953146 791472137 790985048 790343761 789681792 789186001
2727 789186001 788768649 788211346 787533820 787004113 786719561 786397576 785821497 785203457 784814954 784556746
2747.4 784556746 784128666 783512175 783002794 782721221 782446921 781987786 781484485 781171858 780976832 780639589
2767.8 780639589 780120790 779657602 779359281 778986037 778364301 777676463 777140677 776707828 776158512 775407612
2788.2 775407612 774634242 773981631 773303807 772440851 771450520 770493448 769603372 768582702 767353892
2806.5G67353892j217305j091242j118004j305819j411974j306355j227677j371682
2822.8G57303834j572728j597166j463652j432240j628578j801371j764119j805484
2839.1G44238496k120733k447546k526402k431453k417564k444923k279818j915276
2855.5G25654781j611769j679421k078771k439499k611459k840042l210723l447473
2871.8G05735624l491044l522098l498912l300369k897322k343953j863777j557529
2888.1F83260620j242698q00848m32908m37439o54459o81877o03616p25448j028061
2906.5F76653266j320183j542151j814843k224445k626717k791166k653122k316892
2922.8F59363747j922608j411736p14123j7524O16610J295209J996637K678990L284752
$$ plain form
2806.5 767353892 766136587 765045345 763927341 762621522 761209548 759903193 758675516 757303834
2822.8 757303834 755731106 754133940 752670288 751238048 749609470 747808099 746043980 744238496
2839.1 744238496 742117763 739670217 737143815 734712362 732294798 729849875 727570057 725654781
2855.5 725654781 724043012 722363591 720284820 717845321 715233862 712393820 709183097 705735624
2871.8 705735624 702244580 698722482 695223570 691923201 689025879 686681926 684818149 683260620
2888.1 683260620 682017922 681217074 680784166 680346727 679692268 679010391 678406775 677681327 676653266
2906.5 676653266 675333083 673790932 671976089 669751644 667124927 664333761 661680639 659363747
2922.8 659363747 657441139 656029403 655315280 655297756 655914366 657209575 659206212 661885202 665169954
2941.1F65169954L620327L669202L660977L757834L871799L778279L602862L606022
2957.4F94737256L649115L489554L191292L001690K902150K727628K587259K563357
2973.8G18849301K546132K521098K421558K133727J843750J734376J680851J585841
2990.1G35316634J401007J144290R45449O72758L30746K10643J82926J1623j52230
3008.4G40063846k12610l43859o39498r75669j176774j181424j140654j253664j416505
3026.8G31723189j379788j249730j277805j530468j780570j664876j423240j534343
3043.1G19882369j839042j942277j819729j775146j879990j928270j936257j953125
3059.4G04808533j922309j826525j692295j718998j965821k125144k014160j742363
$$ plain form
2941.1 665169954 668790281 672459483 676120460 679878294 683750093 687528372 691131234 694737256
2957.4 694737256 698386371 701875925 705067217 708068907 710971057 713698685 716285944 718849301
2973.8 718849301 721395433 723916531 726338089 728471816 730315566 732049942 733730793 735316634
2990.1 735316634 736717641 737861931 738807380 739480138 739810884 740021527 740204453 740216076 740063846
3008.4 740063846 739851236 739507377 738867879 737892210 736715436 735534012 734393358 733139694 731723189
3026.8 731723189 730343401 729093671 727815866 726285398 724504828 722839952 721416712 719882369
3043.1 719882369 718043327 716101050 714281321 712506175 710626185 708697915 706761658 704808533
3059.4 704808533 702886224 701059699 699367404 697648406 695682585 693557441 691543281 689800918
3075.7F89800918j581252j736104j983404k052248k038836k004981j982331k070725
3092.1F74351037k107203j983285j838088j859487k042651k038657j800120j717806
3108.4F58963740j887083j899779j647651j583696j798868k082765k274156k181172
3124.7F43608570j933813j812696j864315j931607j837671j655102j649856j847864
3141F29075646j969218j927197j816690j581371j412630j666009k019525j984179j770019
3159.4F12928808j690805j724720j749397j701831j644791j625835j645089j648187
3175.7E99498153j577616j527429j560032j574636j529395j461625j435816j486838
3192E87344766j530350j521170j483142j429021j384259j355767j303971j266599j296758
$$ plain form
3075.7 689800918 688219666 686483562 684500158 682447910 680409074 678404093 676421762 674351037
3092.1 674351037 672243834 670260549 668422461 666562974 664520323 662481666 660681546 658963740
3108.4 658963740 657076657 655176878 653529227 651945531 650146663 648063898 645789742 643608570
3124.7 643608570 641674757 639862061 637997746 636066139 634228468 632573366 630923510 629075646
3141 629075646 627106428 625179231 623362541 621781170 620368540 618702531 616683006 614698827 612928808
3159.4 612928808 611238003 609513283 607763886 606062055 604417264 602791429 601146340 599498153
3175.7 599498153 597920537 596393108 594833076 593258440 591729045 590267420 588831604 587344766
3192 587344766 585814416 584293246 582810104 581381083 579996824 578641057 577337086 576070487 574773729
3210.3E74773729j312614j277148j233697j239002j294494j278758j191854j159072
3226.7E64787090j130164r84549q81255j082003j352668j340151j165509r80496q10326
3245E55059969q32855j056373j122892r17077p70033q65638r81271r39787q43167p74443
3265.4E45956433o27637m72128n95987q43466r39071r57787q94308p85649p73966p79033
3285.8E38287401o45280m56094m82738o91772q59678r80198r54569o95288m58479n70058
3306.2E31493247r61543j255333j288176j159668j026272r62913r33886q71956q52764
3324.6E22180736j038909j273572j272142j088858r17733q50498j002193j246333j302719
3342.9E12187779j279354j212061j062810j175642j483858j522600j331091j189113
$$ plain form
3210.3 574773729 573461115 572183967 570950270 569711268 568416774 567138016 565946162 564787090
3226.7 564787090 563656926 562672377 561791122 560709119 559356451 558016300 556850791 555870295 555059969
3245 555059969 554227114 553170741 552047849 551130772 550360739 549495101 548513830 547574043 546730876 545956433
3265.4 545956433 545328796 544856668 544260681 543417215 542478144 541520357 540626049 539840400 539066434 538287401
3285.8 538287401 537642121 537186027 536703289 536011517 535151839 534171641 533217072 532521784 532063305 531493247
3306.2 531493247 530531704 529276371 527988195 526828527 525802255 524839342 523905456 523033500 522180736
3324.6 522180736 521141827 519868255 518596113 517507255 516589522 515739024 514736831 513490498 512187779
3342.9 512187779 510908425 509696364 508633554 507457912 505974054 504451454 503120363 501931250
3359.2E01931250j191795j192719j016736r36359j220077j592308j614929j334965
3375.5D91831362j136094j080662j095593j054108q55297n81831l53187m76182r03636
3393.9D84294772r75340m98146j89156n95808j105755r56953n17905l46750m08709
3412.3D78700250n87940o69449n08249l62456k96980j18822J15335K18421J32114J27792
3432.7D76750016K47717Q7530k35767k08288J13040L40462L84033L76880M32998N28186
3453.1D78816807O21051P41839Q23707O97046O54757R95040J195491P80195K52723
3471.4D85578656K95758O93530J001686R74715O80506O71357R04113Q78662P92384
3489.8D92471367R37373J098036J099140R48220Q85517R83536Q91238P04527Q05974
$$ plain form
3359.2 501931250 500739455 499546736 498530000 497593641 496373564 494781256 493166327 491831362
3375.5 491831362 490695268 489614606 488519013 487464905 486609608 486027777 485674590 485198408 484294772
3393.9 484294772 483319432 482821286 482632130 482036322 480930567 479973614 479455709 479108959 478700250
3412.3 478700250 478112310 477442861 476934612 476572156 476275176 476156354 476271689 476490110 476622224 476750016
3432.7 476750016 476997733 477085263 476849496 476641208 476754248 477094710 477478743 477855623 478288621 478816807
3453.1 478816807 479437858 480179697 481003404 481700450 482355207 483350247 484545738 485325933 485578656
3471.4 485578656 485874414 486567944 487569630 488544345 489224851 489896208 490800321 491678983 492471367
3489.8 492471367 493408740 494506776 495605916 496554136 497439653 498423189 499314427 500018954 500824928
3508.1E00824928J116455J392424J287580R38177R13620J185119J396358J229524R15051
3526.5E11199236R79602J282275J462340J515389J421571J225888J259566J459658
3542.8E21805525J493096J298189J229227J391053J532197J586139J613796J696706
3559.1E33645928J720428J472235J350939K029419K682984K432347K145469K215922
3575.4E49695671K316534K453029K605856K514243K262473K384961K859532K867163
3591.7E69959462K703964K836466L077030L126383L038109K894699K687514K716899
3608.1E93040526K929866L041208L098488K965629L059089L607452L483772K665818
3624.4F17891848J989186K437770L669858L620267L137589K896607K777218K707959
$$ plain form
3508.1 500824928 501941383 503333807 504621387 505559564 506473184 507658303 509054661 510284185 511199236
3526.5 511199236 512178838 513461113 514923453 516438842 517860413 519086301 520345867 521805525
3542.8 521805525 523298621 524596810 525826037 527217090 528749287 530335426 531949222 533645928
3559.1 533645928 535366356 536838591 538189530 540218949 542901933 545334280 547479749 549695671
3575.4 549695671 552012205 554465234 557071090 559585333 561847806 564232767 567092299 569959462
3591.7 569959462 572663426 575499892 578576922 581703305 584741414 587636113 590323627 593040526
3608.1 593040526 595970392 599011600 602110088 605075717 608134806 611742258 615226030 617891848
3624.4 617891848 619881034 622318804 625988662 629608929 632746518 635643125 638420343 641128302
3640.7F41128302K537489K143979J812577K489686L571987L162265K581298K917290
3657F62344873L082991K549171K102613J904190J560628J478315J928985J743913J657664
3675.4F80353343K453983K637387K319634K015650J678586J460850J599670K002835
3691.7F96521938K105117J802265J370550J083314J217067J495064J269936P23600
3708G07588851N29051J210571J847863J523316R50873P06553P76529R01878J059234
3726.4G17094719J047850O02901K05517N30004J440049J589953O98328k08675k98P68244
3746.7G23768592N17249O02126J483619J457215Q69155P39872R54747Q01921N31972
3765.1G31726468N14805O19352Q44180R46105P36773M80950M42147N41329N15461N60105
$$ plain form
3640.7 641128302 643665791 645809770 647622347 650112033 653684020 656846285 659427583 662344873
3657 662344873 665427864 667977035 670079648 671983838 673544466 675022781 676951766 678695679 680353343
3675.4 680353343 682807326 685444713 687764347 689779997 691458583 692919433 694519103 696521938
3691.7 696521938 698627055 700429320 701799870 702883184 704100251 705595315 706865251 707588851
3708 707588851 708117902 709328473 711176336 712699652 713650525 714357078 715133607 716035485 717094719
3726.4 717094719 718142569 718745470 718950987 719480991 720921040 722510993 723209321 723000646 723000348 723768592
3746.7 723768592 724285841 724887967 726371586 727828801 728697956 729437828 730392575 731194496 731726468
3765.1 731726468 732241273 732860625 733704805 734650910 735387683 735868633 736310780 736852109 737367570 737927675
3785.5G37927675O58930N87761M55916K98738K32578K27511R298J85132O95050O61731
3805.9G41940320P42316Q72969N34654L3856k9445J94967J72615O69360R88245O11186
3826.3G46731043L59416K64287K40624K24709l397j8776M32969Q10265R60767O58572
3846.7G50660479j23382r69290q71480R55999J539350P35521R8765p8797J77562K16782
3867.1G52341509R4950M80235P31647O21438L23951K027J72436L66151L76403L88444
3887.5G55899191J38402J60992M74393K80857j94132m08292k24948L31760R09924Q66354
3907.9G58234501M42922J67429j668j16408j788J62065J62422K48134L74794J85967
3928.3G59858370k9683J54137L85940K79546K3425j38462J7584K87056K29775J26601
$$ plain form
3785.5 737927675 738586605 739174366 739630282 739929020 740161598 740389109 740398407 740583539 741278589 741940320
3805.9 741940320 742682636 743555605 744090259 744124115 744094670 744289637 744462252 745131612 746119857 746731043
3826.3 746731043 747090459 747354746 747595370 747820079 747816682 747797906 748230875 749041140 750001907 750660479
3846.7 750660479 750537097 749567807 748696327 749652326 751191676 751927197 752025962 751947165 752124727 752341509
3867.1 752341509 752436459 752916694 753648341 754269779 754593730 754595757 754768193 755134344 755510747 755899191
3887.5 755899191 756037593 756198585 756672978 756953835 756759703 756351411 756126463 756458223 757368147 758234501
3907.9 758234501 758677423 758844852 758843184 758726776 758724988 758887053 759049475 759297609 759672403 759858370
3928.3 759858370 759828687 759982824 760368764 760648310 760671735 760533273 760550857 760837913 761067688 761194289
3948.7G61194289K19702K64407J93834R6440J02520K07782K31385J78337J24216N1260
3969.1G62864172j7285k2650P0751J67430J73330J94371J89662Q5115K3127M8756Q8215
3991.5G63864994P7128L4154P7665
3997.6G64053941
$$ plain form
3948.7 761194289 761413991 761678398 761872232 761968672 762071192 762278974 762510359 762688696 762812912 762864172
3969.1 762864172 762846887 762824237 762894988 763062418 763235748 763430119 763619781 763704896 763728023 763776779 763864994
3991.5 763864994 763942122 763976276 764053941
3997.6 764053941
##END=$$ End of the data block
