##TITLE=$$ Begin of the data block
##JCAMP-DX=5.00 $$ ACD/SpecManager v 10.08
##SPECTROMETER/DATA SYSTEM=Alpha
##DATE=22 Dec 2014 10:36:42
##DATA TYPE=INFRARED SPECTRUM
##DATA CLASS=XYDATA
##ORIGIN=
##OWNER=
##NPOINTS=1765
##FIRSTX=399.76428223
##LASTX=3997.64306641
##MAXX=3997.64306641
##MINX=399.76428223
##MAXY=0.85680813
##MINY=0.44881141
##XFACTOR=1.0000000000
##YFACTOR=1.000000000000000e-9
##FIRSTY=0.67696959
##DELTAX=2.03961372
##XUNITS=1/CM
##YUNITS=ARBITRARY UNITS
##XYDATA=(X++(Y..Y))
399.8F76969588k416969j833379j441479p24434N17606J714468J626253L27349r29832
418.1F73809171q41618n24163j418829k123833j697719j085877j544118k338708j601457
436.5F60632849L44097J676858K111852K507687L442645L866255K420306L54588l61621
454.8F76995516P5698j6988j257002j967609j426756j300335k554894l449082k326906
473.2F62771642o74844q34882j860797j489878J99258Q58009j88827r19462j71422
491.5F57688797M22537p46071k166927j928032o93679p52568k349675l067374k023935
509.9F44383073j435816k806187m348934l784716j984715j599431k381921j809180
526.2F24232173N11706J779020Q49008K96295K428234N083203M962504K684235J331330
$$ plain form
399.8 676969588 674552619 672719240 671277761 670553327 671070933 672785401 674411654 674739003 673809171
418.1 673809171 672967553 672443390 671024561 668900728 667203009 666117132 664573014 662234306 660632849
436.5 660632849 660976946 662653804 664765656 667273343 670715988 674582243 677002549 677357137 676995516
454.8 676995516 677071214 677054226 675797224 673829615 672402859 671102524 668547630 665098548 662771642
473.2 662771642 662096798 661261916 659401119 657911241 658110499 658968508 658779681 657860219 657688797
491.5 657688797 658111334 657365263 655198336 653270304 652576625 651824057 649474382 646407008 644383073
509.9 644383073 642947257 640141070 635792136 632007420 630022705 628423274 626041353 624232173
526.2 624232173 624743879 626522899 627371907 627668202 630096436 635179639 640142143 642826378 644157708
544.6F44157708J751184J469970p45177k499521k023637j108885k159179m299163m828751
562.9F29714549l831447l930747n340993n364359k780318L15308J613319K013624L656209
581.3F16065145N984187O559610M813969K898693K614737K669334J137853p57039p36832
599.6F41249657N92053Q23199k85565o34790P75635K086044J702606Q35002J530766
618F48674607L384292L945351K850592K201677K972304L478527K373219Q40366O84440
636.4F71405375J633286J847387P89881J23918Q85725J713156J174271J27972K32935
654.7F79933906J236975J547992P38263J90854M86732J009583J464784J045764Q04901
673.1F88459754J356482J704097J187384O88672R37284J346647J011610J14978l72589
$$ plain form
544.6 644157708 645908892 647378862 646633685 644134164 642110527 641001642 638842463 634543300 629714549
562.9 629714549 625883102 621952355 616611362 611247003 608466685 608781993 610395312 612408936 616065145
581.3 616065145 622049332 628608942 633422911 636321604 638936341 641605675 642743528 641986489 641249657
599.6 641249657 641841710 642664909 642379344 641744554 642520189 644606233 646308839 647143841 648674607
618 648674607 652058899 656004250 658854842 661056519 664028823 667507350 669880569 670720935 671405375
636.4 671405375 673038661 674886048 675675929 675799847 676685572 678398728 679572999 679700971 679933906
654.7 679933906 681170881 682718873 683457136 683647990 684134722 685144305 686609089 687654853 688459754
673.1 688459754 689816236 691520333 692707717 693396389 694333673 695680320 696691930 696806908 696434319
691.4F96434319l23355m88818j354694k379239k524435j822710j225412r29892k62857
709.8F85122907J029551K323270K981603L136814L502428M270614M705250M373133
726.1G11445570L696620L301919L176928K741396J853228J115024R00924O14643l50118
744.5G28496134j796603k834737k932310k904892l487408l982246l490866k294659
760.8G04772413j334310p45535L72052K425671M394710N187035N225897N588412O128013
779.1G32014358N809188M424155L147900L114521L575385L058731J990676J952589
795.4G59087503L052294L674865K885640J842856J923919K524316K099395P64429R4057
813.8G77949274O33418R97603P6056j179994j413345j050830j614392l233909m242897
$$ plain form
691.4 696434319 696110964 695622146 694267452 691888213 689363778 687541068 686315656 685385764 685122907
709.8 685122907 686152458 688475728 691457331 694594145 698096573 702367187 707072437 711445570
726.1 711445570 715142190 718444109 721621037 724362433 726215661 727330685 728231609 728846252 728496134
744.5 728496134 726699531 723864794 720932484 718027592 714540184 710557938 707067072 704772413
760.8 704772413 703438103 702692568 703064620 705490291 709885001 715072036 720297933 725886345 732014358
779.1 732014358 737823546 742247701 745395601 748510122 752085507 755144238 757134914 759087503
795.4 759087503 762139797 765814662 768700302 770543158 772467077 774991393 777090788 777855217 777949274
813.8 777949274 778582692 779580295 779656351 778476357 777063012 776012182 774397790 771163881 766920984
832.2G66920984l764570l102064l549457m231870l605246k186299j807272k708495
848.5G41965711l181338k397061j800775k525032l191590j646221J922071M954100
864.8G34099865O045341O524563P480860P705092N847753K913773R62376O8724j342296
883.2G70306051l614366n150020m805029l819287l902077m556060m294038l204346
899.5G36960828k870679l940999n104661n314350n311251o147981p386386p619917
915.8F93264604o509722n170464m300416l283441j637578q2731N26369N45978J078189
934.1F74430788K356827L356635L280759K526999J570821r8110l000199o484986r147703
952.5F68791831j0340155j0993123j2133896j3398588j4023602j4179349j4610171
$$ plain form
832.2 766920984 763156414 760054350 756504893 752273023 748667777 746481478 744674206 741965711
848.5 741965711 738784373 736387312 734586537 732061505 728869915 727223694 729145765 734099865
864.8 734099865 740145206 746669769 754150629 761855721 767703474 770617247 771579623 771648347 770306051
883.2 770306051 766691685 761541665 756736636 752917349 749015272 744459212 740165174 736960828
899.5 736960828 734090149 730149150 725044489 719730139 714418888 708270907 700884521 693264604
915.8 693264604 686754882 681584418 677284002 674000561 672362983 672280252 672806621 673352599 674430788
934.1 674430788 676787615 680144250 683425009 685952008 687522829 687424719 684424520 677939534 668791831
952.5 668791831 658451676 647458553 635324657 621926069 607902467 593723118 579112947
966.8E79112947j5479386j6094088j5958608j5400946j4805853j3909251j2130767
981.1D75334048r548962o983876m970878l298700j611084j09136P45982R85145J124591
999.4D51667130J369953J346827P82460n633m68790m57287k28316L8564M97222J295924
1019.8D55838054K179772K713561K917290L137737L422052L455818K972543K182275
1036.1D78819102J574993J281649J038134Q18432R14335J540810K497524L452569M427493
1054.5D96365041N518227O655693P646382Q357108Q527756P155537L053248l038168
1070.8E40240824q020699r240210p017910l745079j091957Q29994K348602L502965
1087.1E17806530M241586M679620M927456M855395M174888K895117J551866Q21769
$$ plain form
966.8 579112947 563633561 547539473 531580865 516179919 501374066 487464815 475334048
981.1 475334048 465785086 458801210 453830332 450531632 448920548 448811412 449557394 450542539 451667130
999.4 451667130 453037083 454383910 455166370 455160737 454691947 454234660 454006344 454044908 454542130 455838054
1019.8 455838054 458017826 460731387 463648677 466786414 470208466 473664284 476636827 478819102
1036.1 478819102 480394095 481675744 482713878 483532310 484446645 485987455 488484979 491937548 496365041
1054.5 496365041 501883268 508538961 516185343 524542451 533070207 540225744 543278992 540240824
1070.8 540240824 532220125 522979915 515962005 512216926 511124969 511954963 514303565 517806530
1087.1 517806530 522048116 526727736 531655192 536510587 540685475 543580592 545132458 545954227
1103.4E45954227R19283J521051K248227K940119L403842L418684K962828K251923
1119.8E65620184J715660J632869J926363K484023L224552L656924L035068J218498
1136.1E84514141j177967l479838n293012o375968o666422o271899n354881m146218
1152.4E45747936k889514j668513m76658P11739J965105L359378M904270O451905P823288
1170.7E65928936Q910179R692848J0171711J0380149J0335565J0007322R448647Q624911
1187.1F43500268P421554N975961M584611L353715K326786J636386J384497J514315
1203.4F71698093J811088K156436K593756L144562L638029L750324L387273K797842
1219.7F94977403K149582J356005M04775m12702p84755q36909r22978j084089j047969
$$ plain form
1103.4 545954227 546873510 548394561 550642788 553582907 556986749 560405433 563368261 565620184
1119.8 565620184 567335844 568968713 570895076 573379099 576603651 580260575 583295643 584514141
1136.1 584514141 583336174 579856336 574563324 568187356 561520934 555249035 549894154 545747936
1152.4 545747936 542858422 541189909 540713251 541424990 543390095 546749473 551653743 558105648 565928936
1170.7 565928936 574839115 584531963 594703674 605083823 615419388 625426710 634875357 643500268
1187.1 643500268 650921822 656897783 661482394 664836109 667162895 668799281 670183778 671698093
1203.4 671698093 673509181 675665617 678259373 681403935 685041964 688792288 692179561 694977403
1219.7 694977403 697126985 698482990 698887765 698475063 697690308 696853399 695930421 694846332 693798363
1238.1F93798363o96003k56539P4566M17769R26912J413285J550794J352847J130044
1256.4F99712038J081228J042366Q13902O81817R82344J442194J538575J179636P23421
1274.8G09197521M45783K02537k08616n92590o53863m96924n26011q88764j223982
1293.1G05255091j190781j048625j212776j484632j399100j065493r69231j147985
1309.4F95736468j177371q81493o44684q10027j177847j443744j736641k367139l265798
1327.8F82231724l858089l686190l076374k580405k134084j266420j65284L60131K35618
1346.2F66060627n1737j35184j17004l26693p11381r97305j095355r99689q04424p77662
1366.6F60044193o84857l09229l7253J18613L13461M27067L78967M28200J142740K544701
$$ plain form
1238.1 693798363 693102360 692845821 692920387 693338156 694265068 695678353 697229147 698581994 699712038
1256.4 699712038 700793266 701835632 702649534 703331351 704313695 705755889 707294464 708474100 709197521
1274.8 709197521 709643304 709845841 709637225 709044635 708390772 707893848 707367837 706479073 705255091
1293.1 705255091 704064310 703015685 701802909 700318277 698919177 697853684 696884453 695736468
1309.4 695736468 694559097 693677604 693032920 692222893 691045046 689601302 687864661 685497522 682231724
1327.8 682231724 678373635 674687445 671611071 669030666 666896582 665630162 665464878 665825009 666060627
1346.2 666060627 666008890 665873706 665756702 665430009 664718628 663721323 662625968 661626279 660821855 660044193
1366.6 660044193 659359336 659050107 659012854 659131467 659444928 659871995 660250962 660679162 661821902 664366603
1386.9F64366603L305912K532124J270831L20256r9063k58386m57704q93712j208604
1405.3F68878257j054406r80973j122415j158714j102806r86218m77851Q7321K99394
1423.7F62381589N54800P25151P63177Q57294Q46922J057387J623750J560092J186609
1442F71556771R16898O30200K46584k19106p44343j272798j871705j332938J58071
1460.4F68067634O87778J369178K518773L040195L603697N509019O815374O309032
1476.7F97920680N550325N056441M818082M252970L650844L700435M157424L544033
1493G32651234K703607K692938K904832K615333J835405J071215J573563K539396K216518
1511.4G52804041J603186J046538R20833R56654J226008J508832J217902J093626R77695
$$ plain form
1386.9 664366603 667672515 670204639 671475470 671795726 671696663 671438277 670980573 670086861 668878257
1405.3 668878257 667823851 666842878 665720463 664561749 663458943 662472725 661994874 662082195 662381589
1423.7 662381589 662936389 663661540 664424717 665282011 666128933 667186320 668810070 670370162 671556771
1442 671556771 672473669 673103869 673350453 673131347 672387004 671114206 669242501 667909563 668067634
1460.4 668067634 668755412 670124590 672643363 675683558 679287255 684796274 691611648 697920680
1476.7 697920680 703471005 708527446 713345528 717598498 721249342 724949777 729107201 732651234
1493 732651234 735354841 738047779 740952611 743567944 745403349 746474564 748048127 750587523 752804041
1511.4 752804041 754407227 755453765 756374598 757331252 758557260 760066092 761283994 762377620 763355315
1529.7G63355315N79476M27127M11987k00629o07908K66195P28726N12064J38998j35899
1550.1G65475452k94209o45637j142621j462340k03729N15044j43171n37097o17445
1568.5G60944247m72903l41535p13229p22706p6115j49906o08861p97093q46565r70125
1588.9G55245209j199663j375854j415908j410365j601398j925528k066732k122581
1605.2G42127180k313614k562701k603770k620220l155231l493548k502262k184928
1621.5G20690906k558470k474308k548396k434671j737356j423896j231789j86026
1637.8G06095994L96668L61145J61111J92881J019478J245439J216233K766251L126502
1656.2G16581702K484679K438069K905249L230751K703428K650619L442228L384649
$$ plain form
1529.7 763355315 763934791 764361918 764773905 764573276 763965368 764231563 764960289 765472353 765611351 765475452
1550.1 765475452 765181243 764535606 763392985 761930645 761726916 762241960 762098789 761561692 760944247
1568.5 760944247 760471344 760129809 759416580 758693874 758617759 758467853 757858992 757061899 756215334 755245209
1588.9 755245209 754045546 752669692 751253784 749843419 748242021 746316493 744249761 742127180
1605.2 742127180 739813566 737250865 734647095 732026875 728871644 725378096 722875834 720690906
1621.5 720690906 718132436 715658128 713109732 710675061 708937705 707513809 706282020 706095994
1637.8 706095994 706492662 706853807 707014918 707207799 708227277 709472716 710688949 713455200 716581702
1656.2 716581702 719066381 721504450 724409699 727640450 730343878 732994497 736436725 739821374
1672.5G39821374L312648L695786L279149K546430K397716L737211M099190L301561
1688.8G66191065L095985K520084K102018K161145K324521L060758K745748K149940
1705.1G86351264K284348K097189J601040J100421P32363R91344J488030J271248J009643
1723.5G98926890J057446R50873P39395N50926Q23736J504481J292587J051485J163304
1741.9H08061123J130700R96709J014888J476705K010465J725256J335621J346469
1758.2H19097936J208484J114965J123845Q60870N56648L60608N37276J052022J114250
1776.5H27026904Q17358N52178M98414O45876P57515M26292m4822K63750Q85487P55668
1796.9H32584620L41355L46542P08043P94947M99368J84894K93433O56784O74427L78966
$$ plain form
1672.5 739821374 743134022 746829808 750108957 752655387 755053103 758790314 762889504 766191065
1688.8 766191065 769287050 771807134 773909152 776070297 778394818 781455576 784201324 786351264
1705.1 786351264 788635612 790732801 792333841 793434262 794166625 795157969 796645999 797917247 798926890
1723.5 798926890 799984336 800935209 801674604 802225530 803049266 804553747 805846334 806897819 808061123
1741.9 808061123 809191823 810188532 811203420 812680125 814690590 816415846 817751467 819097936
1758.2 819097936 820306420 821421385 822545230 823406100 823962748 824323356 824860632 825912654 827026904
1776.5 827026904 827844262 828396440 828894854 829540730 830298245 830724537 830679715 830943465 831828952 832584620
1796.9 832584620 832925975 833272517 833980560 834775507 835274875 835459769 835753202 836409986 837084413 837463379
1817.3H37463379K22683K69770K95759K42114N7936J09195O49214P54893L04580Q9049
1837.7H40458572J81496R7156q0228O1869K96057M46379M22597J17481j00077O8188
1858.1H41969490L63290K73347j72615m41849n7936N97418N19931R8109J09971L80754
1878.5H43639910L25918M232o9677J57356L00228K08676P630M4345L52264L57985L696
1900.9H45332563j59443N8711K25544N6624j13427l755J42514R6083m7684j21593J13904
1923.4H45580041M46380K95877r2864j05441J99140K71081l3617l19182j47105L08574
1943.8H46402884L37421K0087k4020K25663L18110R4771j20640m112K60174K10702
1964.2H47721040p8380r4712J87874L25501J13070j62661r3937J89245K35557m2080
$$ plain form
1817.3 837463379 837686062 837955832 838251591 838493705 838551641 838660836 839310050 840064943 840369523 840458572
1837.7 840458572 840640068 840737224 840656996 840718865 841014922 841461301 841883898 842001379 841901302 841969490
1858.1 841969490 842332780 842606127 842433512 841991663 841933727 842531145 843051076 843149185 843259156 843639910
1878.5 843639910 843965828 843970060 843900383 844057739 844357967 844566643 844574273 844618618 844970882 845328867 845332563
1900.9 845332563 845173120 845231831 845457375 845513999 845400572 845396817 845539331 845635414 845587730 845466137 845580041
1923.4 845580041 846026421 846322298 846229434 846123993 846323133 846594214 846560597 846241415 846094310 846402884
1943.8 846402884 846740305 846760392 846736372 846962035 847280145 847374916 847254276 847250164 847510338 847721040
1964.2 847721040 847642660 847547948 847735822 848061323 848174393 848011732 847917795 848107040 848342597 848300517
1984.6H48300517k24889n9426J33694Q9705o6817q5473J00374J69635o1751k53558
2005H48042011j39832O1393j4544l12448m20033k07484p1585k95341n79656m54187
2025.4H45608294L4332J80483j64628l59058j89483m6909j98424l72648k52188Q524
2045.8H44248295N1439j83642l10362o9976J79291P4923j76847j87158P9572K32994
2066.2H43938529M2499j52171k5749K12967J72794r2089j40011J10924K55763P9811
2086.6H44403267j22428j8597K13087K05159q881q1241J13070K71678J51038o1810
2106.9H45064342m0054J77562K28763K5391j05381J0073J61827J01626j09255j37210
2127.3H45377684Q5532J80245j2696j61171k9385J76012J39177q0704j41502M7207
$$ plain form
1984.6 848300517 848075628 848016202 848149896 848239601 848172784 848087311 848187685 848357320 848295569 848042011
2005 848042011 847902179 847963572 847949028 847636580 847216547 847009063 846937478 846642137 846062481 845608294
2025.4 845608294 845642626 845823109 845658481 845299423 845109940 845063031 844864607 844491959 844239771 844248295
2045.8 844248295 844299734 844116092 843805730 843735754 843915045 843989968 843813121 843625963 843705535 843938529
2066.2 843938529 843981028 843828857 843803108 844016075 844188869 844096780 843956769 844067693 844323456 844403267
2086.6 844403267 844280839 844262242 844475329 844680488 844671607 844590366 844703436 844975114 845126152 845064342
2106.9 845064342 845024288 845201850 845430613 845456004 845350623 845360696 845522523 845624149 845514894 845377684
2127.3 845377684 845463216 845643461 845630765 845469594 845440209 845616221 845755398 845674694 845533192 845580399
2147.7H45580399J79529N8770p8201L8922K76864K82585P1466J6570J80304K70486
2168.1H46877694K08914J75000K61426L78012L49462J89126J35302K77341L86357K54393
2188.5H49493027P6294J54972L48627L48568J84477J04189K18629L12984K22922J40846
2208.9H51605535K13682L05593K69056J63316J19627J77681K38776J77503Q0526J15693
2229.3H53466988K19225K17021J04547N0902J19448J65999J10209M5180Q4579J48654
2249.7H54732752R1255K8312J08123K14815J95384O8545j2278P2062J79290J30654
2270.1H55808914M4167R2506J86443J51515L1889L5882J77562K01643L8802p8201j8895
2292.5H56672227Q2434N3465o9916q7261N0663O7831r7275j46389j3948R8527p868
$$ plain form
2147.7 845580399 845759928 845818698 845740497 845779419 846056283 846338868 846410334 846426904 846607208 846877694
2168.1 846877694 847086608 847261608 847523034 847901046 848250508 848439634 848574936 848852277 849238634 849493027
2188.5 849493027 849569321 849724293 850072920 850421488 850605965 850710154 850928783 851241767 851464689 851605535
2208.9 851605535 851819217 852124810 852393866 852557182 852676809 852854490 853093266 853270769 853351295 853466988
2229.3 853466988 853686213 853903234 854007781 854058683 854178131 854344130 854454339 854499519 854584098 854732752
2249.7 854732752 854824007 854852319 854960442 855175257 855370641 855439186 855426908 855498970 855678260 855808914
2270.1 855808914 855853081 855945587 856132030 856283545 856315434 856351316 856528878 856730521 856769323 856691122 856672227
2292.5 856672227 856754661 856808126 856738210 856650949 856701612 856769443 856672168 856525779 856511831 856610358 856602490
2315H56602490k16365k07722o1751l9577j50621k72512k20240k6047n8591l48449m69983
2337.4H54530632k40564J9014j788j0252J62005J30296j53303m41015m42564j91331
2357.8H53361130n245k2591j59978q0705K18749K50876L5405K9862K61843K90632K6167
2380.2H54206145j35422j2815J70231J18017j61290k91228r8765M8518j28388l23832
2400.6H53391171k18511j4603n2214k98738l93510k00272n5373k17437m39704l85701
2421H51115108j57178j29044l56674m54486k74777j55210l09051n04851m26888j75298
2441.4H48171651j45733l90828n16832l46481j94788l12150m82857m12047j99079j65761
2461.8H45005095l47793m41671l09765j81854k47001l96371l95715k23637j53065k97308
$$ plain form
2315 856602490 856386125 856178403 856116652 856077075 855926454 855653942 855433702 855407655 855349064 855000615 854530632
2337.4 854530632 854290068 854309082 854307294 854297042 854459047 854589343 854436040 853995025 853552461 853361130
2357.8 853361130 853355885 853333294 853173316 853092611 853311360 853562236 853597641 853627503 853889346 854179978 854206145
2380.2 854206145 854070723 854057908 854228139 854346156 854184866 853893638 853794873 853843391 853715003 853391171
2400.6 853391171 853172660 853158057 853105843 852807105 852413595 852213323 852157950 851940513 851500809 851115108
2421 851115108 850957930 850828886 850472212 850017726 849742949 849587739 849278688 848773837 848346949 848171651
2441.4 848171651 848025918 847635090 847118258 846771777 846576989 846264839 845781982 845369935 845170856 845005095
2461.8 845005095 844657302 844215631 843905866 843724012 843477011 843080640 842684925 842461288 842308223 842010915
2482.2H42010915m11629l06845j22309j40190l10361l03388j09732l9637j87099l06845
2502.6H39772880k18272p3254r7096k38121k76804j78635j21355k17795l38316k95401
2523H37717831j66416j91212l69191m41015k97606j90854l24428m93586m44114k87712
2543.4H34511697l04341m63188m76598l18408k43307l59833m69923l96311k76029k93672
2563.8H30910087m03762m21047k85447k08676l36766m62711l80576k29656k55466l89099
2584.2H27536881l95179k75791j82569k16543l17514k98023j70827j80185l42071l77774
2604.6H24780405k57552k14577l41058n01930n01097l88145m08828n69940o20663n13792
2625H20462823m69565n92053p24316p09176o05404n93544p35163q21471o83666n50151
$$ plain form
2482.2 842010915 841599286 841292441 841170132 841029942 840719581 840416193 840306461 840266824 840079725 839772880
2502.6 839772880 839554608 839481354 839384258 839146137 838869333 838690698 838569343 838351548 838013232 837717831
2523 837717831 837551415 837360203 836991012 836549997 836252391 836061537 835737109 835243523 834799409 834511697
2543.4 834511697 834207356 833744168 833267570 832949162 832705855 832346022 831876099 831479788 831203759 830910087
2563.8 830910087 830506325 830085278 829799831 829591155 829254389 828791678 828411102 828181446 827925980 827536881
2584.2 827536881 827141702 826865911 826683342 826466799 826149285 825851262 825680435 825500250 825158179 824780405
2604.6 824780405 824522853 824308276 823967218 823465288 822964191 822576046 822167218 821597278 820976615 820462823
2625 820462823 819993258 819401205 818676889 817967713 817362309 816768765 816033602 815212131 814528465 813978314
2645.4H13978314o60657q18909p59899n91278n60940o73413p48932o67096n23984n39601
2665.8H07433605o81400o74486n05328m50969n56112o16610n51641m58300m89413n94140
2686.2H01855206n63442m28081m30405n90920o83844n98193m85122n84066p82072p48635
2706.6G95960426n58316n34296p05302p87854o30498m45843m78983o48022o48200m66109
2727G90057003m16100n93125p11799n19395k74479l78013o34611o09338l56138k58445
2747.4G85305560m34459n93066m76539k65896k88129m86255n05209k84910j87039l74020
2767.8G81410038n47826m40240k57015l56913o47842p30634n28395l86894n15223p38144
2788.2G76260912q02218o97196o75440q35955r78589r48012q88646j027226j226068
$$ plain form
2645.4 813978314 813317657 812498748 811738849 811147571 810586631 809913218 809164286 808497190 807973206 807433605
2665.8 807433605 806752205 806077719 805572391 805121422 804565310 803948700 803397059 802938759 802449346 801855206
2686.2 801855206 801291764 800863683 800433278 799842358 799158514 798560321 798075199 797491133 796709061 795960426
2706.6 795960426 795402110 794867814 794162512 793374658 792744160 792298317 791819334 791171312 790523112 790057003
2727 790057003 789640903 789047778 788335979 787816584 787542105 787164092 786529481 785920143 785564005 785305560
2747.4 785305560 784871101 784278035 783801496 783535600 783247471 782761216 782256007 781971097 781784058 781410038
2767.8 781410038 780862212 780421972 780164957 779808044 779160202 778429568 777901173 777514279 776999056 776260912
2788.2 776260912 775458694 774761498 774086058 773250103 772271514 771323502 770434856 769407630 768181562
2806.5G68181562j221537j105070j116395j287341j390398j279056j195014j360237
2822.8G58226514j595140j623511j483142j452804j629710j778066j748085j818657
2839.1G45097399k148450k451002k505958k413571k402127k457559k330005j944781
2855.5G26443946j607060j684368k081156k411305k613664k908170l262103l443479
2871.8G06432641l475547l504932l490627l327668k941191k374887j872600j556634
2888.1F83888555j245678q04961m40716m27962o42597p01011o23881p40529j058757
2906.5F77202463j350224j532197j776457k227962k667129k805114k645909k312601
2922.8F59884870j912415j400650p12394k6822O04450J300037K033770K739489L331542
$$ plain form
2806.5 768181562 766960025 765854955 764738560 763451219 762060821 760781765 759586751 758226514
2822.8 758226514 756631374 755007863 753524721 752071917 750442207 748664141 746916056 745097399
2839.1 745097399 742948949 740497947 737991989 735578418 733176291 730718732 728388727 726443946
2855.5 726443946 724836886 723152518 721071362 718660057 716046393 713138223 709876120 706432641
2871.8 706432641 702957094 699452162 695961535 692633867 689692676 687317789 685445189 683888555
2888.1 683888555 682642877 681837916 681397200 680969238 680326641 679625630 679001749 678261220 677202463
2906.5 677202463 675852239 674320042 672543585 670315623 667648494 664843380 662197471 659884870
2922.8 659884870 657972455 656571805 655859411 655832589 656437039 657737076 659770846 662510335 665841877
2941.1F65841877L633678L643573L613055L733456L879487L796458L612221L592550
2957.4F95346355L643632L530145L236950L011345K919197K781988K618909K532184
2973.8G19620705K514541K543211K466917K163172J877725J790702J723230J597881
2990.1G36298084J406253J151323R49621O76394L41892K24471J69039r418j28984j58549
3010.5G40920126k87592n95212r51827j167297j198828j158893j244307j421809j417458
3028.8G31476903j288056j282096j494468j756548j687348j457870j545608j822591
3045.1G19142318j940787j839519j762330j860917j937151j960516j962721j890123
3061.5G03988254j819432j712262j693070j939178k139985k033711j755953j589596
$$ plain form
2941.1 665841877 669475555 673119128 676732183 680465639 684345126 688141584 691753805 695346355
2957.4 695346355 698989987 702520132 705757082 708768427 711687624 714469612 717088521 719620705
2973.8 719620705 722135246 724678457 727145374 729308546 731186271 732976973 734700203 736298084
2990.1 736298084 737704337 738855660 739805281 740481675 740823567 741048038 741217077 741207659 741078675 740920126
3010.5 740920126 740632534 740037322 739085495 737918198 736719370 735560477 734316170 732894361 731476903
3028.8 731476903 730188847 728906751 727412283 725655735 723968387 722510517 720964909 719142318
3045.1 719142318 717201531 715362012 713599682 711738765 709801614 707841098 705878377 703988254
3061.5 703988254 702168822 700456560 698763490 696824312 694684327 692650616 690894663 689305067
3077.8F89305067j721680j950383k034903k055406k031208k018272k138973k163410
3094.1F73190832j954973j755237j810432k021551k015590j782239j722872j938164
3110.4F58189774j934112j626432j573681j837373k125144k248705k150952j982808
3126.7F42710567j855731j853943j918733j835585j641750j625121j850724k014399
3143F28114581j975775j840472j621783j475572j656592j948893j964569j799763j704931
3161.4F12126231j697182j717926j710832j656353j623511j646519j637101j576782
3177.7E98860025j546919j573920j600683j558006j477658j466871j529813j564324
3194E86541831j528322j473367j419306j362086j349508j353979j345516j354098j316845
$$ plain form
3077.8 689305067 687583387 685633004 683598101 681542695 679511487 677493215 675354242 673190832
3094.1 673190832 671235859 669480622 667670190 665648639 663633049 661850810 660127938 658189774
3110.4 658189774 656255662 654629230 653055549 651218176 649093032 646844327 644693375 642710567
3126.7 642710567 640854836 639000893 637082160 635246575 633604825 631979704 630128980 628114581
3143 628114581 626138806 624298334 622676551 621200979 619544387 617595494 615630925 613831162 612126231
3161.4 612126231 610429049 608711123 607000291 605343938 603720427 602073908 600436807 598860025
3177.7 598860025 597313106 595739186 594138503 592580497 591102839 589635968 588106155 586541831
3194 586541831 585013509 583540142 582120836 580758750 579409242 578055263 576709747 575355649 574038804
3212.4E74038804j218021j145065j181483j313210j371920j297295j203478j104950
3228.7E64203382r31442q59082j108587j347661j276850j119733j008153r04858r14038
3247.1E54732978j053929j060963q83281q11160r25540r96352r27806q56399p96139
3265.4E46421409o27697m75585o07074q58307r65476r63091q58605p39575p38501p53105
3285.8E38834393o46889m88877m86017o64532q59678r73344r34541p27236n28693o18756
3306.2E31905830r56178j215637j241624j130938j064241j021743r37879q47340q37207
3324.6E22653043j039743j257241j231015j093983r50814q48233j004994j280248j336933
3342.9E12609839j278221j170457j018226j157582j499056j544357j317680j157343
$$ plain form
3212.4 574038804 572820783 571675718 570494235 569181025 567809105 566511810 565308332 564203382
3228.7 564203382 563271940 562412858 561304271 559956610 558679760 557560027 556551874 555647016 554732978
3247.1 554732978 553679049 552618086 551734805 550923645 549998105 549001753 548073947 547217548 546421409
3265.4 546421409 545793712 545318127 544711053 543852746 542887270 541924179 541065574 540325999 539587498 538834393
3285.8 538834393 538187504 537698627 537212610 536548078 535688400 534715056 533780515 533053279 532524586 531905830
3306.2 531905830 530949652 529734015 528492391 527361453 526297212 525275469 524337590 523490250 522653043
3324.6 522653043 521613300 520356059 519125044 518031061 517080247 516232014 515227020 513946772 512609839
3342.9 512609839 511331618 510161161 509142935 507985353 506486297 504941940 503624260 502466917
3359.2E02466917j178086j197874j034558r52870j237333j619935j639366j339704
3375.5D92267191j138627j107514j109183j043856q70556o32107l83675m70906r15081
3393.9D84595686r59873m20898j52737o23763j106143q99106m56244l33696m43191
3412.3D79200035o40541p29144n24520k96355k45631j28328J15603K21074J05381J16795
3432.7D77194369K85864J39892k26587k54393O9887L74198M60028L80874L75777M93110
3453.1D79293019O15745P41244P95096O55442O75172J051128J197874P47532K49863
3471.4D86022115L15726O84946R90957R91077O71058O37919Q85636Q77380Q09282R76920
3491.8D93863016J123846J088589R67712R48906R98765Q39382O51747P89344J163662
$$ plain form
3359.2 502466917 501288831 500090957 499056399 498103529 496866196 495246261 493606895 492267191
3375.5 492267191 491128564 490021050 488911867 487868011 486997455 486365348 485981673 485510767 484595686
3393.9 484595686 483635813 483214915 483062178 482438415 481332272 480433166 479976922 479643226 479200035
3412.3 479200035 478559494 477830350 477305830 477009475 476763844 476635516 476751119 476972193 477077574 477194369
3432.7 477194369 477480233 477620125 477393538 477139145 477209032 477583230 478043258 478424132 478799909 479293019
3453.1 479293019 479908764 480650008 481445104 482100546 482775718 483826846 485024720 485772252 486022115
3471.4 486022115 486337841 487022787 488013744 489004821 489675879 490313798 491199434 492076814 492886096 493863016
3491.8 493863016 494986862 496075451 497043163 497992069 498990834 499830216 500481963 501271307 502434969
3510.2E02434969J453817J286328R03546Q87633J173436J375556J189352R02175J004160
3528.5E12610972J294851J467824J563013J486957J256645J274943J467347J472890
3544.8E23895442J311064J296282J416564J487613J559973J665413J746595J688123
3561.1E36067069J433432J388967K080500K715647K492487K159536K165854K279878
3577.5E52783370K433240K604843K565980K337396K390563K850771K918124K741337
3593.8E73625624K850592L076911L132403L073693K873003K608895K690971K972782
3610.1E96904874L114462L175795K976656L027797L627657L506601K686084K033114
3626.4F21053040K387643L539920L586173L210246K963245K760172K720654K596379
$$ plain form
3510.2 502434969 503888786 505175114 506078660 506966293 508139729 509515285 510704637 511606812 512610972
3528.5 512610972 513905823 515373647 516936660 518423617 519680262 520955205 522422552 523895442
3544.8 523895442 525206506 526502788 527919352 529406965 530966938 532632351 534378946 536067069
3561.1 536067069 537500501 538889468 540969968 543685615 546178102 548337638 550503492 552783370
3577.5 552783370 555216610 557821453 560387433 562724829 565115392 567966163 570884287 573625624
3593.8 573625624 576476216 579553127 582685530 585759223 588632226 591241121 593932092 596904874
3610.1 596904874 600019336 603195131 606171787 609199584 612827241 616333842 619019926 621053040
3626.4 621053040 623440683 626980603 630566776 633777022 636740267 639500439 642221093 644817472
3642.7F44817472K127826J729369K424121L576875L230392K664388K982616L128052
3659F66681111K561211K058328J840949J529514J433254J864433J734138J684665K470970
3677.4F83858573K643586K368390K092004J706898J473844J643658K003133K054811
3693.7F99844897J734495J323521J101136J274884J524210J228094O44088M99606J241446
3712.1G10416377J858711J516878R79186P52925Q03888Q86381R89675J022339O48022
3730.4G19874382J96159M31597J356721J581430P59781j18852Q2493P87556M42624
3748.8G25393891N61834J557588J526356R03845P47740R68814Q18491M77374M31239
3767.1G33387172O02901Q66056R51171P40110M82560M31359N61416N54979N51402O23226
$$ plain form
3642.7 644817472 646945298 648674667 651098788 654675663 657906055 660570443 663553059 666681111
3659 666681111 669242322 671300650 673141599 674671113 676104367 677968800 679702938 681387603 683858573
3677.4 683858573 686502159 688870549 690962553 692669451 694143295 695786953 697790086 699844897
3693.7 699844897 701579392 702902913 704004049 705278933 706803143 708031237 708675325 709174931 710416377
3712.1 710416377 712275088 713791966 714771152 715524077 716327965 717214346 718204021 719226360 719874382
3730.4 719874382 720070541 720502138 721858859 723440289 724200070 724081218 724163711 724951267 725393891
3748.8 725393891 725955725 727513313 729039669 729943514 730691254 731660068 732478559 732955933 733387172
3767.1 733387172 733990073 734856129 735807300 736547410 737029970 737461329 738022745 738577724 739129126 739752352
3787.5G39752352N90921M96030L58045K35080J07170n6267L07739Q01920O40512P11143
3807.9G43944645Q69095M70937q2672r1851K04742J91331O84261R86457O02961L46422
3828.3G48126328K29955K42233K79605O0n9366M78267Q62599R14931O08921j10507
3848.7G51573026r46700q62718R88007J608491Q22544J35660j28865J30534K65062
3867.1G53585041J28567L64005O41823O83546M09365K0027J35064L04461L65793M63903
3887.5G57101595J85311J40608M55618K63810k34247m19914j66655L96669R09984Q22961
3907.9G59455740M09246J61588J8656j02400L5643K55525K21014K08080K81751J46747
3928.3G61091590l696J88888M07278K72632K3186r1672M2796K58982K06590R2268K03967
$$ plain form
3787.5 739752352 740343273 740839303 741197348 741432428 741539598 741483331 741791070 742592990 743233502 743944645
3807.9 743944645 744813740 745284677 745202005 745110154 745314896 745506227 746190488 747176945 747779906 748126328
3828.3 748126328 748356283 748598516 748878121 748878181 748818815 749297082 750159681 751074612 751683533 751573026
3848.7 751573026 750626326 749763608 750751615 752360106 753182650 753318310 753189445 753319979 753585041
3867.1 753585041 753713608 754077613 754719436 755402982 755812347 755832374 755967438 756271899 756637692 757101595
3887.5 757101595 757286906 757427514 757883132 758146942 757912695 757492781 757326126 757722795 758632779 759455740
3907.9 759455740 759864986 760026574 760045230 759942830 759978473 760233998 760455012 760663092 760944843 761091590
3928.3 761091590 761087894 761276782 761684060 761956692 761979878 761888206 761931002 762189984 762396574 762488842 762692809
3950.7G62692809K86162J88291R9540Q3089J11878J98900K21074J16289P0214Q5235
3971.1G64153481L3676N1439J57118J88708J82152J52409M9710p748L4570O9678M6909
3993.5G65112102N5969J54376
3997.6G65322447
$$ plain form
3950.7 762692809 762978971 763167262 763266802 763349891 763461769 763660669 763881743 763998032 764068246 764153481
3971.1 764153481 764187157 764238596 764395714 764584422 764766574 764918983 764968693 764960945 764995515 765065193 765112102
3993.5 765112102 765168071 765322447
3997.6 765322447
##END=$$ End of the data block
