##TITLE=$$ Begin of the data block
##JCAMP-DX=5.00 $$ ACD/SpecManager v 10.08
##SPECTROMETER/DATA SYSTEM=Alpha
##DATE=22 Dec 2014 10:36:42
##DATA TYPE=INFRARED SPECTRUM
##DATA CLASS=XYDATA
##ORIGIN=
##OWNER=
##NPOINTS=1765
##FIRSTX=399.76428223
##LASTX=3997.64306641
##MAXX=3997.64306641
##MINX=399.76428223
##MAXY=0.85783792
##MINY=0.44888756
##XFACTOR=1.0000000000
##YFACTOR=1.000000000000000e-9
##FIRSTY=0.67877424
##DELTAX=2.03961372
##XUNITS=1/CM
##YUNITS=ARBITRARY UNITS
##XYDATA=(X++(Y..Y))
399.8F78774238k264798j746178j408577p27832L15130J176357J123369K67863n24223
418.1F74985349n34773n78165j614451k282858j656890j130521j540482k062083j395106
436.5F62190020N13971K051413K455294K467990L000140L206432J872659K29359p9692
454.8F77907586M48704l4988j574159k011120j169145r88662k395451l499628k366423
473.2F64316714q02040j083494j895487j329124M07279J000941l79622j323641l44157
491.5F58567369O21080m68194k089083j981736o79254o84023k430379l310860k164006
509.9F45380914j434266k789379m269242l719747k047896j668632k443672j955986
526.2F25052094L72828J768946J132131O98268K388239M747927M799366K719343J528680
$$ y = [678774238, 676509440, 674763262, 673354685, 672626853, 672941983, 674118340, 675241709, 675509572, 674985349, 674450576, 673872411, 672257960, 669975102, 668318212, 667187691, 665647209, 663585126, 662190020, 662703991, 664755404, 667210698, 669678688, 672678828, 675885260, 677757919, 677987278, 677907586, 678356290, 678321302, 676747143, 674736023, 673566878, 672578216, 670182765, 666683137, 664316714, 663514674, 662431180, 660535693, 659206569, 659613848, 660614789, 660235167, 658911526, 658567369, 659188449, 658720255, 656631172, 654649436, 653970182, 653286159, 650855780, 647544920, 645380914, 643946648, 641157269, 636888027, 633168280, 631120384, 629451752, 627008080, 625052094, 625424922, 627193868, 628325999, 629024267, 631412506, 636160433, 640959799, 643679142, 645207822]
544.6F45207822J960993J469255q88586k629638k076686j110553k153993m248977m843950
562.9F30685687l996372m093707n350232n223930k714872K39253J625299K106309L661156
581.3F16938591N963743O525874M766166K951682K615511K482295J046062o28233o22094
599.6F42039597O59466Q79049l30567p06256O72043J937926J723229J080633J762569
618F49717689L387153L891408K972543K341092K900302L290177K305984R36330Q33392
636.4F72576070J656294J709342P25150J76310Q86858J630962J128137K27928L72291
654.7F81089342J273870J526892P34806J86086M32134R02950J360775J065790R07541
673.1F89480186J401245J691401J241624P44105R10699J264096R27269R7513l38435
$$ y = [645207822, 647168815, 648638070, 647749484, 645119846, 643043160, 641932607, 639778614, 635529637, 630685687, 626689315, 622595608, 617245376, 612021446, 609306574, 609545827, 611171126, 613277435, 616938591, 622902334, 629428208, 634194374, 637146056, 639761567, 642243862, 643289924, 642661691, 642039597, 642699063, 643578112, 643247545, 642541289, 643213332, 645151258, 646874487, 647955120, 649717689, 653104842, 656996250, 659968793, 662309885, 665210187, 668500364, 670806348, 671742678, 672576070, 674232364, 675941706, 676666856, 676843166, 677730024, 679360986, 680489123, 680717051, 681089342, 682363212, 683890104, 684624910, 684810996, 685243130, 686146080, 687506855, 688572645, 689480186, 690881431, 692572832, 693814456, 694558561, 695469260, 696733356, 697660625, 697758138, 697419703]
691.4F97419703k79605n37873j500725k391518k390444j786947j321793r79662k14278
709.8F86016858J147925K441645K968073L044248L459930M276037M715443M341423
726.1G12411582L609837L252863L249705K888620J936913J037717P26521N11586l21984
744.5G29303360j699090k746761k965867l010929l543437m054546l578484k296269
760.8G05407977j251340o26325M27901K362371M340112N221009N250514N555868O133080
779.1G32821167N907595M523515L161490L059566L474117K934694J918197J913547
795.4G59713888L025770L737927K970099J824975J850009K504587K140165P76410M9591
813.8G78593421O39737J122892J40845j262724j432955j000882j672804l352821m290521
$$ y = [697419703, 697140098, 696602225, 695101500, 692709982, 690319538, 688532591, 687210798, 686231136, 686016858, 687164783, 689606428, 692574501, 695618749, 699078679, 703354716, 708070159, 712411582, 716021419, 719274282, 722523987, 725412607, 727349520, 728387237, 729113758, 729625344, 729303360, 727604270, 724857509, 721891642, 718880713, 715337276, 711282730, 707704246, 705407977, 704156637, 703530312, 703958213, 706320584, 710660696, 715881705, 721132219, 726688087, 732821167, 738728762, 743252277, 746413767, 749473333, 752947450, 755882144, 757800341, 759713888, 762739658, 766477585, 769447684, 771272659, 773122668, 775627255, 777767420, 778543830, 778593421, 779233158, 780356050, 780496895, 779234171, 777801216, 776800334, 775127530, 771774709, 767484188]
832.2G67484188l709435l014267l534794m297375l720582k310872j838446k644181
848.5G42414236l122508k382756j804173k508044l141880j577377J969874M952490
864.8G34799862N994081O435633P401168P651329N830169K935291R37223k8491j436472
883.2G70519793l648460n114913m797816l908932l975749m529715m247248l226519
899.5G37070441k917230l923178n070209n344808n347550o124377p374466p661104
915.8F93307519o531358n143344m273355l313601j689375o5744N84841N68807J062274
934.1F74506664K336622L350615L296316K540529J556277j03951l013134o514191r132028
952.5F68823719j0334372j1040271j2152672j3377964j4037550j4239549j4638484
$$ y = [767484188, 763774753, 760760486, 757225692, 752928317, 749207735, 746896863, 745058417, 742414236, 739291728, 736908972, 735104799, 732596755, 729454875, 727877498, 729847372, 734799862, 740793943, 747229576, 754630744, 762282073, 768112242, 771047533, 771984756, 771956265, 770519793, 766871333, 761756420, 756958604, 753049672, 749073923, 744544208, 740296960, 737070441, 734153211, 730230033, 725159824, 719815016, 714467466, 708343089, 700968623, 693307519, 686776161, 681632817, 677359462, 674045861, 672356486, 672290742, 672875583, 673444390, 674506664, 676843286, 680193901, 683490217, 686030746, 687587023, 687483072, 684469938, 677955747, 668823719, 658489347, 647449076, 635296404, 621918440, 607880890, 593641341, 579002857]
966.8E79002857j5460253j6109287j5997589j5380800j4745891j3859510j2079001
981.1D75370526r514749o985217m961550l283769j618475j19209P51704J036316J196742
999.4D51872319J375884J294106P40796l4988m94718m44293k02358J3888M79579J348853
1019.8D55949068K244532K729148K867281L066987L404796L459811K968103K210856
1036.1D78900582J600086J254499R82493Q06153R86457J585931K456426L411711M420131
1054.5D96404469N545557O683826P652283Q376836Q504928P052481K958953l076255
1070.8E40103078q023620r189367o909013l657758j089752P80404K324998L520429
1087.1E17859399M268587M682064M891276M820764M173279K918482J590312Q54790
$$ y = [579002857, 563542604, 547433317, 531435728, 516054928, 501309037, 487449527, 475370526, 465855777, 458870560, 453909010, 450625241, 449006766, 448887557, 449639261, 450675577, 451872319, 453248203, 454542309, 455283105, 455248117, 454753399, 454309106, 454106748, 454120636, 454600215, 455949068, 458193600, 460922748, 463790029, 466857016, 470261812, 473721623, 476689726, 478900582, 480500668, 481755167, 482737660, 483543813, 484530270, 486116201, 488572627, 491984338, 496404469, 501950026, 508633852, 516286135, 524662971, 533167899, 540220380, 543179333, 540103078, 532079458, 522890091, 515981078, 512323320, 511233568, 512013972, 514338970, 517859399, 522127986, 526810050, 531701326, 536522090, 540695369, 543613851, 545204163, 546058953]
1103.4E46058953R12607J487195K224803K941251L432691L430188K938389K246380
1119.8E65672457J739741J637756J890183K453446L223419L649295L037333J241148
1136.1E84544778j189232l515363n281985o318092o606936o208837n312205m143536
1152.4E45968592k900421j707495n17189P16924J986683L366649M891813O426155P793665
1170.7E66025376Q880914R683668J0191381J0404229J0340453R975314R389162Q593023
1187.1F43483520P437765N990088M571438L364027K373993J667857J370251J491666
1203.4F71750605J831234K163231K549291L124535L659129L779232L411234K796232
1219.7F95064723K129138J335442L96371m02570p89821q51333r14872j072883j026392
$$ y = [546058953, 546971560, 548458755, 550683558, 553624809, 557057500, 560487688, 563426077, 565672457, 567412198, 569049954, 570940137, 573393583, 576617002, 580266297, 583303630, 584544778, 583355546, 579840183, 574558198, 568240106, 561633170, 555424333, 550112128, 545968592, 543068171, 541360676, 540843487, 541560411, 543547094, 546913743, 551805556, 558231711, 566025376, 574906290, 584589958, 594781339, 605185568, 615526021, 625501335, 634890497, 643483520, 650921285, 656911373, 661482811, 664846838, 667220831, 668888688, 670258939, 671750605, 673581839, 675745070, 678294361, 681418896, 685078025, 688857257, 692268491, 695064723, 697193861, 698529303, 698925674, 698523104, 697733283, 696881950, 695967078, 694894195, 693867803]
1238.1F93867803o34611j90735Q5831L95000R21786J418054J537800J331567J126886
1256.4F99859381J084864J040637Q31902P03395R67443J414001J521885J164496P26223
1274.8G09314227M72009K15233k21134o12318o63936m97163n41985r04560j198649
1293.1G05361724j159549j043022j197934j465499j406312j074970r42767j095294
1309.4F95976377j164020r19520o61672p97927j172721j439274j726746k357245l261149
1327.8F82476103l865301l698767l073215k563357k118528j250148j47462L84986K59936
1346.2F66404247n5015j67250j49489l44396p28964j014948j110733j020729q24333
1364.5F60988390p84635o46591k47300j5795J13606L01659L97265L76463M59671J140595
$$ y = [693867803, 693233192, 693042457, 693128288, 693523288, 694445074, 695863128, 697400928, 698732495, 699859381, 700944245, 701984882, 702816784, 703520179, 704487622, 705901623, 707423508, 708588004, 709314227, 709786236, 710001469, 709780335, 709168017, 708504081, 708006918, 707464933, 706560373, 705361724, 704202175, 703159153, 701961219, 700495720, 699089408, 698014438, 697071671, 695976377, 694812357, 693892837, 693231165, 692433238, 691260517, 689821243, 688094497, 685737252, 682476103, 678610802, 674912035, 671838820, 669275463, 667156935, 665906787, 665759325, 666144311, 666404247, 666349232, 666181982, 666032493, 665688097, 664959133, 663944185, 662833452, 661812723, 660988390, 660203755, 659557164, 659309864, 659294069, 659407675, 659709334, 660106599, 660483062, 660942733, 662083328]
1384.9F62083328K510249L271640K485096J223922L10361o5863k35021m74453r14276
1403.3F70194983j200735j014471r43661j139760j200974j092791r43482m41373J18912
1421.6F62336648L01897N40316P09772P28786Q22068Q36312J073957J658976J572728
1440F70581460J181841R22084O22570K22624k24829p21037j231969j854598j354218
1458.3F68143928J54495P02083J380980K529800L041029L573478N487442O843268O302894
1476.7F98159397N508661N068123M871905M292846L691554L734291M158794L545761
1493G33031332K706528K690077K913475K618432J841188J110851J579941K490520K223432
1511.4G53205776J630247J020729Q64327R37760J253486J564503J251816J078070R58800
$$ y = [662083328, 664593577, 667865217, 670350313, 671574235, 671884596, 671818733, 671583712, 671109259, 670194983, 668994248, 667979777, 667036116, 665896356, 664695382, 663602591, 662659109, 662217736, 662336648, 662638545, 663178861, 663888633, 664617419, 665439487, 666275799, 667349756, 669008732, 670581460, 671763301, 672685385, 673307955, 673530579, 673305750, 672584713, 671352744, 669498146, 668143928, 668298423, 669000506, 670381486, 672911286, 675952315, 679525793, 685013235, 691856503, 698159397, 703668058, 708736181, 713608086, 717900932, 721592486, 725326777, 729485571, 733031332, 735737860, 738427937, 741341412, 743959844, 745801032, 746911883, 748491824, 750982344, 753205776, 754836023, 755856752, 756721079, 757658839, 758912325, 760476828, 761728644, 762806714, 763765514]
1529.7G63765514N78284M21941M14551j91391o48081K25961P77781N78582J72377j50382
1550.1G65945137l37303o69301j135528j432419j77085N08428j57774n61118o69360
1568.5G61313677n14150l32534o81400p02084o7770j37210n98729p77065q40485j009822
1588.9G55652428j223028j337230j368582j424373j653850j932859k005398k044261
1605.2G42662847k278864k576113k608001k604843l164291l506005k470493k160490
1621.5G21293747k584219k491295k500057k379000j721323j432001j238823j52111
1637.8G06794918M37438L73602J61707J90020J016259J253724J228452K765656L119349
1656.2G17341125K487302K450704K916575L238797K704263K643287L457546L402412
$$ y = [763765514, 764343798, 764765739, 765180290, 764988899, 764340818, 764566779, 765344560, 765923142, 766095519, 765945137, 765607834, 764938533, 763803005, 762370586, 762193501, 762701929, 762544155, 761983037, 761313677, 760799527, 760466993, 759785593, 759083509, 759015739, 758878529, 758279800, 757502735, 756662250, 755652428, 754429400, 753092170, 751723588, 750299215, 748645365, 746712506, 744707108, 742662847, 740383983, 737807870, 735199869, 732595026, 729430735, 725924730, 723454237, 721293747, 718709528, 716218233, 713718176, 711339176, 709617853, 708185852, 706947029, 706794918, 707232356, 707605958, 707767665, 707957685, 708973944, 710227668, 711456120, 714221776, 717341125, 719828427, 722279131, 725195706, 728434503, 731138766, 733782053, 737239599, 740642011]
1672.5G40642011L278792L634870L263533K575636K420724L752768M127860L277182
1688.8G66973376L008426K442896K072036K149224K296865L039062K762199K178550
1705.1G86922634K291917K087236J596630J100301P18117R70006J493335J298070J034438
1723.5G99512684J084566R93371P79689N59807P61032J414478J259148J047790J172960
1741.9H08585525J155138J030683J034856J455247J971305J699924J325250J352310
1758.2H19610238J223207J117587J105785Q51989N62727L36588N10037J109361J196504
1776.5H27624023Q40545N35786M92215O39677P36237L97741p3552K74956R43602Q00967
1796.9H33212197L33547K96355P01368Q42750N17904J63079K74360O50763O81520L91245
$$ y = [740642011, 743920803, 747555673, 750819206, 753394842, 755815566, 759568334, 763696194, 766973376, 769981802, 772424698, 774496734, 776645958, 778942823, 781981885, 784744084, 786922634, 789214551, 791301787, 792898417, 793998718, 794716835, 795686841, 797180176, 798478246, 799512684, 800597250, 801590621, 802370310, 802930117, 803691149, 805105627, 806364775, 807412565, 808585525, 809740663, 810771346, 811806202, 813261449, 815232754, 816932678, 818257928, 819610238, 820833445, 821951032, 823056817, 823908806, 824471533, 824808121, 825318158, 826427519, 827624023, 828464568, 829000354, 829492569, 830132246, 830868483, 831266224, 831192672, 831467628, 832411230, 833212197, 833545744, 833842099, 834543467, 835386217, 835904121, 836067200, 836341560, 836992323, 837673843, 838065088]
1817.3H38065088K14219K49028K93493K41042L5941R6023O63817P90358L31998O1035
1837.7H41042042J43409J14619n4717O9857L23832M76658M37677J19031r8944P7248
1858.1H42650712L47018K29358j96456m29333n1021N80489N05329R8764J27435L94881
1878.5H44257176L31521m590j04248J32024L16501K50816L5405M0353L52800L85820
1898.9H45993578J1862j80900M8637K22325M9234j00374L0756J63912R7633n1260j19329
1921.3H46166074J30713M52638K71082j14262j00553K17437K91586k8789l38435j89662
1941.7H46757829K87116L75449N4300k8491K11537L14534R5248j32859j0729K71023
1962.1H48194957K16901q6665q6129K28942L53157J13428j55568q6904J85847K27452
$$ y = [838065088, 838279307, 838528335, 838821828, 839062870, 839098811, 839194834, 839858651, 840649009, 840981007, 841042042, 841185451, 841300070, 841245353, 841315210, 841639042, 842115700, 842553377, 842672408, 842573464, 842650712, 842997730, 843227088, 843030632, 842601299, 842550278, 843130767, 843636096, 843734860, 843862295, 844257176, 844588697, 844584107, 844479859, 844611883, 844928384, 845179200, 845214605, 845254958, 845607758, 845993578, 846005440, 845824540, 845873177, 846095502, 846144736, 846044362, 846075118, 846239030, 846336663, 846285403, 846166074, 846296787, 846749425, 847020507, 846906245, 846805692, 847023129, 847314715, 847285926, 846947491, 846757829, 847044945, 847420394, 847474694, 847446203, 847657740, 847972274, 848067522, 847934663, 847923934, 848194957, 848411858, 848325193, 848239064, 848468006, 848821163, 848934591, 848779023, 848692119, 848877966, 849105418]
1982.5H49105418n9426k31207l3319J66119P9095j05083q4043J42456J94013q8036
2002.9H49085987k83480j24753P7129l3498l23236m00007j96635q1301k98977n75543
2023.3H46845686m38213O3121J96755j70886l64065j79172k4438j78635l85821k83420
2043.7H45080912k1815J6510j79767k75076r1791J27912P8439j29819j38103R6261
2064.1H44563663K24650N7578j24693l8803J65105J53065o8605j19924J11579K43009
2084.5H45166624N4299j38700k0384K25365K41518K1815q7976J06871K91347J59562
2104.9H46020341n6446j8656J89841K29001J0550j35303m232J58310Q7977j07408j10328
2127.3H46263647R1314J66953M77j42157k3663J81973J35839p3254j12355L8445J36614
$$ y = [849105418, 849045992, 848814785, 848781466, 848947585, 849026680, 848921597, 848837554, 848980010, 849174023, 849085987, 848802507, 848677754, 848754883, 848721385, 848398149, 847998142, 847801507, 847720206, 847421229, 846845686, 846407473, 846470594, 846667349, 846496463, 846132398, 845953226, 845928788, 845750153, 845364332, 845080912, 845059097, 845075607, 844895840, 844620764, 844528973, 844656885, 844735324, 844605505, 844467402, 844563663, 844788313, 844845891, 844721198, 844682395, 844847500, 845000565, 844931960, 844812036, 844923615, 845166624, 845220923, 845082223, 845061839, 845287204, 845528722, 845550537, 845462561, 845569432, 845860779, 846020341, 845963895, 845945239, 846135080, 846364081, 846374631, 846239328, 846235096, 846393406, 846481383, 846373975, 846263647, 846354961, 846521914, 846522391, 846380234, 846356571, 846538544, 846674383, 846601129, 846488774, 846527219, 846663833]
2149.8H46663833M4942p4149L3021K60949K66493P6830L2544J92106K85566K19285
2170.2H48001420J67609K54094L87371L55422J80543J22607K69174L95894K95222J17183
2190.6H50546539J42276L05593L30746J84954J00851K07662L12507K41816J49668J94907
2211H52717519K87235K68757J62244J26779K06947K64704J85013J03474J57773K11239
2231.4H54691684J55211Q4340R8884J64867J61588P5817L3558J02460J68085J06096
2251.8H55842590K7538Q0287J75834J80185Q3744R001Q0049J78158J28329M3988J11461
2274.2H56941164K06887J41204J5556L0160J58191J86980O2764l0995J8716Q3208K4080
2296.6H57837915q4877r0181K2769N1081p1228j26004l1471P4148J669j72198j85072
$$ y = [846663833, 846708775, 846634626, 846667647, 846928596, 847195089, 847271919, 847304463, 847496569, 847782135, 848001420, 848169029, 848423123, 848810494, 849165916, 849346459, 849469066, 849738240, 850134134, 850429356, 850546539, 850688815, 850994408, 851325154, 851510108, 851610959, 851818621, 852131128, 852372944, 852522612, 852717519, 853004754, 853273511, 853435755, 853562534, 853769481, 854034185, 854219198, 854322672, 854480445, 854691684, 854846895, 854931235, 855030119, 855194986, 855356574, 855432391, 855465949, 855568409, 855736494, 855842590, 855870128, 855950415, 856126249, 856306434, 856390178, 856399179, 856479228, 856657386, 856785715, 856829703, 856941164, 857148051, 857289255, 857304811, 857334971, 857493162, 857680142, 857742906, 857711911, 857730627, 857813835, 857837915, 857753038, 857662857, 857685626, 857736707, 857665479, 857539475, 857508004, 857582152, 857583821, 857411623, 857226551]
2319.1H57226551q9765p2360j86980k96771k00808k1458q6188l52741m05132j71364
2339.5H55342984k2828o1274N3287K45750J37746k02179n06282m72844j40667P7069
2359.9H54450762n7697k40862n0247K88606K76267M947k2828K72155L80754R4652j36375
2382.3H55260134j3352J73450O8545k21670k95639p5995N8054j06632l09289k45988
2402.7H54291618k9147l9220k87711l75271j95325q5413k39611m18365l48091j49786
2423.1H52123678j48654l67165m57704k72751j45435l03865m97818m16696j74224j67251
2443.5H49172115m18365n15997l25680j83523l01778m50551l83616j97947j80304l89039
2463.9H45825315n00441l24667j46746k19703l71814l35276j71602j80780l62695m18782
$$ y = [857226551, 857136786, 857064426, 856877446, 856580675, 856379867, 856358409, 856272221, 855919480, 855514348, 855342984, 855320156, 855258882, 855312169, 855557919, 855695665, 855493486, 854987204, 854514360, 854373693, 854450762, 854393065, 854152203, 854101956, 854390562, 854666829, 854671776, 854648948, 854921103, 855301857, 855396509, 855260134, 855246782, 855420232, 855488777, 855267107, 854971468, 854895473, 854953527, 854846895, 854537606, 854291618, 854262471, 854223251, 853935540, 853560269, 853364944, 853279531, 853039920, 852621555, 852273464, 852123678, 851975024, 851607859, 851150155, 850877404, 850731969, 850428104, 849930286, 849513590, 849339366, 849172115, 848753750, 848237753, 847912073, 847728550, 847426772, 846976221, 846592605, 846394658, 846214354, 845825315, 845324874, 845000207, 844853461, 844633758, 844261944, 843926668, 843755066, 843574286, 843211591, 842792809]
2484.3H42792809k68161j32501k01881l36528k85149r2506l2485j82688k86460j88768
2504.7H40785682p9989j34349k52605k57194j51217j09672k22862l24130k65658j76549
2525.1H38811457k32160l82781m18782k96295k19583l28303m67658m24504k87533k91586
2545.5H35462272m33624m71651l34919k57313l72648m76539l84093k63393l10719m14013
2565.8H31743360l73662k46823k31147l64482m76420l99411k43008k38597l58105l86774
2586.2H28424931k93732k15709k29061k82764k71976j93537j79290l02971l75271k76565
2606.6H25804055k05219l06666m67002m89056l93808m12941n75781o45995n46217m83275
2627H21278095n78522o92010o92308o23942o26683p46548q05497o71506n47707o46830
$$ y = [842792809, 842524648, 842392147, 842190266, 841853738, 841568589, 841476083, 841443598, 841260910, 840974450, 840785682, 840705693, 840571344, 840318739, 840061545, 839910328, 839800656, 839577794, 839253664, 838988006, 838811457, 838579297, 838196516, 837777734, 837481439, 837261856, 836933553, 836465895, 836041391, 835753858, 835462272, 835028648, 834556997, 834222078, 833964765, 833592117, 833115578, 832731485, 832468092, 832157373, 831743360, 831369698, 831122875, 830891728, 830527246, 830050826, 829651415, 829408407, 829169810, 828811705, 828424931, 828131199, 827915490, 827686429, 827403665, 827131689, 826938152, 826758862, 826455891, 826080620, 825804055, 825598836, 825292170, 824825168, 824336112, 823942304, 823529363, 822953582, 822307587, 821761370, 821278095, 820699573, 820007563, 819315255, 818691313, 818064630, 817318082, 816512585, 815841079, 815293372, 814646542]
2647.4H14646542q07524p64250n84364n44012o62267p23422o37650n29409n77628p10488
2667.8H08105528o72936m96328m45783n53191o29961n72980m60863m69148n74350n55635
2688.2H02674353m27484m18067n84066p15554o31392m99606n62906p17521p22528n90562
2708.6G96804667n55218o92129p58529o18517m75883n24998o88195o86944m85778l99887
2729G90918589n41985o53625n02407k92063l81649o19590n98610l54290k54452m23729
2749.4G86296189n95391n09500k90990k83122m84765m99189k67446j94609l84986n16117
2769.8G82270074m03881k54512l86477o81459p30515n11765l65019n03838p52986p89523
2790.2G76890099o44624o62446q82030j000225r28760q77380j028717j230061j212180
$$ y = [814646542, 813839018, 813074768, 812490404, 811946392, 811284125, 810560703, 809923053, 809393644, 808816016, 808105528, 807432592, 806936264, 806490481, 805937290, 805307329, 804734349, 804273486, 803804338, 803229988, 802674353, 802246869, 801828802, 801244736, 800529182, 799897790, 799398184, 798835278, 798117757, 797395229, 796804667, 796249449, 795557320, 794798791, 794180274, 793704391, 793179393, 792491198, 791804254, 791318476, 790918589, 790376604, 789722979, 789220572, 788928509, 788546860, 787927270, 787328660, 786974370, 786719918, 786296189, 785700798, 785191298, 784900308, 784617186, 784132421, 783633232, 783365786, 783171177, 782786191, 782270074, 781866193, 781611681, 781225204, 780543745, 779813230, 779301465, 778936446, 778432608, 777679622, 776890099, 776245475, 775583029, 774700999, 773700774, 772772014, 771894634, 770865917, 769635856, 768423676]
2808.6G68423676j073539j109421j317859j401961j278519j232326j409769j595259
2824.9G58005023j590371j482248j496077j675427j786590j722097j784921k127230
2841.2G44340062k450228k512633k426148k452850k507031k292931j880110j623749
2857.5G26194382j762092k140940k428233k611757k912700l284096l486753l528476
2873.8G04039335l538549l474712l280461k933919k422452j926005j583755j258254
2890.1F83621228q24988m32670l79741o18995p10368o21199p28369j054466j368403
2908.5F76882029j577497j794338k200842k659977k818465k646565k318084j924038
2924.8F58942223j404226p04348j0550O09100J276731K012193K728164L291905L605664
$$ y = [768423676, 767350137, 766240716, 764922857, 763520896, 762242377, 761010051, 759600282, 758005023, 756414652, 754932404, 753436327, 751760900, 749974310, 748252213, 746467292, 744340062, 741889834, 739377201, 736951053, 734498203, 731991172, 729698241, 727818131, 726194382, 724432290, 722291350, 719863117, 717251360, 714338660, 711054564, 707567811, 704039335, 700500786, 697026074, 693745613, 690811694, 688389242, 686463237, 684879482, 683621228, 682796240, 682363570, 681983829, 681364834, 680654466, 680033267, 679304898, 678250432, 676882029, 675304532, 673510194, 671309352, 668649375, 665830910, 663184345, 660866261, 658942223, 657537997, 656833649, 656823099, 657432199, 658708930, 660721123, 663449287, 666741192, 670346856]
2943.2F70346856L684044L674686L776967L914178L792941L590644L626764L706217
2959.5G00113297L562927L271937L054202K927780K780080K644837K594351K564013
2975.8G23513424K522648K420902K151847J910031J843452J758695J623571J455545
2992.1G39200115J195014R57429O91712L77774K38717J66356k443j06991j23024k70188
3012.5G42324471o16729r87589j188994j198172j144231j234531j420021j406789j267671
3030.9G31859744j267016j506508j766920j655221j427114j550138j827955j903117
3047.2G18955755j797199j775444j882076j917839j916945j931190j893580j837313
3063.5G04004169j755894j776874j985729k104222j979053j725912j596272j784504
$$ y = [670346856, 674030900, 677705586, 681482553, 685396731, 689189672, 692780316, 696407080, 700113297, 703676224, 706948161, 710002363, 712930143, 715710223, 718355060, 720949411, 723513424, 726036072, 728456974, 730608821, 732518852, 734362304, 736120999, 737744570, 739200115, 740395129, 741352558, 742044270, 742422044, 742660761, 742827117, 742824674, 742717683, 742594659, 742324471, 741707742, 740720153, 739531159, 738332987, 737188756, 735954225, 734534204, 733127415, 731859744, 730592728, 729086220, 727319300, 725664079, 724236965, 722686827, 720858872, 718955755, 717158556, 715383112, 713501036, 711583197, 709666252, 707735062, 705841482, 704004169, 702248275, 700471401, 698485672, 696381450, 694402397, 692676485, 691080213, 689295709]
3079.8F89295709k038300k071679k001166j974583k033889k157926k156675j961053
3096.1F72900438j775086j820743k021789k022565j795470j734317j947343j970887
3112.4F57812238j698315j642108j864374k106249k241791k158045j963199j851618
3128.8F42286539j865208j904070j817406j651704j658559j898348k068877j991332
3145.1F27431035j835465j632095j451611j667440k059221k036632j779973j699031
3161.4F13269567j739501j734853j666785j619279j620769j643479j660943j620770
3177.7E99963188j560271j581430j634181j584589j453817j415074j502096j549483
3194E87682247j498163j453638j452326j447976j426697j370728j329124j342118j330375
$$ y = [689295709, 687257409, 685185730, 683184564, 681209981, 679176092, 677018166, 674861491, 672900438, 671125352, 669304609, 667282820, 665260255, 663464785, 661730468, 659783125, 657812238, 656113923, 654471815, 652607441, 650501192, 648259401, 646101356, 644138157, 642286539, 640421331, 638517261, 636699855, 635048151, 633389592, 631491244, 629422367, 627431035, 625595570, 623963475, 622511864, 620844424, 618785203, 616748571, 614968598, 613269567, 611530066, 609795213, 608128428, 606509149, 604888380, 603244901, 601583958, 599963188, 598402917, 596821487, 595187306, 593602717, 592148900, 590733826, 589231730, 587682247, 586184084, 584730446, 583278120, 581830144, 580403447, 579032719, 577703595, 576361477, 575031102]
3212.4E75031102j276195j215041j198173j293420j367510j261174j149238j121401
3228.7E65148950r69708q54016j101851j380444j338601j179814j019359q54254q90433
3247.1E55560470j083613j082659r05513q31664r25600j007021r44436q37743p67052
3265.4E47175169o44028n13137o07431q39710r67681r63450q69214p69139p25984p41720
3285.8E39533675o78242m83155m59730o93739r18567j031041r66370o79910m47214
3304.2E33175707n79536r58502j252711j305759j164913j042962j025141r80138q51095
3322.5E24014950q09849j039624j277864j235485j092553r59635q61466j013040j249969
3340.9E14475465j286149j286090j218617j037836j148104j486957j537502j302779
$$ y = [575031102, 573754907, 572539866, 571341693, 570048273, 568680763, 567419589, 566270351, 565148950, 564179242, 563325226, 562223375, 560842931, 559504330, 558324516, 557305157, 556450903, 555560470, 554476857, 553394198, 552488685, 551657021, 550731421, 549724400, 548779964, 547942221, 547175169, 546531141, 546018004, 545410573, 544570863, 543603182, 542639732, 541770518, 541001379, 540275395, 539533675, 538855433, 538372278, 537912548, 537218809, 536300242, 535269201, 534302831, 533622921, 533175707, 532596171, 531637669, 530384958, 529079199, 527914286, 526871324, 525846183, 524866045, 524014950, 523205101, 522165477, 520887613, 519652128, 518559575, 517599940, 516738474, 515725434, 514475465, 513189316, 511903226, 510684609, 509646773, 508498669, 507011712, 505474210, 504171431]
3357.2E04171431j145661j198411j239896j045704r00775j163542j578510j617044
3373.5D94281888j316458j109600j064241j100063j103461r30309n96673l12686m53174
3391.9D86295223q95917r61691m92722k02298n93066j045615q99464n38409m15116
3410.2D80250925m76360o18607o49333m46916k82526k70963j78635M0323J91897J18822
3430.6D77678627J20282L05980J77205k15292k71231M2558L21507M09752L89874M07219
3451D79366481M98355O28084P77512Q28505O72311O61373J000911J147657P47741K73615
3471.4D86602545L31014P09087R80735R50247O79373O83845R19133R02742Q11100Q99524
3491.8D94469345J029282J088560R91792R17524R67592Q54790O96063Q27014J165390
$$ y = [504171431, 503025770, 501827359, 500587463, 499541759, 498640984, 497477442, 495898932, 494281888, 492965430, 491855830, 490791589, 489691526, 488588065, 487657756, 487061083, 486748397, 486295223, 485399306, 484437615, 483944893, 483742595, 483149529, 482103914, 481204450, 480666041, 480250925, 479774565, 479155958, 478506625, 478059709, 477777183, 477506220, 477327585, 477367908, 477559805, 477678627, 477798909, 478104889, 478282094, 478066802, 477795571, 477838129, 478159636, 478569388, 478959262, 479366481, 479864836, 480492920, 481270432, 482098937, 482771248, 483432621, 484433532, 485581189, 486328930, 486602545, 486933559, 487642646, 488623381, 489573628, 490253001, 490936846, 491855979, 492758721, 493569821, 494469345, 495498627, 496587187, 497578979, 498496503, 499464095, 500318885, 501014948, 501841962, 503007352]
3510.2E03007352J425684J281977R25540R05931J208783J438558J235306Q96335R76860
3528.5E13302326J297593J485110J526534J430035J284599J374066J539588J478970
3544.8E24718821J267731J225233J372278J513600J653970J765966J786709J694262
3561.1E36998570J437485J364768K028644K672612K475679K178550K207518K348244
3577.5E53712070K560496K725542K576947K281666K408147K895593K896309K732098
3593.8E74788868K892793L126979L152132L057062K850652K623975K755463L018141
3610.1E98266065L086031L112197K944529L043592L658175L529131K702356K030492
3626.4F22372568K383589L579021L600597L157556K941490K831637K763510K534032
$$ y = [503007352, 504433036, 505715013, 506640553, 507546484, 508755267, 510193825, 511429131, 512325466, 513302326, 514599919, 516085029, 517611563, 519041598, 520326197, 521700263, 523239851, 524718821, 525986552, 527211785, 528584063, 530097663, 531751633, 533517599, 535304308, 536998570, 538436055, 539800823, 541829467, 544502079, 546977758, 549156308, 551363826, 553712070, 556272566, 558998108, 561575055, 563856721, 566264868, 569160461, 572056770, 574788868, 577681661, 580808640, 583960772, 587017834, 589868486, 592492461, 595247924, 598266065, 601352096, 604464293, 607408822, 610452414, 614110589, 617639720, 620342076, 622372568, 624756157, 628335178, 631935775, 635093331, 638034821, 640866458, 643629968, 646164000]
3642.7F46164000K038181J678586K442539L649592L291249K688945K979159L088474
3659F68020725K508521K065301J876891J512051J411378J924992J797199J688957K491355
3677.4F85297370K689183K378940K054334J658022J428426J573860J961232K120554
3693.7G01161921J865625J369596J008212J181424J534581J288951O87480M75526J181006
3712.1G11754322J885295J616895J056433P39992P06851Q04424R65715R92238O27101
3730.4G21149266K47299N18084J405180J588225P29740k01941J8775Q57950M94420
3748.8G26806998M24385J426697J561403R91583Q35061R94444P66158M77612N19336
3767.1G34803677O48617Q45552R59635Q03411N34653L85404M43697M96089O04570P13051
$$ y = [646164000, 648202181, 649880767, 652323306, 655972898, 659264147, 661953092, 664932251, 668020725, 670529246, 672594547, 674471438, 675983489, 677394867, 679319859, 681117058, 682806015, 685297370, 687986553, 690365493, 692419827, 694077849, 695506275, 697080135, 699041367, 701161921, 703027546, 704397142, 705405354, 706586778, 708121359, 709410310, 710097790, 710573316, 711754322, 713639617, 715256512, 716312945, 717052937, 717759788, 718564212, 719529927, 720522165, 721149266, 721396565, 721914649, 723319829, 724908054, 725637794, 725435853, 725454628, 726312578, 726806998, 727231383, 728658080, 730219483, 731211066, 732046127, 733040571, 733806729, 734284341, 734803677, 735452294, 736297846, 737257481, 738060892, 738595545, 738980949, 739424646, 739920735, 740525305, 741238356]
3787.5G41238356O39259M87626L12269K08974J47521k4199K60651P78794O38902O69003
3807.9G45357156Q74340N54741j7405j29103J38044J77026P19547J023293N80549L21507
3828.3G49599695K69354K50518K27034J6332L5286N18620Q22842Q78274O47307L039
3848.7G53268301q57710r48251P98643J525998P94113J07348j05798K13027K57611
3867.1G55053282K3603L58582P07984P18355M50194L0517J33098L60131L75867M07397
3887.5G58619010J89782J62780M42624K92420j99556m24802j47462L76820Q45194Q63850
3907.9G61020660N24104K26915j7881k05279o5029J90795K11894K55406L54469J67847
3928.3G62663901n3764J76549M57943K96116K8431j05500l9339J92821K44617J63556
$$ y = [741238356, 741877615, 742365241, 742677510, 742886484, 743034005, 743009806, 743270457, 744049251, 744688153, 745357156, 746231496, 746786237, 746768832, 746639729, 746777773, 746954799, 747674346, 748697639, 749278188, 749599695, 749869049, 750119567, 750346601, 750362933, 750398219, 750916839, 751739681, 752617955, 753265262, 753268301, 752410591, 751462340, 752260983, 753786981, 754581094, 754688442, 754582644, 754795671, 755053282, 755076885, 755435467, 756143451, 756861806, 757312000, 757342517, 757475615, 757835746, 758211613, 758619010, 758808792, 758971572, 759414196, 759706616, 759507060, 759082258, 758934796, 759311616, 760156810, 761020660, 761544764, 761771679, 761753798, 761548519, 761483490, 761674285, 761886179, 762141585, 762496054, 762663901, 762610137, 762786686, 763244629, 763540745, 763569176, 763463676, 763424337, 763617158, 763861775, 764025331]
3948.7G64025331K21252L02553K08140M2736L9995J61409K26081J67966J00433J29164
3969.1G65625060J41561Q8691N8413M9889P3314K07007K79784J35243n37J1862O3955
3991.5G66734242Q5831J32918K06054
3997.6G67159045
$$ y = [764025331, 764246583, 764549136, 764757276, 764800012, 764840007, 765001416, 765227497, 765395463, 765495896, 765625060, 765766621, 765855312, 765913725, 765963614, 766036928, 766243935, 766523719, 766658962, 766658425, 766670287, 766734242, 766820073, 766952991, 767159045]
##END=$$ End of the data block
