##TITLE=$$ Begin of the data block
##JCAMP-DX=5.00 $$ ACD/SpecManager v 10.08
##SPECTROMETER/DATA SYSTEM=Alpha
##DATE=22 Dec 2014 10:36:42
##DATA TYPE=INFRARED SPECTRUM
##DATA CLASS=XYDATA
##ORIGIN=
##OWNER=
##NPOINTS=1765
##FIRSTX=399.76428223
##LASTX=3997.64306641
##MAXX=3997.64306641
##MINX=399.76428223
##MAXY=0.84504569
##MINY=0.31710833
##XFACTOR=1.0000000000
##YFACTOR=1.000000000000000e-9
##FIRSTY=0.62521309
##DELTAX=2.03961372
##XUNITS=1/CM
##YUNITS=ARBITRARY UNITS
##XYDATA=(X++(Y..Y))
399.8F25213087l024340l233612l366291j583994J302541K324998J217008K33233q4877
418.1F18997753m84884j291275k291143k769291k421439k060056k417266l046274k702833
436.5E99513292q58009J693309L600836L931462L161133K583146K598822K149403N87285
454.8F18960679q52764j027763o40154j005113k175987l340125l346681k586961k327264
473.2F01657867k632021k712846j795411m12703k8729p00713q67605J8716N83112l70919
493.6E92738748j865626k318263j768172j175403j541138k854943l596127l036976
509.9E74582100k602100l315807m407883m652321l760576k772212k384007j942992
526.2E48744202o92845O60360J270890J651109K817452M463315N282104M768490L329933
$$ y = [625213087, 622188747, 618955135, 615588844, 614004850, 615307391, 617632389, 618849397, 619082630, 618997753, 618512869, 617221594, 614930451, 612161160, 609739721, 607679665, 605262399, 602216125, 599513292, 598655283, 600348592, 603949428, 607880890, 611042023, 613625169, 616223991, 618373394, 618960679, 618107915, 617080152, 616439998, 615434885, 613258898, 609918773, 606572092, 603985131, 601657867, 599025846, 596313000, 594517589, 594104886, 594076157, 593375444, 592507839, 592526555, 593109667, 592738748, 590873122, 588554859, 586786687, 585611284, 584070146, 581215203, 577619076, 574582100, 571980000, 568664193, 564256310, 559603989, 555843413, 553071201, 550687194, 548744202, 548051357, 548711717, 549982607, 551633716, 554451168, 558914483, 564196587, 568965077, 572295010]
544.6E72295010J595020K22743o11305j248896j924277k702713l552973m257858m798531
562.9E55016220n554259o605983p068932n953729l568411j053393R80556K821982M981458
581.3E33995509O917179P332504O014227M181087L093541K467394J396239m2737q15928
599.6E64539015k66969N59986M38869j55509L5823J150310K158761K395451K321779
618E73177516K758384L764153M389584L943503K971112K428592K565741K594173J900315
636.4F00493073J027942Q65996J249075J415670J260936J008511Q77917R99450J224101
654.7F10422671J265049R54866O25611O90102R04381J407624J841664R95576Q27909
673.1F19935453J512527J874447J504123Q99733Q13841J307249J473189O28292n88119
$$ y = [572295010, 573890030, 574112773, 573501468, 572252572, 570328295, 567625582, 564072609, 559814751, 555016220, 549461961, 542855978, 535787046, 529833317, 526264906, 525211513, 526192069, 529014051, 533995509, 540912688, 548245192, 554259419, 558440506, 561534047, 564001441, 565397680, 565354943, 564539015, 564272046, 564832032, 565270901, 565115392, 565151215, 566301525, 568460286, 570855737, 573177516, 575935900, 579700053, 584089637, 588033140, 591004252, 593432844, 595998585, 598592758, 600493073, 601521015, 602387011, 603636086, 605051756, 606312692, 607321203, 608199120, 609198570, 610422671, 611687720, 612642586, 613268197, 613958299, 614862680, 616270304, 618111968, 619107544, 619935453, 621447980, 623322427, 624826550, 625726283, 626540124, 627847373, 629320562, 629948854, 629360735]
691.4F29360735j083552r20594j242817k511561l586888l236055j841903o86765j92642
709.8F14057958M91023K133310L998518M820585M633069M500151N155504N915344N543470
728.1F51248932M198551L179789L094434L242553K528727R45031l47733p55191j148760
746.5F66186333k316773l734112m491150m479230m215121m037559l665686k745986
762.8F36500716j200199Q50499K939045M690111O043255P056534P803083P990718P207870
781.2F79881632N803168M622340M147351M066408L617287K896904K745331L505230
797.5G11285651M416108M269659L045023K064645K156377K536952K061487Q09431N1915
815.8G32697248M90904J040936K61068j407683k363264k296090k447844l673434n132377
$$ y = [629360735, 628277183, 627356589, 626113772, 623602211, 620015323, 616779268, 614937365, 614250600, 614057958, 614548981, 616682291, 620680809, 625501394, 630134463, 634634614, 639790118, 645705462, 651248932, 655447483, 658627272, 661721706, 664964259, 667492986, 668438017, 668090284, 667335093, 666186333, 663869560, 660135448, 655644298, 651165068, 646949947, 642912388, 639246702, 636500716, 635300517, 636151016, 639090061, 643780172, 649823427, 656879961, 664683044, 672673762, 679881632, 685684800, 690307140, 694454491, 698520899, 702138186, 705035090, 707780421, 711285651, 715701759, 719971418, 723016441, 725081086, 727237463, 729774415, 731835902, 732645333, 732697248, 733188152, 734229088, 734490156, 733082473, 730719209, 728423119, 725975275, 722301841, 717169464]
834.2G17169464n429030m467368l592730l725230m130244l688634k751172k536773
850.5F86848283l267467m125953m253507l324806j353920J611412M999637P841587
866.8F84975266R702385J0298967R287775P176757M832148K512455J70231k075374
883.2G26880610l943324n080819n347669n059481m718959m553616m402757m088760
899.5F89685225l850698m147768n087912o298721p226229p760644q356332r088874
915.8F37868047r222985q029282n785644l583669k130628j159370J1325J473606K665102
934.1F12106502L307283L833652M657566N187690M090429R88066k880752o210447q808612
952.5F16271377j1076570j3020813j4298022j5061557j5868545j6975582j8145442
$$ y = [717169464, 711740434, 707273066, 703680336, 699955106, 695824862, 692136228, 689385056, 686848283, 683580816, 679454863, 675201356, 671876550, 670522630, 672134042, 677133679, 684975266, 694677651, 704976618, 714264393, 721441150, 726273298, 728785753, 728955984, 726880610, 722937286, 717856467, 712508798, 707449317, 702730358, 698176742, 693773985, 689685225, 685834527, 681686759, 676598847, 670300126, 663073897, 655313253, 646956921, 637868047, 628645062, 620615780, 614830136, 611246467, 609115839, 607956469, 607967794, 609441400, 612106502, 615413785, 619247437, 623905003, 629092693, 633183122, 634171188, 631290436, 625079989, 616271377, 605194807, 592173994, 577875972, 562814415, 546945870, 529970288, 511824846]
966.8E11824846j9060850j9738495k0283461k0596742k0430506j9528866j7792373
981.1C74393553j5360892j2575299r787172p242948n026310l097088j483708l23326
997.4C19496810L53575O33329N78761K22534l47554r66162j336425j128227l98308
1015.7C17108333N28485J432091K267211L075481L827810M336149M463046M227817
1032C41266423L719628L032595K170652J349867R23037J004517J476527K178967L155559
1050.4C60277772M516005O137193P771283R154588J0203630J1088103J1269897R081096
1066.7D29499567L226131m884839j1137098j2341649r265601m956961j321554J416534
1083C90234530L496975N021661O100834O844222P144869O763339N604505L907710K210647
$$ y = [511824846, 492763996, 473025501, 452742040, 432145298, 411714792, 392185926, 374393553, 359032661, 346457362, 336670190, 329427242, 324400932, 321303844, 319820136, 319496810, 319850385, 320483714, 321062475, 321285009, 320937455, 319971293, 318634868, 317506641, 317108333, 317636818, 319068909, 321336120, 324411601, 328239411, 332575560, 337038606, 341266423, 344986051, 348018646, 350189298, 351539165, 352462202, 353466719, 354943246, 357122213, 360277772, 364793777, 370930970, 378702253, 387856841, 398060471, 409148574, 420418471, 429499567, 432725698, 427840859, 416703761, 404362112, 395096511, 390139550, 388817996, 390234530, 393731505, 398753166, 404854000, 411698222, 418843091, 425606430, 431210935, 435118645, 437329292]
1101.4D37329292J171172J139194K007633L262907M232586M536986M168123L418565
1117.7D61266458K667785K115220J892089K181381L051103M189014M686207L662943
1134D85712200J148880k034992n003721p232278q525074q860945q252710o862581n065769
1152.4D35023010l262550j585603J23412K023101M085600O162435Q203000J0228455
1168.7D61000860J2143850J3598770J4246196J4172256J3874351J3611675J3096571
1183E55744529J2005329J0379136Q608937O962180N315185L616631K225279J540363
1199.3F06397569J518548J757085K002120K375782L041207L872693M485965M549741
1215.6F30000710M029990L145098K148986J143337J34289p85411j412868j633346j570583
$$ y = [437329292, 438500464, 439639658, 441647291, 444910198, 449142784, 453679770, 457847893, 461266458, 463934243, 466049463, 467941552, 470122933, 473174036, 477363050, 482049257, 485712200, 486861080, 484826088, 479822367, 472590089, 464065015, 455204070, 446951360, 440088779, 435023010, 431760460, 430174857, 430298269, 432321370, 436406970, 442569405, 450772405, 461000860, 473144710, 486743480, 500989676, 515161932, 529036283, 542647958, 555744529, 567749858, 578128994, 586737931, 593700111, 599015296, 602631927, 604857206, 606397569, 607916117, 609673202, 611675322, 614051104, 617092311, 620965004, 625450969, 630000710, 634030700, 637175798, 639324784, 640468121, 640602410, 639816999, 638404131, 636770785, 635200202]
1234F35200202j454770j391709j270950q46803l4809Q34584J340628J492798J583338
1252.3F35452509J732230J702786J250863O86049N78106J021325J584947J782596J564861
1270.7F47356272J264810R94146N40257j63615q00610r72986p56860o46114r08077
1289F45907223j305818j487792j439035j466572j730204j948654j807273j481771j334608
1307.4F31905496j366854j375019j212657r94503j008690j311183j868724k637267
1323.7F20130599l487409m285574m829883m891277m401266l507078k375364j111090
1340E91241658j44303K36213L52919L49283J23442k93851p02560q92759r71674j097143
1360.4E88201225j110256q54373n99503k95937R4890L37780O54220R81212J110971
$$ y = [635200202, 633745432, 632353723, 631082773, 630235970, 630201161, 631035745, 632376373, 633869171, 635452509, 637184739, 638887525, 640138388, 640824437, 641402543, 642423868, 644008815, 645791411, 647356272, 648621082, 649615228, 650155485, 649991870, 649191260, 648218274, 647461414, 646815300, 645907223, 644601405, 643113613, 641674578, 640208006, 638477802, 636529148, 634721875, 633240104, 631905496, 630538642, 629163623, 627950966, 626956463, 625947773, 624636590, 622767866, 620130599, 616643190, 612357616, 607527733, 602636456, 598235190, 594728112, 592352748, 591241658, 591097355, 591333568, 591686487, 592035770, 592159212, 591865361, 591162801, 590270042, 589298368, 588201225, 587090969, 586236596, 585637093, 585341156, 585436046, 585773826, 586428046, 587409258, 588520229]
1378.8E88520229J124620J257837K017081L584027M419327L338397J769900N74112
1395.1F06605530j21653l79920o16491j188755j663983j618981j464367j451373j535774
1413.5E96564233j652419j423180m05968L49939M52459O17802Q18253J230717J554608
1431.8E98106444J299143J476645K255500K112865J671493J196027N42879M1723l86059
1450.2F08316660j030505j727998k225399j254797M01199J062214K239406L772259
1466.5F09553039M239619N150676Q083582R633600Q495868P355749O732226O374895
1482.8F65619254N510509M769147M969060N420983M416942L445566L656209L747940
1499.1G01555610L017425J919031J298488K516567L320396K494395J831412J377881
$$ y = [588520229, 589644849, 590902686, 592919767, 596503794, 600923121, 604261518, 606031418, 606605530, 606483877, 606103957, 605487466, 604298711, 602634728, 601015747, 599551380, 598100007, 596564233, 594911814, 593488634, 593082666, 593432605, 593885064, 594502866, 595321119, 596551836, 598106444, 599405587, 600882232, 603137732, 605250597, 606922090, 608118117, 608660996, 608702719, 608316660, 607286155, 605558157, 603332758, 602077961, 602479160, 603541374, 605780780, 609553039, 613792658, 618943334, 627026916, 636660516, 645156384, 652512133, 659244359, 665619254, 671129763, 675898910, 680867970, 686288953, 690705895, 694151461, 697807670, 701555610, 704573035, 706492066, 707790554, 710307121, 713627517, 716121912, 717953324, 719331205]
1515.4G19331205J315176J208663J458884J936435J773179J565039J070738N70774
1531.8G30230093P92325P92861k06113o22332O35027J341582J053929K88308k53022
1550.1G34052658l27051m87029j043141j255274M20094Q65340K3007m88996p23601
1568.5G31036007m82082l24547p35998o86407k30849m39465q32558j005054j159310
1586.8G25139737j382589j638472j831591j953841k006948k148688k466440k700269
1603.2G09010899k814472k963483l154576l294527l538847m088700m091382k976358
1619.5F82088554k868950l332973l003776k689123k515972k278030k369702k025842
1635.8F61004186m98891J50978l039k08021K26796J448691J349985J483739L906548
$$ y = [719331205, 720646381, 721855044, 723313928, 725250363, 727023542, 728588581, 729659319, 730230093, 731022418, 731815279, 731609166, 730986834, 731621861, 732963443, 734017372, 734305680, 734052658, 733725607, 733238578, 732195437, 730940163, 731360257, 732225597, 732248604, 731759608, 731036007, 730553925, 730229378, 729493380, 728806973, 728576124, 728136659, 727304101, 726299047, 725139737, 723757148, 722118676, 720287085, 718333244, 716326296, 714177608, 711711168, 709010899, 706196427, 703232944, 700078368, 696783841, 693244994, 689156294, 685064912, 682088554, 679219604, 675886631, 672882855, 670193732, 667677760, 665399730, 663030028, 661004186, 660505295, 660656273, 660653234, 660445213, 660672009, 662120700, 663470685, 664954424, 668860972]
1654.1F68860972L882706K819657K786041L469944L939748L224551L238559M279792
1670.5F96501970M108191M140973M665434L925383K966106L053785N018532N057633
1686.8G29438007L728568L422559K644598K143741K229452K313733K951384K445638
1703.1G51317680J769960J961231J805782J285494Q24272P35104J562834K209008J676023
1721.5G65147388J371920J555085J469493J176536R52244J598656K450586J826286
1737.8G77548194J488566J706183J708329J536250J496852K050221K709031K368271
1754.1G92611897J875281J699984J471401J605153J643836J132906O63876M78864Q91924
1772.4H04075122J507819J337349Q71003O88612P71463Q54790Q01504M31716J26422
$$ y = [668860972, 672743678, 675563335, 678349376, 681819320, 685759068, 688983619, 692222178, 696501970, 700610161, 704751134, 709416568, 713341951, 716308057, 719361842, 724380374, 729438007, 733166575, 736589134, 739233732, 741377473, 743606925, 745920658, 748872042, 751317680, 753087640, 755048871, 756854653, 758140147, 758964419, 759699523, 761262357, 763471365, 765147388, 766519308, 768074393, 769543886, 770720422, 771672666, 773271322, 775721908, 777548194, 779036760, 780742943, 782451272, 783987522, 785484374, 787534595, 790243626, 792611897, 794487178, 796187162, 797658563, 799263716, 800907552, 802040458, 802704334, 803183198, 804075122, 805582941, 806920290, 807791293, 808479905, 809251368, 810106158, 810907662, 811339378, 811465800]
1790.8H11465800N65529R90271P86841N51403O14643Q15689P75338N52713M15087N24223
1811.2H18057537O57857N93781N20945N07950L22462Q3565J46151K82705M19020O86527
1831.6H22278500N90384L22699L23892K76446o7353j72377L31939O26623M90248K65181
1852H25266182J00077Q5055J56224K09332J28865j03891l37362j00494N48840O23405
1872.4H26576233K80738J76906K61426K47240J53184J18256R7096J14739K86937K88009
1892.8H28600764J29164J84357K71201J98364N8889k1159p928O1095J58727J19150
1913.2H29752624r0301j38998O5446J31369J59800K73406K15411P4268J8239M8220
1933.6H30509484R1791P3373m6313j04546R9242K58743J99199J48118J30951J19746
$$ y = [811465800, 812031329, 813021600, 813808441, 814359844, 814974487, 815790176, 816565514, 817118227, 817533314, 818057537, 818715394, 819309175, 819830120, 820338070, 820660532, 820744097, 820890248, 821172953, 821591973, 822278500, 822868884, 823191583, 823515475, 823791921, 823724568, 823552191, 823884130, 824510753, 825001001, 825266182, 825366259, 825451314, 825607538, 825816870, 825945735, 825841844, 825504482, 825403988, 825952828, 826576233, 826856971, 827033877, 827295303, 827542543, 827695727, 827813983, 827911079, 828025818, 828312755, 828600764, 828729928, 828914285, 829185486, 829383850, 829442739, 829421580, 829413652, 829474747, 829633474, 829752624, 829662323, 829523325, 829588771, 829720140, 829879940, 830153346, 830368757, 830443025, 830461264, 830509484, 830601275, 830674648, 830628335, 830523789, 830623031, 830881774, 831080973, 831229091, 831360042, 831479788]
1954H31479788J54137J59204J05799Q3744O8307M8936J19566J75477J39057R2209P3134
1976.4H32699358P2361N4121M5537N1797J0490p8141r0659N2869J51754O1154l6955
1998.8H32993686m0293l2901p2301j45972j85728j65939j75655k79188l46839l49105
2019.2H31199765m20987n50151n17607j87576M3869n7459k09927k63036k66790k89321
2039.6H28480780k88069k46585k10285j62124j15276j00016p5341k3484M411n186l7849
2062.1H27220976o1333K444J24335J71304J05083l934l3975R895L8981M3571M5657
2084.5H27663004P5221J09494J22428R7692O0320Q7917J67012J97888J39415O7532
2104.9H28787923P7128J30415J04368K8670J9729Q0585J09971N3108j2934m292M4346
$$ y = [831479788, 831633925, 831793129, 831898928, 831982672, 832050979, 832099915, 832219481, 832394958, 832534015, 832626224, 832699358, 832771719, 832825840, 832871377, 832923174, 832933664, 832855523, 832764864, 832817733, 832969487, 833030641, 832993686, 832953393, 832920492, 832848191, 832702219, 832516491, 832350552, 832174897, 831895709, 831548870, 831199765, 830778778, 830228627, 829711020, 829523444, 829567313, 829509854, 829299927, 829036891, 828770101, 828480780, 828192711, 827946126, 827735841, 827573717, 827458441, 827358425, 827283084, 827259600, 827264011, 827258825, 827220976, 827159643, 827162087, 827286422, 827457726, 827562809, 827558875, 827524900, 827534795, 827573776, 827617347, 827663004, 827738225, 827847719, 827970147, 828067839, 828128159, 828216076, 828383088, 828580976, 828720391, 828787923, 828865051, 828995466, 829099834, 829128504, 829148233, 829228818, 829338789, 829391897, 829378963, 829374671, 829419017]
2127.3H29419017L2186l3795m2856L1948O9737K7538n901J2040P4685J09136L7312
2149.8H29731047j5855Q0467J87635J79827J32025J48236K20776K58803K51651K69651
2170.2H31444263L19124L70919L95537L56138L15129L26872L52144L60609L29732K90633
2190.6H34861100K84970K85148K86043K97129K91705K66910K60234K77400K83062K84374
2211H37678075L03864L16501K95818K63691K41399K31623K33889K15411J92285J97947
2231.4H40170503K04622J92345J65164J52111J87397K04444J34349Q9347J20104J47044
2251.8H41767430J40965J12534J20163J58727J61648J34766J07586J21653J89782K10464
2272.2H43225718J47104J06454J44779J85728J46747P9393O1632Q7619J09434R5665
$$ y = [829419017, 829451203, 829417408, 829374552, 829406500, 829476237, 829503775, 829497874, 829509914, 829584599, 829693735, 829731047, 829715192, 829795659, 829983294, 830163121, 830295146, 830443382, 830664158, 830922961, 831174612, 831444263, 831763387, 832134306, 832529843, 832885981, 833201110, 833527982, 833880126, 834240735, 834570467, 834861100, 835146070, 835431218, 835717261, 836014390, 836306095, 836573005, 836833239, 837110639, 837393701, 837678075, 837981939, 838298440, 838594258, 838857949, 839099348, 839330971, 839564860, 839780271, 839972556, 840170503, 840375125, 840567470, 840732634, 840884745, 841072142, 841276586, 841410935, 841500282, 841620386, 841767430, 841908395, 842020929, 842141092, 842299819, 842461467, 842596233, 842703819, 842825472, 843015254, 843225718, 843372822, 843479276, 843624055, 843809783, 843956530, 844035923, 844097555, 844185174, 844294608, 844390273]
2292.5H44390273N9128N0545Q3804J01447O2346n424Q583R8169J29283O7532m4823
2315H45000863p8380J5974P6950K4378l1829m768L4451n6207k18570k73288j82509
2337.4H44307065l4451K4199l9577j45138j94311j33216l1829k7538p4684M589N7638
2359.9H43712747m6313k14815k81036j88768j19447j67609k35200k06351j14977p9096
2380.2H42059135j05261j42575j65283j51873j22488j03235j08361j61290k20001k13504
2400.6H40565264j81675j72019j98722k52306k64704k55645k76684l46542m14967l77000
2421H37825000k92480l00109l69907l90470l81171l91662m21465m71353m70162l89337
2441.4H33946884l53933m01497m59253m92096m43817l79204l98755m39525m32849l78370
$$ y = [844390273, 844449401, 844499946, 844583750, 844685197, 844747543, 844742119, 844750702, 844848871, 844978154, 845045686, 845000863, 844922483, 844938457, 845015407, 845039785, 845007956, 845003188, 845037639, 844981432, 844762862, 844489574, 844307065, 844272614, 844296813, 844257236, 844112098, 843917787, 843784571, 843752742, 843725204, 843650520, 843655109, 843712747, 843666434, 843451619, 843170583, 842981815, 842862368, 842694759, 842459559, 842253208, 842138231, 842059135, 841953874, 841811299, 841646016, 841494143, 841371655, 841268420, 841160059, 840998769, 840778768, 840565264, 840383589, 840211570, 840012848, 839760542, 839495838, 839240193, 838963509, 838616967, 838202000, 837825000, 837532520, 837232411, 836862504, 836472034, 836090863, 835699201, 835277736, 834806383, 834336221, 833946884, 833592951, 833191454, 832732201, 832240105, 831796288, 831417084, 831018329, 830578804, 830145955, 829767585]
2461.8H29767585l19064l28123m00126m20511l51727k94328l55005m57704m19855k93076
2482.2H26128066k56658k86043k94149k82228k64585k77340k87712k41160j97649k05576
2502.6H23534966k14160j95980k04623k32041k29001k14874k31684k73645l34143l78251
2523H21026564l31581k83658l76046m82261m58897l88205l69668m24146n00500n28157
2543.4H16883445m78208m08292m32015m91619m61876m21941m48704m87983n14388m84467
2563.8H12253952m22180m02927m04418m23848m39465m15862l87370m06206m64261m57585
2584.2H08029830l84986l46482l36349l22640l24249l12567k81572l06189l65377l84986
2604.6H04664433l80218l87251m15683m60267n13137n67555o12140o46472o83963p41661
$$ y = [829767585, 829448521, 829120398, 828720272, 828299761, 827948034, 827653706, 827298701, 826840997, 826421142, 826128066, 825871408, 825585365, 825291216, 825008988, 824744403, 824467063, 824179351, 823938191, 823740542, 823534966, 823320806, 823124826, 822920203, 822688162, 822459161, 822244287, 822012603, 821738958, 821404815, 821026564, 820694983, 820411325, 820035279, 819553018, 819094121, 818705916, 818336248, 817912102, 817411602, 816883445, 816405237, 815996945, 815564930, 815073311, 814611435, 814189494, 813740790, 813252807, 812738419, 812253952, 811831772, 811428845, 811024427, 810600579, 810161114, 809745252, 809357882, 808951676, 808487415, 808029830, 807644844, 807298362, 806962013, 806639373, 806315124, 806002557, 805720985, 805414796, 805049419, 804664433, 804284215, 803896964, 803481281, 803021014, 802507877, 801940322, 801328182, 800681710, 799997747, 799256086]
2625G99256086q14795q28862p81060q06391q97050r01937q27253q09848q72434r48309
2645.4G90768147r76742r12368q20756p90954q31008q73387q46147p99060p93397q09551
2665.8G82314777p96437p41303p16686p47502p51495p00832o51836o36935o74725p31647
2686.2G75165379p26759o45936o01411p01725q23498q14140p64489p92921q60750r08792
2706.6G67524958r15230q59201p92920q02994q46803q15690p39872p08044p28130p55668
2727G59560406p22885o49691o23881o26624n92828n49197n48363n77330n90980n99802
2747.4G53478825o16848n87583n20766m82380m87924n00798m68135m16517m15981m69267
2767.8G48512626n45442n99444n87762n65946o20425p24315p82550p63177p62880q45015
$$ y = [799256086, 798441291, 797612429, 796831369, 796024978, 795127928, 794225991, 793398738, 792588890, 791716456, 790768147, 789791405, 788879037, 788058281, 787267327, 786436319, 785562932, 784716785, 783917725, 783124328, 782314777, 781518340, 780777037, 780060351, 779312849, 778561354, 777860522, 777208686, 776571751, 775897026, 775165379, 774438620, 773792684, 773191273, 772489548, 771666050, 770851910, 770087421, 769294500, 768433750, 767524958, 766609728, 765750527, 764957607, 764154613, 763307810, 762492120, 761752248, 761044204, 760316074, 759560406, 758837521, 758187830, 757563949, 756937325, 756344497, 755795300, 755246937, 754669607, 754078627, 753478825, 752861977, 752274394, 751753628, 751271248, 750783324, 750282526, 749814391, 749397874, 748981893, 748512626, 747967184, 747367740, 746779978, 746214032, 745593607, 744869292, 744086742, 743323565, 742560685, 741715670]
2788.2G41715670r38893r96113j044511j100242j164258j227736j276434j327455j388550
2806.5G31251478j471758j564085j592338j592696j640141j718163j812935j899004
2822.8G17960358j947880k014458k103269k158523k210796k300680k446711k647340
2839.1G00130701k831697l004015l217280l384590l385007l187657k861201k543808
2855.5F75715446k347826k368331k624810l026843l518522m026294m392147m601836
2871.8F48808837m776239m885316m796625m450798l899395l283680k686858k087295
2888.1F17942631j514971j074314q11339o84678o45638o91890q62360j157821j469373
2906.5F09030247j735926k081215k603591l178179l583670l714800l596663l291667
$$ y = [741715670, 740776777, 739780664, 738736153, 737635911, 736471653, 735243917, 733967483, 732640028, 731251478, 729779720, 728215635, 726623297, 725030601, 723390460, 721672297, 719859362, 717960358, 716012478, 713998020, 711894751, 709736228, 707525432, 705224752, 702778041, 700130701, 697299004, 694294989, 691077709, 687693119, 684308112, 681120455, 678259254, 675715446, 673367620, 670999289, 668374479, 665347636, 661829114, 657802820, 653410673, 648808837, 644032598, 639147282, 634350657, 629899859, 626000464, 622716784, 620029926, 617942631, 616427660, 615353346, 614542007, 613857329, 613211691, 612519801, 611657441, 610499620, 609030247, 607294321, 605213106, 602609515, 599431336, 595847666, 592132866, 588536203, 585244536]
2922.8E85244536k812028k113878j264155l75152N78225J655042K792120L785193M467368
2941.1E91957271M856408N080163N197823N246818N262018N181312N062163N048633
2957.4F32892609N043745M870891M531026M175067L913820L704905L542006L445507
2973.8F66119576L397941L362954L214419K937555K685606K500713K300024K075076
2990.1F88593864J829565J563072J297713R86933O84917M24624J51753n9068j68562
3008.4F95304811l11196o04987r43899j177967j341521j489103j563907j603186j713693
3026.8F84555352j816929j836121j870274k032459k155542k105236k117813k259076
3043.1F68361902k384484k427101k375364k362311k439856k510488k562285k556622
$$ y = [585244536, 582432508, 580318630, 579054475, 578679323, 579257548, 580912590, 583704710, 587489903, 591957271, 596813679, 601893842, 607091665, 612338483, 617600501, 622781813, 627843976, 632892609, 637936354, 642807245, 647338271, 651513338, 655427158, 659132063, 662674069, 666119576, 669517517, 672880471, 676094890, 679032445, 681718051, 684218764, 686518788, 688593864, 690423429, 691986501, 693284214, 694271147, 694956064, 695380688, 695532441, 695473373, 695304811, 694993615, 694388628, 693444729, 692266762, 690925241, 689436138, 687872231, 686269045, 684555352, 682738423, 680902302, 679032028, 676999569, 674844027, 672738791, 670620978, 668361902, 665977418, 663550317, 661174953, 658812642, 656372786, 653862298, 651300013, 648743391]
3059.4F48743391k489865k451181k439439k500713k632618k658010k519846k361119
3075.7F28690600k368211k547026k687991k715289k700210k632856k619148k763271
3092.1F07656598k833426k677441k523958k555371k653837k645254k529740k489209
3108.4E86748362k582252k572656k431750k408505k557754k748549k841890k768576
3124.7E65836430k567172k437830k511681k596616k510369k356112k350688k513707
3141E45992255k606809k530813k398193k242923k163172k339541k573908k547622k409041
3159.4E24180233k336740k277255k243877k231895k203823k181470k158761k129614
3175.7E06416798k118230k090574k066850k056271k019554j995415k000898k008617
$$ y = [648743391, 646253526, 643802345, 641362906, 638862193, 636229575, 633571565, 631051719, 628690600, 626322389, 623775363, 621087372, 618372083, 615671873, 613039017, 610419869, 607656598, 604823172, 602145731, 599621773, 597066402, 594412565, 591767311, 589237571, 586748362, 584166110, 581593454, 579161704, 576753199, 574195445, 571446896, 568605006, 565836430, 563269258, 560831428, 558319747, 555723131, 553212762, 550856650, 548505962, 545992255, 543385446, 540854633, 538456440, 536213517, 534050345, 531710804, 529136896, 526589274, 524180233, 521843493, 519566238, 517322361, 515090466, 512886643, 510705173, 508546412, 506416798, 504298568, 502207994, 500141144, 498084873, 496065319, 494069904, 492069006, 490060389]
3192D90060389k001405j980036j932293j872301j814157j740396j701266j720428j719416
3210.3D73578691j685410j667530j633584j591891j573920j573444j573562j521111
3226.7D60758239j427740j303524j260757j443327j581370j476169j344711j268267
3243D49652374j180738j202822j336068j300037j097977j030088j137822j166016j038522
3261.3D39162284r55403r54538q72612p73043q68976j026541j059472j016200r36508
3279.7D30698991q78960q79258q76427q14736p05629o85603q07881r53883j033932
3298D23062682r66996p60555o23196p73311j091927j241297j192987j122802j067549
3316.4D14222062j007140r49860q70555q72791j070410j211345j146168j064271r78797
$$ y = [490060389, 488058984, 486078948, 484146655, 482274354, 480460197, 478719801, 477018535, 475298107, 473578691, 471893281, 470225751, 468592167, 467000276, 465426356, 463852912, 462279350, 460758239, 459330499, 458026975, 456766218, 455322891, 453741521, 452265352, 450920641, 449652374, 448471636, 447268814, 445932746, 444632709, 443534732, 442504644, 441366822, 440200806, 439162284, 438206881, 437252343, 436379731, 435606688, 434737712, 433711171, 432651699, 431635499, 430698991, 429820031, 428940773, 428064346, 427249610, 426543981, 425858378, 425050497, 424096614, 423062682, 422095686, 421335131, 420711935, 419938624, 418846697, 417605400, 416412413, 415289611, 414222062, 413214922, 412265062, 411394507, 410521716, 409451306, 408239961, 407093793, 406029522, 405050725]
3334.8D05050725q85189r70036j143008j188755j191497j099497r23902j053482j344294
3353.1C95251065j341134j166612j081705j094580j036822q35330p86244j070291j400590
3371.5C85437757j373440j060635q72403q97408r87530r31024o95855m18335k43604
3389.8C77957523m18186p51078o91206l02642j84149n47111q34048o32167l62336k73436
3410.2C72961164k81781m28498n02110l35753j61707j05232Q255J87129K59846K10435
3430.6C71811748K50399L24160J37597j08898l7730K07603M14402N63264N67138N23776
3451C74653459N73366O63847P54327Q14438P39723P48307J039177J181245Q44210M61251
3471.4C82473350N24640Q23944J041770J027137Q52108Q60304J011789R94861R55105
$$ y = [405050725, 404165536, 403195500, 402052492, 400863737, 399672240, 398572743, 397648841, 396595359, 395251065, 393909931, 392743319, 391661614, 390567034, 389530212, 388694882, 387908638, 386838347, 385437757, 384064317, 383003682, 382131279, 381233871, 380246341, 379315317, 378619462, 378201127, 377957523, 377539337, 376788259, 376097053, 375794411, 375610262, 375063151, 374229103, 373596936, 373234600, 372961164, 372679383, 372250885, 371748775, 371413022, 371251315, 371146083, 371154338, 371341467, 371601313, 371811748, 372062147, 372386307, 372523904, 372415006, 372377276, 372584879, 372999281, 373562545, 374129683, 374653459, 375226825, 375890672, 376644999, 377459437, 378199160, 378947467, 379986644, 381167889, 382012099, 382473350, 382997990, 383821934, 384863704, 385890841, 386742949, 387603253, 388615042, 389609903, 390565008]
3489.8C90565008J075238J174301J221090J168609J068622J080722J074135R83059
3506.1C99410784J064539J370609J553267J359046J070350J068980J272440J479148
3522.4D09649163J406909J173824J258432J534462J679779J750499J675874J478701
3538.7D21607643J537413J731723J751691J650125J624197J717687J907348K042800
3555D35570627K066285K152324K145767J836657J830638K812534L478468L004849K643823
3573.4D57541972K764136K949178L161252L303140L102541K902478L297269L728748
3589.7D82750714L463268L351629L690243L905713L897488L848136L552973L247619
3606E11707783L548562L897310L879726L915190L748000L887713M555523M260421L283620
$$ y = [390565008, 391640246, 392814547, 394035637, 395204246, 396272868, 397353590, 398427725, 399410784, 400475323, 401845932, 403399199, 404758245, 405828595, 406897575, 408170015, 409649163, 411056072, 412229896, 413488328, 415022790, 416702569, 418453068, 420128942, 421607643, 423145056, 424876779, 426628470, 428278595, 429902792, 431620479, 433527827, 435570627, 437636912, 439789236, 441935003, 443771660, 445602298, 448414832, 451893300, 454898149, 457541972, 460306108, 463255286, 466416538, 469719678, 472822219, 475724697, 479021966, 482750714, 486213982, 489565611, 493255854, 497161567, 501059055, 504907191, 508460164, 511707783, 515256345, 519153655, 523033381, 526948571, 530696571, 534584284, 539139807, 543400228, 546683848]
3624.4E46683848K746344L552973M726708M287481L878057L800571L636599L505766
3640.7E76818347L224134K673865K471387L588438M697979L921985L264547L756702
3657F04417384L853142L168821K713502K490341K159000K223611K691149K361775K479792
3675.4F28558517L399431L289044K791882K383530J974821J808882K132952K611041
3691.7F48950100K578378K195477J799107J561582J638770J745403J445591R93788
3708F62908196R34184J640976K203762J840591J291812J063287J119912J151740J226902
3726.4F75381362J311362Q80063K84970N65767J689076J946628J069963J14322K04921
3744.7F83448434R47356P59959R24349J775146J676678J047075R08911J216352J104594
$$ y = [546683848, 549430192, 552983165, 557709873, 561997354, 565875411, 569675982, 573312581, 576818347, 580042481, 582716346, 585187733, 588776171, 593474150, 597396135, 600660682, 604417384, 608270526, 611439347, 614152849, 616643190, 618802190, 621025801, 623716950, 626078725, 628558517, 631957948, 635246992, 638038874, 640422404, 642397225, 644206107, 646339059, 648950100, 651528478, 653723955, 655523062, 657084644, 658723414, 660468817, 661914408, 662908196, 663842380, 665483356, 667687118, 669527709, 670819521, 671882808, 673002720, 674154460, 675381362, 676692724, 677572787, 677857757, 678423524, 680112600, 682059228, 683129191, 683243513, 683448434, 684395790, 685155749, 686080098, 687855244, 689531922, 690578997, 691487908, 692704260, 693808854]
3763.1F93808854P82489O75798P23958J055241J209974R20892O20067N75006P16626
3781.4G01088905P30038P73072Q94487Q47697O50704L30568J55866K60293J99020M12405
3801.8G06343055Q92758P80344R34422J166761P08938K8908o8367K83421K47478P22408
3822.2G12040126J174808Q54492N45621L28362K57909K90454J00374J68741P38859
3840.6G16499746J063168J015544O60956O6817o22750p37250P91014J584172R61184
3858.9G21282601K47717m4644K71738L37601L8027L74198Q46327R29713N88536J2756
3879.3G24884570J73211N46157M70877M77016K75552J61946M84884M16338o3181k87413
3899.7G27539957n2035M61340R59098R23872N34892K51710L9876j11461M9353L03507
$$ y = [693808854, 694591343, 695267141, 695991099, 697046340, 698256314, 699177206, 699797273, 700372279, 701088905, 701818943, 702592015, 703486502, 704334199, 704984903, 705315471, 705471337, 705731630, 705930650, 706343055, 707235813, 708016157, 708950579, 710117340, 710826278, 710855186, 710786819, 711070240, 711317718, 712040126, 713214934, 714069426, 714615047, 714943409, 715201318, 715491772, 715592146, 715760887, 716499746, 717562914, 718578458, 719239414, 719306231, 718683481, 717946231, 718737245, 720321417, 721282601, 721530318, 721485674, 721757412, 722095013, 722133040, 722507238, 723353565, 724283278, 724871814, 724884570, 725057781, 725603938, 726074815, 726551831, 726827383, 726989329, 727474213, 727890551, 727827370, 727539957, 727487922, 727949262, 728908360, 729832232, 730367124, 730618834, 730658710, 730547249, 730596602, 730900109]
3920.1G30900109K48134J61707K59221K18868O9261K24948M80592M05252J72496l8326
3940.5G33102262k5749K38895K93672K11716L01301L27588J90675Q9764J27316K30789
3960.9G35088229L07143K92182J57475N5790P4089J13547J66118K09093J87874J69694
3981.3G36821234J57237J37806J30832J05083R4653J16705J27972J30176
3997.6G37821698
$$ y = [730900109, 731148243, 731309950, 731569171, 731788039, 731857300, 732082248, 732562840, 732968092, 733140588, 733102262, 733076513, 733315408, 733609080, 733820796, 734122097, 734449685, 734640360, 734730124, 734857440, 735088229, 735395372, 735687554, 735845029, 735900819, 735974908, 736088455, 736254573, 736463666, 736651540, 736821234, 736978471, 737116277, 737247109, 737352192, 737446845, 737563550, 737691522, 737821698]
##END=$$ End of the data block
