##TITLE=$$ Begin of the data block
##JCAMP-DX=5.00 $$ ACD/SpecManager v 10.08
##SPECTROMETER/DATA SYSTEM=Alpha
##DATE=22 Dec 2014 10:36:42
##DATA TYPE=INFRARED SPECTRUM
##DATA CLASS=XYDATA
##ORIGIN=
##OWNER=
##NPOINTS=1765
##FIRSTX=399.76428223
##LASTX=3997.64306641
##MAXX=3997.64306641
##MINX=399.76428223
##MAXY=0.84533888
##MINY=0.31693605
##XFACTOR=1.0000000000
##YFACTOR=1.000000000000000e-9
##FIRSTY=0.62264520
##DELTAX=2.03961372
##XUNITS=1/CM
##YUNITS=ARBITRARY UNITS
##XYDATA=(X++(Y..Y))
399.8F22645199k104878k824605l563702j753926J345217K367795R23097n27978m97520
418.1F16008699J97470n58257k229691l119587k665341j942456k059698k784491k548933
436.5E98297715p14123J620889L391325L907919L416419K758145K318621J819611O94751
454.8F17511272n90682j048982p68959j064599k272188l423453l423750k614856k185404
473.2F00118399k465785k524018j599729m89831j67668n08845o64532n7340N25594
491.5E92166245k37525j852691k470433j720727j009822j630306l041983l493905k651572
509.9E74057281k280474l309846m634499m823864l693401k615631k373278k056659
526.2E48269629p85112O54757J292348J637936K831518M496396N335808M809022L325343
$$ y = [622645199, 620540321, 617715716, 614152014, 612398088, 613743305, 616111100, 617034197, 616506219, 616008699, 616206169, 615647912, 613418221, 610298634, 607633293, 605690837, 603631139, 600846648, 598297715, 597583592, 599204481, 602595806, 606503725, 609920144, 612678289, 614996910, 616816521, 617511272, 616920590, 615871608, 615102649, 614038050, 611765862, 608342409, 604918659, 602303803, 600118399, 597652614, 595128596, 593528867, 593039036, 592871368, 592362523, 591697991, 591640651, 592166245, 591928720, 590076029, 587605596, 585884869, 584875047, 583244741, 580202758, 576708853, 574057281, 571776807, 568466961, 563832462, 559008598, 555315197, 552699566, 550326288, 548269629, 547484517, 548139274, 549431622, 551069558, 553901076, 558397472, 563733280, 568542302, 571867645]
544.6E71867645J699805L44813n80788j187622j937628k820134l563524m239261m893124
562.9E54690182n584836o520927p091582o065368l541589r56237J020372K880156N020201
581.3E33850372O861508P289231O055533M245639L187955K549469J379729j9432p23838
599.6E64676166l13044M17769L93808j51456K9087J194656K210319K407134K374649
618E73239088K823114L755749M411041M008174L011465K457440K508760K447784J813531
636.4F00476146J064956Q76486J223922J486480J287282R25839Q44240J051724J257181
654.7F10494256J231670R50516O63995O83368Q20160J284718J928270J246750R22740
673.1F20226443J505136J866460J415491P75159Q39769J425386J461208N28753n93543
$$ y = [571867645, 573567450, 573912263, 573331475, 572143853, 570206225, 567386091, 563822567, 559583306, 554690182, 549105346, 542584419, 535492837, 529427469, 525885880, 524929643, 525950015, 528830171, 533850372, 540711880, 548001111, 554056644, 558302283, 561490238, 564039707, 565419436, 565400004, 564676166, 564363122, 564780891, 565174699, 565023243, 565052330, 566246986, 568457305, 570864439, 573239088, 576062202, 579817951, 584228992, 588237166, 591248631, 593706071, 596214831, 598662615, 600476146, 601541102, 602417588, 603641510, 605127990, 606415272, 607341111, 608185351, 609237075, 610494256, 611725926, 612676442, 613340437, 614023805, 614843965, 616128683, 618056953, 619303703, 620226443, 621731579, 623598039, 625013530, 625788689, 626628458, 628053844, 629515052, 630043805, 629450262]
691.4F29450262j005650r04798j330138k579808l584027l179908j736820n88596j45971
709.8F14394546M69327K044498L951788M857123M656494M540324N226374N905032N436003
728.1F51481509M081607L141046L152966L306747K554655J026272k14040p19189j274586
746.5F66536987k463401l813147m546225m475534m158080m011512l685414k718389
762.8F36665285j085759R02713K845168M601180O089509P154703P797957P849335P082701
781.2F79902792N763173M602432M174829M153669L729701K953589K719640L501595
797.5G11501420M407048M210651L027200K112866K225697K568006J984239O98745P2420
815.8G32808292N81443J035571J83761j446723k341807k295316k505004l723383n143106
$$ y = [629450262, 628444612, 627539814, 626209676, 623629868, 620045841, 616865933, 615129113, 614540517, 614394546, 614863873, 616908371, 620860159, 625717282, 630373776, 634914100, 640140474, 646045506, 651481509, 655563116, 658704162, 661857128, 665163875, 667718530, 668744802, 668530762, 667811573, 666536987, 664073586, 660260439, 655714214, 651238680, 647080600, 643069088, 639383674, 636665285, 635579526, 636482239, 639327407, 643928587, 650018096, 657172799, 664970756, 672820091, 679902792, 685665965, 690268397, 694443226, 698596895, 702326596, 705280185, 707999825, 711501420, 715908468, 720119119, 723146319, 725259185, 727484882, 730052888, 732037127, 732735872, 732808292, 733389735, 734425306, 734609067, 733162344, 730820537, 728525221, 726020217, 722296834, 717153728]
834.2G17153728n422831m449904l560483l708720m164517l787458k836406k486050
850.5F86737359l156186m089713m256427l359795j404583J626313M993498P786274
866.8F84876740R693027J0335862R359539P199883M734278K422631J79708k037764
883.2G26763904l924847n067050n400538n201400m785597m496992m335642m060566
899.5F89491272l859103m161715n130530o379485p267654p769823q363724r042143
915.8F37517095r115220p941067n755484l603637k203107j218676J5318J507878K695978
934.1F11899078L295839L790438M609108N131304M077315J014293k877891o232083
950.5F24707401q838296j1081338j2989163j4285923j5104651j5955150j7022610j8117904
$$ y = [717153728, 711730897, 707280993, 703720510, 700011790, 695847273, 692059815, 689223409, 686737359, 683581173, 679491460, 675235033, 671875238, 670470655, 672096968, 677090466, 684876740, 694569767, 704905629, 714265168, 721465051, 726199329, 728621960, 728801668, 726763904, 722839057, 717772007, 712371469, 707170069, 702384472, 697887480, 693551838, 689491272, 685632169, 681470454, 676339924, 669960439, 662692785, 654922962, 646559238, 637517095, 628401875, 620460808, 614705324, 611101687, 608898580, 607679904, 607695222, 609203100, 611899078, 615194917, 618985355, 623594463, 628725767, 632803082, 633817375, 630939484, 624707401, 615869105, 604787767, 591798604, 577512681, 562408030, 546452880, 529430270, 511312366]
966.8E11312366j9034714j9707382k0237505k0591766k0449549j9510537j7718375
981.1C74062538j5296519j2575566r805382p212311m956692l056258j502723l72469
997.4C19284618L22521O54101O18190J97678m18633r67473j272380j092613l89963
1015.7C16936046N46127J435221K218485L014296L841579M391640M447729M174173
1032C41005296L737300L080726K174169J346051R24737R97662J468331K169013L149569
1050.4C60052854M526317O136060P712841R101450J0199279J1087477J1256129R054094
1066.7D29126501L228307m806698j1014759j2247205r227842m964322j375973J322597
1083C90040606L415823M990578O113261O876230P146478O744593N615145L955513K265424
$$ y = [511312366, 492277652, 472570270, 452332765, 431740999, 411291450, 391780913, 374062538, 358766019, 346190453, 336385071, 329172760, 324216068, 321159810, 319657087, 319284618, 319607139, 320261240, 320879430, 321077108, 320658475, 319691002, 318418622, 317326009, 316936046, 317482173, 318917394, 321135879, 324150175, 327991754, 332383394, 336831123, 341005296, 344742596, 347823322, 349997491, 351343542, 352268279, 353265941, 354734272, 356903285, 360052854, 364579171, 370715231, 378428072, 387529522, 397728801, 408816278, 420072407, 429126501, 432354808, 427548110, 416533351, 404286146, 395058304, 390093982, 388718009, 390040606, 393456429, 398447007, 404560268, 411436498, 418582976, 425327569, 430942714, 434898227, 437163651]
1101.4D37163651J167417J109004K034097L297687M214645M494905M154056L430099
1117.7D61065561K643197K067328J868129K183377L104210M248351M670113L627450
1134D85477716J170188k006501n014658p238120q498669q836448q229911o821454n049497
1152.4D34952646l298282j627594J19447K041072M102170O183893Q228570J0243416
1168.7D60945338J2124330J3550430J4203757J4153064J3874948J3639390J3142467
1183E55633724J2016594J0359764Q605778O969870N298495L594875K256990J587212
1199.3F06323302J507103J732886K015293K384960L044367L894866M506111M538655
1215.6F29947543L986657L114998K158106J156508J26005p95603j423061j659334j583338
$$ y = [437163651, 438331068, 439440072, 441474169, 444771856, 448986501, 453481406, 457635462, 461065561, 463708758, 465776086, 467644215, 469827592, 472931802, 477180153, 481850266, 485477716, 486647904, 484641403, 479626745, 472388625, 463889956, 455053508, 446823597, 440002143, 434952646, 431654364, 430026770, 430146217, 432187289, 436289459, 442473352, 450701922, 460945338, 473069668, 486620098, 500823855, 514976919, 528851867, 542491257, 555633724, 567650318, 578010082, 586615860, 593585730, 598884225, 602479100, 604736090, 606323302, 607830405, 609563291, 611578584, 613963544, 617007911, 620902777, 625408888, 629947543, 633934200, 637049198, 639207304, 640363812, 640489817, 639694214, 638271153, 636611819, 635028481]
1234F35028481j434087j360953j224518p80761j3888P93517J296758J467943J572550
1252.3F35345042J724124J689493J255036P17401O07550J034975J584471J746714J507699
1270.7F47212505J246631J039804O12676j40548q37803r84311p35104o64294r44555
1289F45805001j313269j474559j410306j435995j716375j944184j798213j464725j311838
1307.4F31935537j358688j397073j251579j030504j025021j304627j849413k606809
1323.7F20111823l446639m261434m845500m931807m432738l513217k360701j096130
1340E91223657j45435K37882L59297L66389J49668k98381p34747r11414r69410j112402
1360.4E88165104j138925q43227n63741k91347M3273K86758O77049J014054J095771
$$ y = [635028481, 633594394, 632233441, 631008923, 630228162, 630214274, 631007791, 632304549, 633772492, 635345042, 637069166, 638758659, 640013695, 640731096, 641338646, 642373621, 643958092, 645704806, 647212505, 648459136, 649498940, 650111616, 649971068, 649133265, 648148954, 647413850, 646749556, 645805001, 644491732, 643017173, 641606867, 640170872, 638454497, 636510313, 634712100, 633247375, 631935537, 630576849, 629179776, 627928197, 626897693, 625872672, 624568045, 622718632, 620111823, 616665184, 612403750, 607558250, 602626443, 598193705, 594680488, 592319787, 591223657, 591078222, 591316104, 591675401, 592041790, 592191458, 591893077, 591158330, 590246916, 589277506, 588165104, 587026179, 586182952, 585619211, 585327864, 585371137, 585657895, 586334944, 587348998, 588444769]
1378.8E88444769J130999J298129K029717L564239M404068L305852J708150N42819
1395.1F06428742j14858l75271o06656j168430j627624j580774j470328j488566j540423
1413.5E96455812j636207j456022m46260L84927N10871O51777Q12888J219988J570761
1431.8E98068535J292408J421273K248823K184928J708924J162470M91321L5346l25323
1450.2F08288705r72449j776994k350330j232565M97282J080692K208769L784537M300535
1468.5F13828182N173445Q065104R668172Q561551P354916O686210O329596N453587
1484.9F71120763M692256M889548N426824M489064L469110L648221L791452L064930
1501.2G04592168J911998J230002K467572L382743K566695J873493J383066J283765
$$ y = [588444769, 589575768, 590873897, 592903614, 596467853, 600871921, 604177773, 605885923, 606428742, 606313884, 605938613, 605331957, 604163527, 602535903, 600955129, 599484801, 597996235, 596455812, 594819605, 593363583, 592917323, 593302250, 593813121, 594464898, 595277786, 596497774, 598068535, 599360943, 600782216, 603031039, 605215967, 606924891, 608087361, 608578682, 608614028, 608288705, 607316256, 605539262, 603188932, 601956367, 602453649, 603534341, 605743110, 609527647, 613828182, 619001627, 627066731, 636734903, 645296454, 652651370, 659337580, 665667176, 671120763, 675813019, 680702567, 686129391, 690618455, 694087565, 697735786, 701527238, 704592168, 706504166, 707734168, 710201740, 713584483, 716151178, 718024671, 719407737, 720691502]
1517.5G20691502J149774J434207K001702J839281J604974J076758N33521P66158P56264
1535.8G31854141l42071p85172O82413J480282J162290L60549k27034l40820n25415
1554.2G33319163j112580j337707M58896R54151R3103m44651p32779m80354l09766
1572.6G30407476q02517p65383j91450l69429p73788r74715j200676j447677j681924
1590.9G22199917j874268j947999j940072k128184k496957k709151k808332k954900
1607.2G03340054l129781l262758l531754m121900m097879k931773k873779l391146
1623.5F75999284l018499k652824k479612k279759k417981k020538l97086J95741k8372
1641.9F60900354k76088J25348J431823J378357J400829L899634M052937K936661K828717
$$ y = [720691502, 721841276, 723275483, 725277185, 727116466, 728721440, 729798198, 730331719, 731097877, 731854141, 731512070, 730726898, 731409311, 732889593, 734051883, 734412432, 734185398, 733844578, 733319163, 732206583, 730868876, 731327772, 732281923, 732375026, 731930375, 731197596, 730717242, 730407476, 729604959, 728839576, 728648126, 728278697, 727504909, 726530194, 725329518, 723881841, 722199917, 720325649, 718377650, 716437578, 714309394, 711812437, 709103286, 706294954, 703340054, 700210273, 696947515, 693415761, 689293861, 685195982, 682264209, 679390430, 675999284, 672980785, 670327961, 667848349, 665568590, 663150609, 661130071, 660732985, 660928726, 660900354, 660624266, 660749614, 662181437, 663559794, 664960623, 668860257, 672913194, 675849855, 678678572]
1660.3F78678572L470481L960847L250242L204226M261852M142403M136443M661918
1676.6G09766984L953814K935470K932906M978895N178273L814041L420353K568603
1692.9G39549339K027333K159834K300798K967120K472221J792431K020777J860678
1709.2G57150531J292288P87258O33180J478136K271354J770199J424312J587033J466871
1727.6G69861162J119792Q62479J534522K477586J857281J469731J686275J722098
1743.9G82590926J548946J466274K030671K755522K403260J881778J718759J473427
1760.2G97869563J591504J656115J132250O27160M44233Q87930J534522J369774Q91984
1778.6H08005035P02917P77722Q59678Q24570M37081Q5235N35667J012206P87437N14924
$$ y = [678678572, 682149053, 686109900, 689360142, 692564368, 696826220, 700968623, 705105066, 709766984, 713720798, 716656268, 719589174, 724568069, 729746342, 733560383, 736980736, 739549339, 741576672, 743736506, 746037304, 749004424, 751476645, 753269076, 755289853, 757150531, 758442819, 759230077, 759863257, 761341393, 763612747, 765382946, 766807258, 768394291, 769861162, 770980954, 771843433, 773377955, 775855541, 777712822, 779182553, 780868828, 782590926, 784139872, 785606146, 787636817, 790392339, 792795599, 794677377, 796396136, 797869563, 799461067, 801117182, 802249432, 802876592, 803320825, 804208755, 805743277, 807113051, 808005035, 808707952, 809485674, 810345352, 811169922, 811607003, 811692238, 812227905, 813240111, 814027548, 814542472]
1799H14542472O28770Q68499P83086N34713M02630N23149O76871O01411N07295N06937
1819.4H20575833L24548N8829J11878K57910M15742P41541O56188L34799L16203K72214
1839.8H24065685j11162k33591L33965O74367N31375K75076Q7738R4294J87814K15829
1860.2H26121390R7751j48057l69907r8884N61953O39081L11851J91569K55585K52426
1880.5H27814758J65105J04844O7175J10089L10302L18885J65224K10405K62975J71006
1900.9H29700768N9009l994k3603L6120J53840J19149q8751j41680N7041J17302J53184
1923.4H30138385K88427K40028J05083N0306O4612P8440K6226r6441j27911R3102K73645
1945.8H31133902K24650J62959J59800J43290J36614J35779R1910O1274N5015N6922
$$ y = [814542472, 815171242, 816039741, 816822827, 817357540, 817760170, 818283319, 818960190, 819561601, 820068896, 820575833, 820900381, 820959210, 821071088, 821328998, 821744740, 822486281, 823142469, 823477268, 823793471, 824065685, 823954523, 823720932, 824054897, 824729264, 825260639, 825535715, 825623453, 825717747, 825905561, 826121390, 826219141, 826071084, 825701177, 825602293, 826164246, 826803327, 827115178, 827306747, 827562332, 827814758, 827979863, 828084707, 828151882, 828261971, 828572273, 828891158, 829056382, 829266787, 829529762, 829700768, 829759777, 829755783, 829732180, 829768300, 829922140, 830041289, 829952538, 829810858, 829867899, 829985201, 830138385, 830426812, 830666840, 830771923, 830822229, 830886841, 830965281, 830991507, 830895066, 830767155, 830860257, 831133902, 831358552, 831521511, 831681311, 831824601, 831961215, 832096994, 832188904, 832250178, 832305193, 832362115]
1966.2H32362115J38581J92821J53780J10626O8129N1319O3777P1645N2690k086p3671
1988.7H33189726r1374L1888J38879N6744k4080q643k1935p4863j42992j81198j66416
2011.1H32705736j92940l02494l50713l29495l96669n30004n01156j87755K5690o8009
2031.5H29872191k05040k68817k84970k92003k70188k38478k22683j66058j00911r3341
2051.9H27729702j00970n8711J8835N9784R298n3108R001J16765J16825N1737R060
2074.3H27908218J7762M0650L9816K2889K0682P6592J32919J36256J04010N9307N7101
2096.8H28616202J29998J71244J14679Q8573J36673J52707R1136K4616K3783P4505
2117.1H29624116R7454N0902k145L635N1797O7294J1265m7922k5928L4034O5982M7922
$$ y = [832362115, 832500696, 832693517, 832847297, 832957923, 833026052, 833077371, 833141148, 833212793, 833265483, 833263397, 833189726, 833098352, 833130240, 833269119, 833325863, 833301783, 833293140, 833271205, 833196342, 833053350, 832872152, 832705736, 832512796, 832210302, 831859589, 831530094, 831133425, 830603421, 830102265, 829914510, 829940200, 829872191, 829667151, 829398334, 829113364, 828821361, 828551173, 828312695, 828090012, 827923954, 827823043, 827729702, 827628732, 827570021, 827588856, 827648640, 827657938, 827604830, 827613831, 827730596, 827847421, 827899158, 827908218, 827925980, 827966630, 828006446, 828029335, 828050017, 828126609, 828259528, 828395784, 828499794, 828559101, 828616202, 828746200, 828917444, 829032123, 829120696, 829257369, 829410076, 829501212, 829525828, 829549611, 829624116, 829721570, 829772472, 829770327, 829773962, 829825759, 829893053, 829904318, 829856396, 829830468, 829864502, 829930484, 829978406]
2141.6H29978406J5974N2631R4831M7028L577P1287J54018J52707J38998J81973K37525
2164.1H31128955K43366K18928K36809K95758L63708M09245L91901L57389L44157L40998
2184.5H34331214L35992L14116K91288L01779L12745K80142K55942K43187K42651K90572
2204.8H37199628L15190K89857L00646L42548L44395L01242K46644K10226J96874K13444
2225.2H39960694K29657K37644K48491K12670J64986J51276J57476J77979J76251J42872
2245.6H41859996J25587J29164J30355J26660J20997J24514J41383J48475J28507J10329
2266H43145967J38461J85430J67787J03593Q4877J35720K07543K03848J23561Q6963
2286.4H44583750J09434J05262P2777N3108P0810J02758P7069J5497q344J6451O3419
$$ y = [829978406, 829994380, 830047011, 830141842, 830188870, 830192447, 830263734, 830417752, 830570459, 830709457, 830891430, 831128955, 831372321, 831591249, 831828058, 832123816, 832487524, 832896769, 833288670, 833646059, 833990216, 834331214, 834667206, 834981322, 835272610, 835574389, 835887134, 836167276, 836423218, 836666405, 836909056, 837199628, 837514818, 837804675, 838105321, 838447869, 838792264, 839093506, 839340150, 839550376, 839747250, 839960694, 840190351, 840427995, 840676486, 840889156, 841054142, 841205418, 841362894, 841540873, 841717124, 841859996, 841985583, 842114747, 842245102, 842371762, 842492759, 842617273, 842758656, 842907131, 843035638, 843145967, 843284428, 843469858, 843637645, 843741238, 843826115, 843961835, 844169378, 844373226, 844496787, 844583750, 844693184, 844798446, 844871223, 844924331, 844995141, 845097899, 845174968, 845190465, 845182121, 845198572, 845261991]
2308.9H45261991P1108o258p2301l4809L4750N9903K4497n1379p0572l3319p3731j50204
2333.3H44959676j85311j51872n1141k6822r9838j67489j74820j36018j00076j24276
2353.7H43742013j18911l2485p4267j63913j11282N067L278j25647j92046j51575j17659
2376.2H42662573j04726o5565m9352j01388j45554j35899j18375j05500j19626j85252
2396.6H41531336k42650k25485j80840j73569j97172k35975k46465k45094k80142l47138
2417H39156806m00900l77715k96891k76863l66509m28915l97504l65793l98636m71771
2437.4H35375309m92692m23849l59773l80039m42029m74274m24087l58700l97742m69446
2457.8H31152678m47393l67224l05176l31044m40002m39763l15189k86639l85344m48882
$$ y = [845261991, 845333099, 845326841, 845254540, 845219731, 845254481, 845314384, 845338881, 845287502, 845216930, 845183611, 845109880, 844959676, 844774365, 844622493, 844571352, 844544530, 844444692, 844277203, 844102383, 843966365, 843866289, 843742013, 843623102, 843590617, 843516350, 843352437, 843241155, 843246222, 843249500, 843123853, 842931807, 842780232, 842662573, 842557847, 842492282, 842442930, 842341542, 842195988, 842060089, 841941714, 841836214, 841716588, 841531336, 841288686, 841063201, 840882361, 840708792, 840511620, 840275645, 840029180, 839784086, 839503944, 839156806, 838755906, 838378191, 838081300, 837804437, 837437928, 837009013, 836611509, 836245716, 835847080, 835375309, 834882617, 834458768, 834098995, 833718956, 833276927, 832802653, 832378566, 832019866, 831622124, 831152678, 830705285, 830338061, 830032885, 829701841, 829261839, 828822076, 828506887, 828220248, 827834904, 827386022]
2478.1H27386022l90649k87235k59638l03387l37899l19302k56002k15292k33829k70486
2498.5H24512303k50220j93596j99259k23338k09213k07185k20120k11895k21908k78711
2518.9H22296858l40462l68178l35395k89381l35753m28855m63605m43161m26709m49360
2539.3H18415999m79698m90188m61281m06563m13358m77851m88460m25040m12047m85897
2559.7H13875616n26727m73618m00007l80278m15206m78506n01394m30941l62456l92080
2580.1H09514403m56750m44055l59118l08513l31283l49581l23296l02553l08275l28601
2600.5H06002378l44097l47138l49462l63290m21107m93824n30720n83887o53148o75857
2620.9H01239848o96242p45237p79926p92086p96855q15690q54790q77797q64983q68499
$$ y = [827386022, 826995373, 826708138, 826448500, 826145113, 825807214, 825487912, 825231910, 825016618, 824782789, 824512303, 824262083, 824068487, 823869228, 823645890, 823436677, 823229492, 823009372, 822797477, 822575569, 822296858, 821956396, 821588218, 821252823, 820963442, 820627689, 820198834, 819735229, 819292068, 818865359, 818415999, 817936301, 817446113, 816984832, 816578269, 816164911, 815687060, 815198600, 814773560, 814361513, 813875616, 813348889, 812875271, 812475264, 812094986, 811679780, 811201274, 810699880, 810268939, 809906483, 809514403, 809057653, 808613598, 808254480, 807945967, 807614684, 807265103, 806941807, 806639254, 806330979, 806002378, 805658281, 805311143, 804961681, 804598391, 804177284, 803683460, 803152740, 802568853, 801915705, 801239848, 800543606, 799798369, 799018443, 798226357, 797429502, 796613812, 795759022, 794881225, 794016242, 793147743]
2641.3G93147743q82387q90255r35495r23753q21710p87496q61764q94189q27193p75874
2661.7G84547627p86543q12709q11219p66755p32243p49767p42971o64890o25134o57916
2682.1G77197480o80148p11561p41899o69896n98252o74307p98524q26955p79688p75933
2702.5G69940317q36969q85069q91864q55923q17120q44419q81136q14080p19488p15315
2722.9G61678934p46786p40529o94990o33776n96762n99384o13630o01470n72801n66780
2743.3G55312026n89133o06656o06119n83530n26011m69923m69148m85718m55559m38511
2763.7G50081718m71711m95196n16235n32628n29468n66184o46472p22349p69555p85709
2784.1G44046211q01027q64446r42468r70364j009524j095652j179934j254261j311242
$$ y = [793147743, 792265356, 791375101, 790439606, 789515853, 788694143, 787906647, 787044883, 786150694, 785323501, 784547627, 783761084, 782948375, 782137156, 781370401, 780638158, 779888391, 779145420, 778480530, 777855396, 777197480, 776517332, 775805771, 775063872, 774393976, 773795724, 773121417, 772322893, 771495938, 770716250, 769940317, 769103348, 768218279, 767326415, 766470492, 765653372, 764808953, 763927817, 763113737, 762394249, 761678934, 760932148, 760191619, 759496629, 758862853, 758266091, 757666707, 757053077, 756451607, 755878806, 755312026, 754722893, 754116237, 753510118, 752926588, 752400577, 751930654, 751461506, 750975788, 750520229, 750081718, 749610007, 749114811, 748598576, 748065948, 747536480, 746970296, 746323824, 745601475, 744831920, 744046211, 743245184, 742380738, 741438270, 740467906, 739458382, 738362730, 737182796, 735928535, 734617293]
2802.4G34617293j339674j348913j416862j564026j639187j610398j624763j724422
2818.8G22349048j831353j888633j919389j998543k102077k160073k214193k312362
2835.1G05922425k461136k650857k841949l022194l208756l388286l439307l239811
2851.4F81670129k864599k504051k318859k390206k671003l058732l515839l998220
2867.7F58348620m381776m640162m828393m896164m789889m479110l940523l286004
2884F23106599k656818k079844j538575j083314p89941o72519o82950p55727q96156
2902.4F11950755j143038j442969j724422k081394k617657l196717l583610l691494
2918.7E92469454l580630l297567k821267k122462j272201l86835N72443J674772K808571
$$ y = [734617293, 733277619, 731928706, 730511844, 728947818, 727308631, 725698233, 724073470, 722349048, 720517695, 718629062, 716709673, 714711130, 712609053, 710448980, 708234787, 705922425, 703461289, 700810432, 697968483, 694946289, 691737533, 688349247, 684909940, 681670129, 678805530, 676301479, 673982620, 671592414, 668921411, 665862679, 662346840, 658348620, 653966844, 649326682, 644498289, 639602125, 634812236, 630333126, 626392603, 623106599, 620449781, 618369937, 616831362, 615748048, 614958107, 614285588, 613602638, 612846911, 611950755, 610807717, 609364748, 607640326, 605558932, 602941275, 599744558, 596160948, 592469454, 588888824, 585591257, 582769990, 580647528, 579375327, 578988492, 579560935, 581235707, 584044278]
2937E84044278L784299M503607M920662N075812N144239N238890N279780N201101N094290
2955.4F28286958N044579M991114M816533M534363M252672L989101L721535L542245
2971.7F63179100L482341L415525L331125L231168L015101K749502K521933K302944
2988F87228739K095104J847565J554966J298785J033485P26580M41850J91927l1591
3006.4F96387410k01583l51310n80966q82506j141847j335680j497686j578927j627684
3024.7F87189221j735329j818300j829505j856386k014280k153217k093375k062738
3041.1F71626091k176404k333105k464294k445698k376377k434791k522587k564848
3057.4F52307987k569020k519369k469122k455056k498984k598167k660453k578497
$$ y = [584044278, 587828577, 592332184, 597252846, 602328658, 607472897, 612711787, 617991567, 623192668, 628286958, 633331537, 638322651, 643139184, 647673547, 651926219, 655915320, 659636855, 663179100, 666661441, 670076966, 673408091, 676639259, 679654360, 682403862, 684925795, 687228739, 689323843, 691171408, 692726374, 694025159, 695058644, 695785224, 696227074, 696419001, 696387410, 696185827, 695834517, 695253551, 694371045, 693229198, 691893518, 690395832, 688816905, 687189221, 685453892, 683635592, 681806087, 679949701, 677935421, 675782204, 673688829, 671626091, 669449687, 667116582, 664652288, 662206590, 659830213, 657395422, 654872835, 652307987, 649738967, 647219598, 644750476, 642295420, 639796436, 637198269, 634537816, 631959319]
3073.7F31959319k397299k364278k553403k709865k705813k650917k596974k616227
3090F11364543k760648k844870k721370k549171k559304k677918k661884k522945k493739
3108.4E87572694k597273k576172k452969k449215k556443k727747k855897k802432
3124.7E66554546k604127k443134k466739k554595k499163k343178k356112k581000
3141E46706498k675772k546966k391696k233327k169191k364040k574146k515196k370894
3159.4E24865270k329111k330006k335727k294063k183319k138078k186775k186954
3175.7E06881237k129197k090693k098143k094447k034217j990051j964002j940608
3192D90539879j961857j982272j937360j849025j789540j785636j804918j800865j751691
$$ y = [631959319, 629562020, 627197742, 624644339, 621934474, 619228661, 616577744, 613980770, 611364543, 608603895, 605759025, 603037655, 600488484, 597929180, 595251262, 592589378, 590066433, 587572694, 584975421, 582399249, 579946280, 577497065, 574940622, 572212875, 569356978, 566554546, 563950419, 561507285, 559040546, 556485951, 553986788, 551643610, 549287498, 546706498, 544030726, 541483760, 539092064, 536858737, 534689546, 532325506, 529751360, 527236164, 524865270, 522536159, 520206153, 517870426, 515576363, 513393044, 511254966, 509068191, 506881237, 504752040, 502661347, 500563204, 498468757, 496434540, 494444489, 492480487, 490539879, 488578022, 486595750, 484658390, 482809365, 481019825, 479234189, 477429271, 475628406, 473876715]
3210.3D73876715j693189j635284j603871j631171j618057j566708j555145j527906
3226.7D61045384j432061j284599j252800j453370j610696j527787j380920j268685
3243D49834466j178235j207232j306445j266360j119405j054376j123041j157403j080960
3261.3D39341009j025409r63807p90149o87718q81136j106381j116365j029849r51648
3279.7D30788547r45896r59009q91835p79241o80983o82980q13454r51320j012921
3298D23070908r46373p35700n92768p47532j077086j295417j285702j130045j005709
3316.4D14254576r85026r89378r28402r03070j059085j212031j163214j030237r12308
3334.8D05071825q45283r56834j148909j230091j244962j121640r08703j007736j325309
$$ y = [473876715, 472183526, 470548242, 468944371, 467313200, 465695143, 464128435, 462573290, 461045384, 459613323, 458328724, 457075924, 455622554, 454011858, 452484071, 451103151, 449834466, 448656231, 447448999, 446142554, 444876194, 443756789, 442702413, 441579372, 440421969, 439341009, 438315600, 437351793, 436561644, 435873926, 434992790, 433886409, 432770044, 431740195, 430788547, 429842651, 428883642, 427991807, 427212566, 426531583, 425848603, 425035149, 424083829, 423070908, 422124535, 421388835, 420796067, 420048535, 418971449, 417676032, 416390330, 415260285, 414254576, 413269550, 412280172, 411351770, 410448700, 409389615, 408177584, 407014370, 405984133, 405071825, 404226542, 403269708, 402120799, 400890708, 399645746, 398524106, 397615403, 396607667, 395282358]
3353.1C95282358j381576j185507j051753j093776j084029q82179q11577j063078j368970
3371.5C85359913j362860j096785r28849r00805r19014q78513p02530m45813k50250
3389.8C77874494l91812p54863p53134l26276j40428n09680q52108o61760l35217k71529
3410.2C72877687l32415m25696m50045k90752j28239p2598k2173P2747J62423J69903
3430.6C71560842K69651M20302K40177j10715j24336J72377M59135N92142N39064M83722
3451C74502361N15997N92649P56562Q37535P08043P56264J111329J248627Q65162M36932
3471.4C82331461N03897Q34853J052737R90629P93547Q53359J058013J052498R84580
3489.8C90455574J080543J211285J228512J083195J036495J144707J083702R58919
$$ y = [395282358, 393900782, 392715275, 391663522, 390569746, 389485717, 388603538, 387791961, 386728883, 385359913, 383997053, 382900268, 381971419, 381070614, 380151600, 379273087, 378570557, 378124744, 377874494, 377482682, 376727819, 375974685, 375648409, 375507981, 374998301, 374146193, 373484433, 373149216, 372877687, 372545272, 372119576, 371669531, 371378779, 371250540, 371177942, 371155769, 371228516, 371390939, 371560842, 371830493, 372250795, 372490972, 372380257, 372255921, 372428298, 372887433, 373479575, 374018639, 374502361, 375018358, 375611007, 376367569, 377205104, 377913147, 378669411, 379780740, 381029367, 381894529, 382331461, 382835358, 383670211, 384722948, 385713577, 386507124, 387360483, 388418496, 389470994, 390455574, 391536117, 392747402, 393975914, 395059109, 396095604, 397240311, 398324013, 399282932]
3506.1C99282932J089901J369596J511096J363874J136184J133799J284361J441151
3522.4D09612894J396895J255869J355231J566827J674712J705259J620531J512617
3538.7D21700835J603782J712799J693190J631766J663983J795560J933903K001822
3555D35737640K054244K185255K174169J850158J835048K781660L436952L014058K672047
3573.4D57741231K797007L031016L246396L335685L090173K844960L296643L811121
3589.7D83194232L509939L397911L736586L897101L908366L921568L610909L222704
3606E12399316L498673L923118L928066L924846L765464L929079M591226M273475L259420
3624.4E47492683K643406L420174M768491M429341L936410L766298L600299L530026
$$ y = [399282932, 400372833, 401742429, 403253525, 404617399, 405753583, 406887382, 408171743, 409612894, 411009789, 412265658, 413620889, 415187716, 416862428, 418567687, 420188218, 421700835, 423304617, 425017416, 426710606, 428342372, 430006355, 431801915, 433735818, 435737640, 437791884, 439977139, 442151308, 444001466, 445836514, 448618174, 452055126, 455069184, 457741231, 460538238, 463569254, 466815650, 470151335, 473241508, 476086468, 479383111, 483194232, 486704171, 490102082, 493838668, 497735769, 501644135, 505565703, 509176612, 512399316, 515897989, 519821107, 523749173, 527674019, 531439483, 535368562, 539959788, 544233263, 547492683, 550136089, 553556263, 558324754, 562754095, 566690505, 570456803, 574057102, 577587128]
3640.7E77587128L268599K661288K337456L441989M793227M075408L276110L736138
3657F05177343L926277L261924K747953K462506K070785K109050K617062K307951K442598
3675.4F29123449L455162L404796K911151K439022J934111J732052K045929K579153
3691.7F49624825K643585K266466J793504J446366J553476J837135J546740R63152
3708F63675249Q53240J664639K319097J911879J265943R41932R74953J160264J381338
3726.4F76148534J336992P55071K46465O50645J732349J943469J016200N36K07246
3744.7F84037507J092910P67291P58469J745284J811802J133382R13501J252175J173257
3763.1F94685578Q07643O92666P60019J060128J187861R00388N88715N64396P67410
$$ y = [577587128, 580855727, 583517015, 585854471, 589296460, 594089687, 598165095, 601441205, 605177343, 609103620, 612365544, 615113497, 617576003, 619646788, 621755838, 624372900, 626680851, 629123449, 632578611, 635983407, 638894558, 641333580, 643267691, 644999743, 647045672, 649624825, 652268410, 654534876, 656328380, 657774746, 659328222, 661165357, 662712097, 663675249, 664528489, 666193128, 668512225, 670424104, 671690047, 672631979, 673606932, 674767196, 676148534, 677485526, 678240597, 678487062, 679137707, 680870056, 682813525, 683829725, 683830261, 684037507, 685130417, 685897708, 686656177, 688401461, 690213263, 691346645, 692260146, 693512321, 694685578, 695493221, 696185887, 696945906, 698006034, 699193895, 700094283, 700682998, 701247394, 702014804]
3781.4G02014804P70748P74085Q86023Q43227O62744L41117J24693J69635P5519L86775
3801.8G07049370J017928Q75592R41813J153886P11442K6643j27912K23756K97785
3820.2G12170303Q33452J197219Q31305N58734L17812J92345K37166M0651Q6665P32124
3840.6G17197776J123130J097977P33793M1127p73847q19862R58503J713395R71675
3858.9G22243667K41279m8995K61367L25799J4424L27170P97450R32038O20961K7180
3879.3G25742340J58608N08845M70936N18859L01540K06351N83410M75705j04130l66926
3899.7G28495538j35541L79265R61780R78708N54860K78413P2599j39952K5571L57449
3920.1G31828690L03566J78814K76685K25186O0082K12192M74334L96967J17957r3639
$$ y = [702014804, 702785552, 703559637, 704445660, 705288887, 705951631, 706292748, 706417441, 706587076, 706662595, 707049370, 708067298, 708942890, 709884703, 711038589, 711750031, 711776674, 711648762, 711872518, 712170303, 713003755, 714200974, 715032279, 715591013, 715908825, 716101170, 716338336, 716378987, 716465652, 717197776, 718320906, 719418883, 720152676, 720193803, 719419956, 718600094, 719558597, 721271992, 722243667, 722484946, 722435951, 722697318, 723023117, 723037541, 723364711, 724162161, 725094199, 725715160, 725742340, 725900948, 726409793, 726880729, 727399588, 727701128, 727907479, 728490889, 728966594, 728862464, 728495538, 728359997, 728739262, 729701042, 730679750, 731234610, 731513023, 731585622, 731445670, 731471241, 731828690, 732132256, 732311070, 732587755, 732812941, 732873023, 733085215, 733559549, 733956516, 734074473, 733980834]
3940.5G33980834k3782K58386K92600K21908L42488L84271K66194J71125J77801K09689
3960.9G36281514K01702J76430J63198J45494O9857N2512J60634K12849J80780K25604
3981.3G37870574K77221J67489k801L874J55151J95742J29699J07587
3997.6G38904536
$$ y = [733980834, 733957052, 734215438, 734508038, 734729946, 735072434, 735456705, 735722899, 735894024, 736071825, 736281514, 736483216, 736659646, 736822844, 736968338, 737038195, 737090707, 737251341, 737464190, 737644970, 737870574, 738147795, 738315284, 738312483, 738316357, 738471508, 738667250, 738796949, 738904536]
##END=$$ End of the data block
