##TITLE=$$ Begin of the data block
##JCAMP-DX=5.00 $$ ACD/SpecManager v 10.08
##SPECTROMETER/DATA SYSTEM=Alpha
##DATE=22 Dec 2014 10:36:42
##DATA TYPE=INFRARED SPECTRUM
##DATA CLASS=XYDATA
##ORIGIN=
##OWNER=
##NPOINTS=1765
##FIRSTX=399.76428223
##LASTX=3997.64306641
##MAXX=3997.64306641
##MINX=399.76428223
##MAXY=0.84687150
##MINY=0.31718642
##XFACTOR=1.0000000000
##YFACTOR=1.000000000000000e-9
##FIRSTY=0.62437481
##DELTAX=2.03961372
##XUNITS=1/CM
##YUNITS=ARBITRARY UNITS
##XYDATA=(X++(Y..Y))
399.8F24374807k690315l227353l549457j713395J109659K012909R21130o4492m0770
418.1F17132723J95802p00117k033889k784610k767205k337277k302110k802610k449990
436.5E99150717o03795J848042L657937L871680L115654K581596K390981J916945O73651
454.8F18603408n80966r02951o84738j151979k346456l291071l180265k481639k297104
473.2F01686239k716779k842486j872778m23968J57237l27110p43151j64151M83989
491.5E93237042k84612j926660k443016j551509r65178j773000l106117l452718k702951
509.9E75031281k450049l474892m662692m673004l589094k705276k402663j904905
526.2E49168706o87718N36978J179278J761615K878725M338801N260289M828274L273726
$$ plain form
399.8 624374807 621684492 618457139 614907682 613194287 614303946 616316855 617237985 617173493 617132723
418.1 617132723 617328525 616628408 614594519 611809909 609042704 606705427 604403317 601600707 599150717
436.5 599150717 598546922 600394964 604052901 607924581 611040235 613621831 616012812 617929757 618603408
454.8 618603408 618022442 617119491 616434753 615282774 612936318 609645247 606464982 603983343 601686239
473.2 601686239 598969460 596126974 594254196 593830228 593987465 593660355 592917204 592753053 593237042
491.5 593237042 592952430 591025770 588582754 587031245 586066067 584293067 581186950 577734232 575031281
509.9 575031281 572581232 569106340 564443648 559770644 556181550 553476274 551073611 549168706
526.2 549168706 548480988 549017966 550197244 551958859 554837584 559176385 564436674 569264948 572538674
544.6E72538674J527965J88649o26028j158655j827180k732158l650367m309416m753113
562.9E55198371n450666o607532p122099n838275l458500j124919Q97527K836704M982770
581.3E34313381O841957P312358O079614M232526L193736K650678J513123n9604r42707
599.6E65135062m80771M40359N61535L2604J13070J189709K259552K466500K274811
618E73992431K658963L667117M394829M061878L039956K371788K456069K575457J987397
636.4F01205885J111567R12130J325071J483560J160145Q55743Q91746J096546J246989
654.7F11289382J200855R18746O99401P67767R19044J452804J934647J042486Q06272
673.1F21031404J489102J898587J433671P95543Q52763J367748J441658N40733o37650
$$ plain form
544.6 572538674 574066639 574255288 573629260 572470605 570643425 567911267 564260900 559951484 555198371
562.9 555198371 549747705 543140173 536018074 530179799 526721299 525596380 526493907 529330611 534313381
581.3 534313381 541155338 548467696 554547310 558779836 561973572 564624250 566137373 566077769 565135062
599.6 565135062 564654291 565094650 565656185 565688789 565801859 566991568 569251120 571717620 573992431
618 573992431 576651394 580318511 584713340 588775218 591815174 594186962 596643031 599218488 601205885
636.4 601205885 602317452 603229582 604554653 606038213 607198358 608054101 608945847 610042393 611289382
654.7 611289382 612490237 613408983 614108384 614876151 615795195 617247999 619182646 620225132 621031404
673.1 621031404 622520506 624419093 625852764 626648307 627501070 628868818 630310476 630851209 630213559
691.4F30213559j020789q31366j229942k539873l561735l176451j827776o53208o7472
709.8F15304947N66780K054036L930032M830063M626751M508733N210817N972743N578637
728.1F52583539M215003L210723L158629L214657K364457Q33511l40640p21097j161754
746.5F67357028k412618l850698m533470m457712m192352m007697l648222k758384
762.8F37495875j204311Q21173K878248M678369O106198P129967P824838P968188P192254
781.2F80890799N805194M626095M149020M070699L663659K956093K761125L484011
797.5G12406695M329443M179597L089309K162992K126754K418041J977623P93159R8168
815.8G33581781N52535J055897K05874j498222k393902k277910k466738l710986n166113
$$ plain form
691.4 630213559 629192770 628361404 627131462 624591589 621029854 617853403 616025627 615372419 615304947
709.8 615304947 615871727 617925763 621855795 626685858 631312609 635821342 641032159 647004902 652583539
728.1 652583539 656798542 660009265 663167894 666382551 668747008 669580519 669239879 668518782 667357028
746.5 667357028 664944410 661093712 656560242 652102530 647910178 643902481 640254259 637495875
762.8 637495875 636291564 637112737 639990985 644669354 650775552 657905519 665730357 673698545 680890799
781.2 680890799 686695993 691322088 695471108 699541807 703205466 706161559 708922684 712406695
797.5 712406695 716736138 720915735 724005044 726168036 728294790 730712831 732690454 733483613 733581781
815.8 733581781 734134316 735190213 735396087 733897865 731503963 729226053 726759315 723048329 717882216
834.2G17882216n433977m442930l650486l867209m226625l733158k754450k451658
850.5F87321723l187061m104495m226744l344297j416803J601040M984797P783353
866.8F85411513R692132J0394037R401262P125914M636705K376497J30593k142310
883.2G27026343m031717n093217n329311n080283m740417m560649m449427m170299
899.5F89571023l880739m148782n154371o381452p247865p768273q380294r056211
915.8F37553036r106397p919193n749345l608346k196669j209855M4524J547754K693177
934.1F12048686L290057L804743M617333N148352M049897R23216k933085o234526q845807
952.5F15868866j1124789j3077855j4367044j5088141j5858651j6970515j8132150
$$ plain form
834.2 717882216 712448239 708005309 704354823 700487614 696260989 692527831 689773381 687321723
850.5 687321723 684134662 680030167 675803423 672459126 671042323 672643363 677628160 685411513
866.8 685411513 695103645 705497682 714898944 722024858 726661563 729038060 729168653 727026343
883.2 727026343 722994626 717901409 712572098 707491815 702751398 698190749 693741322 689571023
899.5 689571023 685690284 681541502 676387131 670005679 662757814 654989541 646609247 637553036
915.8 637553036 628446639 620527446 614778101 611169755 608973086 607763231 607807755 609355509 612048686
934.1 612048686 615338743 619143486 623760819 628909171 632959068 633882284 630949199 624714673 615868866
952.5 615868866 604744077 591666222 577299178 562211037 546352386 529381871 511249721
966.8E11249721j9068718j9775093k0295143k0579785k0383268j9420624j7636210
981.1C74090880j5231430j2537986r813369p225394m923612k994090j455844l43650
997.4C19565505L47942O39886N82605K21819l91245j015455j319825j082629l62188
1015.7C17186415N61804J435488K238393L046513L819704M341036M420906M173279
1032C41223538L731400L046095K135396J286686Q68499J029789J556874K238631L169358
1050.4C60286266M505306O151050P748306R084523J0192871J1086881J1175603Q944809
1066.7D29175615L174156m776984j0927528j2180329r206414m931033j307994J375795
1083C90395284L435045M983366O063431O824643P147669O739021N567252L922910K285808
$$ plain form
966.8 511249721 492181003 472405910 452110767 431530982 411147714 391727090 374090880
981.1 374090880 358859450 346321464 336508095 329282701 324359089 321364999 319909155 319565505
997.4 319565505 319913447 320553333 321135938 321357757 320966512 319951057 318631232 317548603 317186415
1015.7 317186415 317748219 319183707 321422100 324468613 328288317 332629353 337050259 341223538
1032 341223538 344954938 348001033 350136429 351423115 352291614 353321403 354878277 357116908 360286266
1050.4 360286266 364791572 370942622 378690928 387775451 397968322 409055203 420230806 429175615
1066.7 429175615 432349771 427572787 416645259 404464930 395258516 390327483 389019489 390395284
1083 390395284 393830329 398813695 404877126 411701769 418849438 425588459 431155711 435078621 437364429
1101.4D37364429J233310J153588K014190L269225M197955M454583M099757L403455
1117.7D61190492K667427K096862J877486K209306L108025M202962M646658L628105
1134D85627323J128614k049565m992992p191896q477986q830875q219868o799728n001455
1152.4D35191572l235072j590997J24395K039253M098058O173015Q214831J0235042
1168.7D61250097J2117117J3522238J4167577J4159322J3928234J3676345J3116956
1183E55937886J1960745J0319591Q586049O973207N318939L596306K223909J559079
1199.3F06475711J537800J787781K029002K380729L045142L871440M446090M497051
1215.6F30070746M019797L166437K137780J092911J08361p63297j393020j645088j562953
$$ plain form
1101.4 437364429 438597739 439751327 441765517 445034742 449232697 453687280 457787037 461190492
1117.7 461190492 463857919 465954781 467832267 470041573 473149598 477352560 481999218 485627323
1134 485627323 486755937 484706372 479713380 472521484 464043498 455212623 446992755 440193027 435191572
1152.4 435191572 431956500 430365503 430489898 432529151 436627209 442800224 451015055 461250097
1168.7 461250097 473367214 486889452 501057029 515216351 529144585 542820930 555937886
1183 555937886 567898631 578218222 586804271 593777478 599096417 602692723 604916632 606475711
1199.3 606475711 608013511 609801292 611830294 614211023 617256165 621127605 625573695 630070746
1215.6 630070746 634090543 637256980 639394760 640487671 640596032 639832735 638439715 636794627 635231674
1234F35231674j396478j333415j245260q10147J1087Q20935J278937J457870J605808
1252.3F35621011J765013J683950J220942P15375O26445J037776J586199J779556J562178
1270.7F47598445J262963R97484N63145j44363q05318r63569p25210o46710r46283
1289F46190584j323819j454115j402259j472891j749575j935482j761079j446008j338482
1307.4F32306874j389802j384377j223147j020372j034677j334131j881659k621293
1323.7F20417416l440916m256070m840314m890264m369139l485441k367139j104415
1340E91663718j55329K27153L69727L74854J33812k82168o75321q77797j001835j183450
1360.4E88593364j193583q49843n46158k79784M2081K51293O29127J038790J174152
$$ plain form
1234 635231674 633835196 632501781 631256521 630446374 630457461 631278396 632557333 634015203 635621011
1252.3 635621011 637386024 639069974 640290916 641006291 641632736 642670512 644256711 646036267 647598445
1270.7 647598445 648861408 649858892 650422037 650277674 649472356 648508787 647783577 647136867 646190584
1289 646190584 644866765 643412650 642010391 640537500 638787925 636852443 635091364 633645356 632306874
1307.4 632306874 630917072 629532695 628309548 627289176 626254499 624920368 623038709 620417416
1323.7 620417416 616976500 612720430 607880116 602989852 598620713 595135272 592768133 591663718
1340 591663718 591508389 591735542 592105269 592480123 592613935 592331767 591656446 590778649 589776814 588593364
1360.4 588593364 587399781 586549938 586003780 585723996 585766077 586017370 586646497 587685287 588859439
1378.8E88859439J153529J242280J977562L562391M412532L287792J667798N18083
1395.1F06681406q9824l55184o20246j184165j626730j559735j445293j479089j539171
1413.5E96781969j626670j440943m13715M16398N17726O55651Q34286J242459J544118
1431.8E98511279J233160J404405K273381K186179J722574J214564N26488K9444l53396
1450.2F08748078j019477j828671k397537j239360N47052J120329K220571L792882
1466.5F09943867M308939N147576Q003354R630263Q551300P361710O709277O352484
1482.8F66008770N448878M668057M893661N469143M531384L470242L598809L764272
1499.1G01853216L089249J915991J173616K429366L445387K639174J897991J344800
$$ plain form
1378.8 588859439 590012968 591255248 593232810 596795201 601207733 604495525 606163323 606681406
1395.1 606681406 606591582 606236398 605616152 604431987 602805257 601245522 599800229 598321140 596781969
1413.5 596781969 595155299 593714356 593300641 593717039 594234765 594890416 595724702 596967161 598511279
1431.8 598511279 599744439 601148844 603422225 605608404 607330978 608545542 609072030 609101474 608748078
1450.2 608748078 607728601 605899930 603502393 602263033 602810085 603930414 606150985 609943867
1466.5 609943867 614252806 619400382 627403736 637033999 645585299 652947009 659656286 666008770
1482.8 666008770 671457648 676125705 681019366 686488509 691019893 694490135 698088944 701853216
1499.1 701853216 704942465 706858456 708032072 710461438 713906825 716545999 718443990 719788790
1515.4G19788790J222849J130461J459360K038956J861751J616240J095056N58496
1531.8G30771959Q23498Q28445l40462q83937O27398J529932J205683L65555k28047
1550.1G34700024l29554n22077j161575j415074N35488J074672J30474m65631p54893
1568.5G31791854m69208k91705q10146p72000j52349l42548q09193j016438j178682
1586.8G25949585j392781j641929j864911j987636k006709k149701k452612k639830
1603.2G09813476k756298k953410l160298l281236l534853m105807m059672k903998
1619.5F83057904k855479l364385l010928k664686k462208k243638k412140k056837
1635.8F61987603l94583K71261M6909k55645J41740J497448J404643J355230L880144
$$ plain form
1515.4 719788790 721011639 722142100 723601460 725640416 727502167 729118407 730213463 730771959
1531.8 730771959 731595457 732423902 732083440 731199503 731826901 733356833 734562516 734928071 734700024
1550.1 734700024 734370470 733848393 732686818 731271744 731807232 732881904 733012378 732546747 731791854
1568.5 731791854 731322646 731030941 730220795 729448795 729296446 728953898 728144705 727128267 725949585
1586.8 725949585 724556804 722914875 721049964 719062328 717055619 714905918 712453306 709813476
1603.2 709813476 707057178 704103768 700943470 697662234 694127381 690021574 685961902 683057904
1619.5 683057904 680202425 676838040 673827112 671162426 668700218 666456580 664044440 661987603
1635.8 661987603 661593020 661864281 661911190 661655545 661797285 663294733 664699376 666054606 669934750
1654.1F69934750M091262K941549K814591L489971L991843L236889L161788M242540
1670.5F97905183M149854M158616M701018L953338K883136K876222M956961N175114
1686.8G30759442L805637L417850K583027K036869K125085K237796K927900K464711
1703.1G52358317J783252K006889J847147J284302P89225O30796J469612K290606J812935
1721.5G66273081J451910J588225J451016J097798Q34346J486838K451539J852393
1737.8G78487146J470506J700163J727879J545966J453042K017081K773284K434791
1754.1G93609858J892745J700938J447677J583457J673699J151204N99742L82841Q95023
1772.4H04937184J594066J384676Q82328P11739P96079Q66235Q13365M17053O7890
$$ plain form
1654.1 669934750 674026012 676967561 679782152 683272123 687263966 690500855 693662643 697905183
1670.5 697905183 702055037 706213653 710914671 714868009 717751145 720627367 725584328 730759442
1686.8 730759442 734565079 737982929 740565956 742602825 744727910 746965706 749893606 752358317
1703.1 752358317 754141569 756148458 757995605 759279907 760069132 760699928 762169540 764460146 766273081
1721.5 766273081 767724991 769313216 770764232 771862030 772696376 774183214 776634753 778487146
1737.8 778487146 779957652 781657815 783385694 784931660 786384702 788401783 791175067 793609858
1754.1 793609858 795502603 797203541 798651218 800234675 801908374 803059578 803659320 804042161 804937184
1772.4 804937184 806531250 807915926 808798254 809509993 810306072 811172307 811985672 812402725 812470615
1790.8H12470615N27382J019120Q09789N38766O35922Q68142P79271N21242L92914
1809.2H18563163N29588O95109O20842N16117N07414L38256P1883R3401K29537M11392
1829.6H22576702P47025O51121L46422L34978K54572j43826k45572L35157O74069N30362
1850H26061010K78831J00315J04486J91510K24412J13368j37031l84689j35839N67019
1870.3H26983392O70910L07977J81139K74896K81215J70529R4354O6579J06155K85149
1890.7H29422295K88129J62125K36332K85327J64271K8193k2292j5736N5969J72674
1911.1H30777287J23084r1433j35303Q1003J55687J75417K91407K48015J01029J4425
1931.5H31740618K7716P7903N1201q6606j31130J02043K81632K34961J77026J51932
$$ plain form
1790.8 812470615 812997997 814017117 814826906 815365672 816001594 816869736 817649007 818170249 818563163
1809.2 818563163 819092751 819787860 820408702 820924819 821432233 821770489 821842372 821935773 822165310 822576702
1829.6 822576702 823323727 823974848 824321270 824656248 824910820 824766994 824521422 824856579 825530648 826061010
1850 826061010 826339841 826440156 826544642 826736152 826960564 827073932 826936901 826552212 826416373 826983392
1870.3 826983392 827654302 827962279 828143418 828418314 828699529 828870058 828964412 829030991 829137146 829422295
1890.7 829422295 829710424 829872549 830108881 830394208 830558479 830586672 830564380 830548644 830604613 830777287
1911.1 830777287 830900371 830808938 830673635 830754638 830910325 831085742 831377149 831625164 831726193 831740618
1931.5 831740618 831768334 831846237 831897438 831810832 831679702 831781745 832063377 832298338 832475364 832627296
1951.9H32627296J27256J22846J16825J06156J20520Q9884M1783J27077J99973J41681
1972.3H33821297R8288R7215O2764K2173M7266P9095L3737o4552j02282K0206J43171
1994.8H34258378P5399k4437k3544j4603n2751j38878k11656j94908j79648k80917
2015.2H33212435l54647l45111m16100n39124m75288j37746O0022o7413k07663k69353
2035.6H30460012l03566l04103k65897k22861j98067j48594q8811q8453j13905q0228
2056H28645527j609L6716j370l1770L4511J32025J41382N3584k5868O56M7564M5479
2080.4H29076827M7683O3658R7871J31786J30117Q7559L8981N8532J52230J92047J27017
2102.9H30204308O5684Q5414J43111J20639M5956N9664J27435J08838K1875k2054o497
$$ plain form
1951.9 832627296 832754552 832877398 832994223 833100379 833220899 833310783 833352566 833479643 833679616 833821297
1972.3 833821297 833919585 834016800 834079564 834101737 834149003 834228098 834261835 834197283 834095001 834115207 834258378
1994.8 834258378 834333777 834309340 834285796 834271193 834218442 834079564 833867908 833673000 833493352 833212435
2015.2 833212435 832857788 832512677 832096577 831557453 831082165 830944419 831004441 830937028 830729365 830460012
2035.6 830460012 830156446 829852343 829586446 829363585 829165518 829016924 828928113 828839660 828725755 828645527
2056 828645527 828643918 828680634 828679264 828647494 828682005 828814030 828955412 829008996 828983128 828983784 829031348 829076827
2080.4 829076827 829124510 829188168 829286039 829417825 829547942 829635501 829674482 829733014 829885244 830077291 830204308
2102.9 830204308 830269992 830355406 830498517 830619156 830665112 830724776 830852211 830961049 830982924 830960870 830954373
2125.3H30954373L1412M8220N245l1531J5497O3658N0604K4140J4186M1247P2121L8266
2149.8H31327438J2577Q8453J62721J52051J36972J74999K35856K69353K54869K60056
2170.2H33075345L16321L73662M08113L80039L21686L18528L43501L34203L01898K91347
2190.6H36464643L10362L22878L03030K69056K48849K80499L38316L23654K64227K65539
2211H39391053K99215L08991L03149K64525K31981K47598K51174K30908K21789K10464
2231.4H41960847J92643J71780J56284J59502J70826J74344J33514Q8990J17779J62721
2251.8H43489230J56343J20043J21594J72555J73390J16587Q9228J08481J61051J84775
2272.2H44893277J47283J26123J60575K01404J79827J10746P8559J06573J42813J15811
$$ plain form
2125.3 830954373 830985785 831034005 831039250 831007719 831023216 831086874 831137478 831161618 831175804 831217051 831289172 831327438
2149.8 831327438 831340015 831428468 831591189 831743240 831880212 832055211 832291067 832560420 832815289 833075345
2170.2 833075345 833391666 833765328 834173441 834553480 834875166 835193694 835537195 835871398 836173296 836464643
2190.6 836464643 836775005 837097883 837400913 837669969 837918818 838199317 838537633 838861287 839125514 839391053
2211 839391053 839690268 839999259 840302408 840566933 840798914 841046512 841297686 841528594 841750383 841960847
2231.4 841960847 842153490 842325270 842481554 842641056 842811882 842986226 843119740 843208730 843326509 843489230
2251.8 843489230 843645573 843765616 843887210 844059765 844233155 844349742 844438970 844547451 844708502 844893277
2272.2 844893277 845040560 845166683 845327258 845528662 845708489 845819235 845897794 846004367 846147180 846262991
2292.5H46262991M7744O4611J24693R2983J7822j2457K1755Q6606J11163N3584n1081
2315H46820414r1791k5094N5015N8830L457n1081m2379m0531j45853k54809k17080
2337.4H46069098q2493m6134r6500j07706r8288q4519l5882l6478j36376j30951n6625
2359.9H45157146o3657p0811r0658j15454j33574j79232j95324j55926j01566p7248
2380.2H43973696r2089j28448j65582j62601j11640p1644j01626j82152k33412k08020
2400.6H42516482j74165j80066k14278k77162k96295k68816k72036l15726l46362l39270
2421H39832306l21031l34322l98934m33981l93272l45409l71039m60744m87506l96550
2441.4H35889518l38614m12464m96387m86374m04597l52144l89457m44054m24922l64363
$$ plain form
2292.5 846262991 846310735 846375346 846500039 846593022 846610844 846598387 846620142 846706748 846817911 846871495 846820414
2315 846820414 846728623 846703529 846758544 846817374 846820831 846769750 846727371 846686840 846540987 846286178 846069098
2337.4 846069098 845986605 845940471 845843971 845736265 845637977 845553458 845517576 845481098 845344722 845213771 845157146
2359.9 845157146 845093489 845022678 844932020 844816566 844682992 844503760 844308436 844152510 844050944 843973696
2380.2 843973696 843881607 843753159 843587577 843424976 843313336 843241692 843140066 842957914 842724502 842516482
2400.6 842516482 842342317 842162251 841947973 841670811 841374516 841105700 840833664 840517938 840171576 839832306
2421 839832306 839511275 839176953 838778019 838344038 837950766 837605357 837234318 836773574 836286068 835889518
2441.4 835889518 835550904 835138440 834642053 834155679 833751082 833398938 833009481 832565427 832140505 831776142
2461.8H31776142l44932l69251m02271l97206l35991k86639l31283m08649l96431l28719
2482.2H28174770k99513k82884k74241l04937k98381k55227k33770k20477k11180k12133
2502.6H25582027k23279k28643k24709k17379k04384j98722k27392k79069l33189l70741
2523H23074520l33131k78830l38137m41790m58598m12703l97980m42445m92215m91619
2543.4H18987072m33267l93331m36067m95613m99725m51207m03405m34339m82917m34935
2563.8H14522266l89516m28438m74870m88878m58121l83973l28183l72172m81069m88877
2584.2H10228169l82960l29375l52621l34084k92838k83539k70248k99811l75807l99649
2604.6H06907237l79920l91484m33445m64916n00560n57601o06597o52969p21693p80224
$$ plain form
2461.8 831776142 831431210 831061959 830659688 830262482 829926491 829639852 829308569 828899920 828503489 828174770
2482.2 828174770 827875257 827592373 827318132 827013195 826714814 826459587 826225817 826005340 825794160 825582027
2502.6 825582027 825358748 825130105 824905396 824688017 824483633 824284911 824057519 823778450 823445261 823074520
2523 823074520 822741389 822462559 822124422 821682632 821224034 820811331 820413351 819970906 819478691 818987072
2543.4 818987072 818553805 818160474 817724407 817228794 816729069 816277862 815874457 815440118 814957201 814522266
2563.8 814522266 814132750 813704312 813229442 812740564 812282443 811898470 811570287 811198115 810717046 810228169
2584.2 810228169 809845209 809515834 809163213 808829129 808536291 808252752 807982504 807682693 807306886 806907237
2604.6 806907237 806527317 806135833 805702388 805237472 804736912 804179311 803572714 802919745 802198052 801417828
2625H01417828q01087p95424p73847p90119q66234r04084q61823q39472q68976r05216
2645.4G93011546r24408q90196q25166q03292q38518q65102q46446q25166p92265p71463
2665.8G84629524q04007p93517p19368p02739p36356o94394o25968o35386o74426p15554
2686.2G77527809p40528p02083o51658o79910p70807q13723p69555p57158q27193q73983
2706.6G69941211q77798q63075q28803q31008q49962q02040p36415p20024p31469p46846
2727G61953771p18534o61015o40870o23941n83470n58972n48423n59985n93841n91934
2747.4G55872786n49912n36085n68568n48542m71413m45604m60446m63009m64857m86672
2767.8G50877678n12302n24342n38766n74827o39737p05659p37727p57575q00371q75473
$$ plain form
2625 801417828 800616741 799821317 799047470 798257351 797391117 796487033 795625210 794785738 793916762 793011546
2645.4 793011546 792087138 791196942 790371776 789568484 788729966 787864864 787018418 786193252 785400987 784629524
2665.8 784629524 783825517 783032000 782312632 781609893 780873537 780179143 779553175 778917789 778243363 777527809
2686.2 777527809 776787281 776085198 775433540 774753630 773982823 773169100 772399545 771642387 770815194 769941211
2706.6 769941211 769063413 768200338 767371535 766540527 765690565 764888525 764152110 763432086 762700617 761953771
2727 761953771 761235237 760574222 759933352 759309411 758725941 758166969 757618546 757058561 756464720 755872786
2747.4 755872786 755322874 754786789 754218221 753669679 753198266 752752662 752292216 751829207 751364350 750877678
2767.8 750877678 750365376 749841034 749302268 748727441 748087704 747382045 746644318 745886743 745086372 744210899
2788.2G44210899r52602r96887j043439j094639j150549j225293j267552j290321j356960
2806.5G33832657j460969j569092j626075j624047j641512j713634j822531j893819
2822.8G20480978j915454j995504k107084k159119k209305k319932k463460k632916
2839.1G02678204k824784l026247l240466l410697l428519l233313k896726k559424
2855.5F78058028k350807k383411k665698l090501l555954m009187m376829m633367
2871.8F50992274m867136n002856m853785m451931l913105l323137k726376k111793
2888.1F19742155j542389j091302p79986o53267o83904p52389q80659j136899j429856
2906.5F10791504j710653k092957k637208l190041l558158l700436l625989l334939
$$ plain form
2788.2 744210899 743258297 742261410 741217971 740123332 738972783 737747490 736479938 735189617 733832657
2806.5 733832657 732371688 730802596 729176521 727552474 725910962 724197328 722374797 720480978
2822.8 720480978 718565524 716570020 714462936 712303817 710094512 707774580 705311120 702678204
2839.1 702678204 699853420 696827173 693586707 690176010 686747491 683514178 680617452 678058028
2855.5 678058028 675707221 673323810 670658112 667567611 664011657 660002470 655625641 650992274
2871.8 650992274 646125138 641122282 636268497 631816566 627903461 624580324 621853948 619742155
2888.1 619742155 618199766 617108464 616328478 615675211 614991307 614238918 613358259 612221360 610791504
2906.5 610791504 609080851 606987894 604350686 601160645 597602487 593902051 590276062 586941123
2922.8E86941123k835572k100467j245916m14074N54919J716435K812446L723383M445970
2941.1E93598247M909694N139768N221665N255103N280793N224883N123854N096853
2957.4F34850860N067646M885554M571200M239499L959954L738404L605604L534853
2973.8F68453574L452182L378034L260612L028572K764404K555429K374769K171218
2990.1F91438794J872063J525223J291394J053930P33435M65750K36571K5452j43409
3008.4F98499203l55065o43134r13084j114130j294434j462936j562119j636147j734734
3026.8F87783420j800895j827299j851261j974702k126038k123237k107977k228380
3043.1F71743631k393424k462864k390742k353907k441525k510190k540648k546609
$$ plain form
2922.8 586941123 584105551 582005084 580759168 580345094 580900013 582616448 585428894 589152277 593598247
2941.1 593598247 598507941 603647709 608869374 614124477 619405270 624630153 629754007 634850860
2957.4 634850860 639918506 644804060 649375260 653614759 657574713 661313117 664918721 668453574
2973.8 668453574 671905756 675283790 678544402 681572974 684337378 686892807 689267576 691438794
2990.1 691438794 693310857 694836080 696127474 697181404 697914839 698380589 698617160 698642612 698499203
3008.4 698499203 698144138 697501004 696587920 695473790 694179356 692716420 691154301 689518154 687783420
3026.8 687783420 685982525 684155226 682303965 680329263 678203225 676079988 673972011 671743631
3043.1 671743631 669350207 666887343 664496601 662142694 659701169 657190979 654650331 652103722
3059.4F52103722k493501k440512k443969k530396k637804k677440k605379k420902
3075.7F31853819k342045k493084k654910k721429k728045k675712k690196k793074
3092.1F10755324k782642k632499k523899k566278k691031k695560k544165k496660
3108.4E89822590k620101k603769k422750k379596k542734k802730k950907k827406
3124.7E68672597k565503k428114k515495k617478k541066k390980k384603k561808
3141E48667550k657473k553940k405882k271056k227843k411067k621174k543151k353728
3159.4E26622236k298892k293825k283931k270341k229213k204657k205193k172470
3175.7E08663714k129793k087057k052128k060652k074271k054990k034366k042711
$$ plain form
3059.4 652103722 649610221 647169709 644725740 642195344 639557540 636880100 634274721 631853819
3075.7 631853819 629511774 627018690 624363780 621642351 618914306 616238594 613548398 610755324
3092.1 610755324 607972682 605340183 602816284 600250006 597558975 594863415 592319250 589822590
3108.4 589822590 587202489 584598720 582175970 579796374 577253640 574450910 571500003 568672597
3124.7 568672597 566107094 563678980 561163485 558546007 556004941 553613961 551229358 548667550
3141 548667550 546010077 543456137 541050255 538779199 536551356 534140289 531519115 528975964 526622236
3159.4 526622236 524323344 522029519 519745588 517475247 515246034 513041377 510836184 508663714
3175.7 508663714 506533921 504446864 502394736 500334084 498259813 496204823 494170457 492127746
3192D92127746k017051j937180j879752j864433j854092j828432j786858j763761j755059
3210.3D75441128j700342j638859j627326j641751j652061j626999j584381j556903
3226.7D62412506j465231j304209j268059j446486j622229j572431j391053j253932
3243D51088876j176626j226157j362055j317978j131267j067906j153797j187533j100094
3261.3D40365463j011192r23455p93248p33972q79020j064747j105696j039088r29803
3279.7D31885242q87036r24855r26257q27133o93053o80834p98792r50158j054495
3298D24142629r81391p49617o14018p80850j104504j279026j238376j109422j046985
3316.4D15238440j055658j002401q84145q93921j100481j224011j128554j014769r30667
$$ plain form
3192 492127746 490110695 488173515 486293763 484429330 482575238 480746806 478959948 477196187 475441128
3210.3 475441128 473740786 472101927 470474601 468832850 467180789 465553790 463969409 462412506
3226.7 462412506 460947275 459643066 458375007 456928521 455306292 453733861 452342808 451088876
3243 451088876 449912250 448686093 447324038 446006060 444874793 443806887 442653090 441465557 440365463
3261.3 440365463 439354271 438430816 437637568 436903596 436024576 434959829 433854133 432815045 431885242
3279.7 431885242 430998206 430073351 429147094 428319961 427626908 426946074 426147282 425197124 424142629
3298 424142629 423161238 422411621 421797603 421016753 419912249 418633223 417394847 416285425 415238440
3316.4 415238440 414182782 413180381 412296236 411402315 410301834 409077823 407949269 406934500 406003833
3334.8D06003833q79228r97573j157940j200110j220852j143515r94772j092284j325280
3353.1C95992279j328260j135975j016170j080691j109124r02801p98554j064270j382619
3371.5C86173815j367063j109898r49472r12190r21756q73893o86109m18335k34425
3389.8C78700674m24415q15004p55281k66850j17331n38350q63432o62119l62306k54006
3410.2C73641580k67356m35353n33074l57330j41620p7576m1485Q1540K29060K75642
3430.6C72374028L01421L31610J57297j17213q5979K12132M19349N10842N34504N35578
3451C75173569N98997O88433P84904Q22157P15643P42555J049548J172632Q16703M20361
3471.4C82985502M90577Q41677J095324J035482Q15004Q78513J096100J070589R75877
$$ plain form
3334.8 406003833 405124605 404127032 402969092 401768982 400548130 399404615 398409843 397317559 395992279
3353.1 395992279 394664019 393528044 392511874 391431183 390322059 389419258 388620704 387556434 386173815
3371.5 386173815 384806752 383696854 382747382 381835192 380913436 380039543 379353434 378935099 378700674
3389.8 378700674 378276259 377461255 376705974 376439124 376321793 375783443 374920011 374257892 373895586 373641580
3410.2 373641580 373374224 372938871 372405797 372048467 371906847 371829271 371787786 371869326 372098386 372374028
3430.6 372374028 372675449 373007059 373164356 373047143 372961164 373173296 373592645 374103487 374637991 375173569
3451 375173569 375772566 376460999 377245903 378068060 378783703 379526258 380575806 381748438 382565141 382985502
3471.4 382985502 383476079 384317756 385413080 386448562 387263566 388142079 389238179 390308768 391284645
3489.8C91284645J075059J187861J195371J116514J071632J128495J083284R58532
3506.1D00101393J042247J343787J564562J424790J134395J103938J332849J545102
3522.4D10593063J413315J195371J336843J578689J659482J718790J660585J520425
3538.7D22676563J623988J781762J751542J636446J634836J751661J951695K109974
3555D36918467K152235K216339K158373J809925J798451K825111L525406L051669K696574
3573.4D59152550K818971L020287L247023L347843L089190K878308L349662L892660
3589.7D84796494L605336L394246L683329L896922L932267L913582L582358L251970
3606E14056504L558039L915132L903985L935515L780544L961027M654765M350722L326595
$$ plain form
3489.8 391284645 392359704 393547565 394742936 395859450 396931082 398059577 399142861 400101393
3506.1 400101393 401143640 402487427 404051989 405476779 406611174 407715112 409047961 410593063
3522.4 410593063 412006378 413201749 414538592 416117281 417776763 419495553 421156138 422676563
3538.7 422676563 424300551 426082313 427833855 429470301 431105137 432856798 434808493 436918467
3555 436918467 439070702 441287041 443445414 445255339 447053790 449878901 453404307 456455976 459152550
3573.4 459152550 461971521 464991808 468238831 471586674 474675864 477554172 480903834 484796494
3589.7 484796494 488401830 491796076 495479405 499376327 503308594 507222176 510804534 514056504
3606 514056504 517614543 521529675 525433660 529369175 533149719 537110746 541765511 546116233 549442828
3624.4E49442828K692342L436326M711271M352391L921926L836333L678322L541827
3640.7E79613566L230036K615392K313495L379166M679084M085481L387630L804922
3657F07108772L925502L245115K723158K445102K081811K135038K633214K298475K389729
3675.4F30985916L401637L436208K990722K493501J943469J705468K060532K624870
3691.7F51642323K618908K199412J747250J457692J601934J867414J544356R33468
3708F65612757Q09729J637459K310753J904905J301586J032412J032293J101017J249314
3726.4F77992225J297593Q22842K74956N97477J684547J945614J094282J04129J39714
3744.7F85953379Q81850O69659Q93652J937985J818061J040876Q85487J304984J178086
$$ plain form
3624.4 549442828 552135170 555571496 560282767 564635158 568557084 572393417 576071739 579613566
3640.7 579613566 582843602 585458994 587772489 591151655 595830739 599916220 603303850 607108772
3657 607108772 611034274 614279389 617002547 619447649 621529460 623664498 626297712 628596187 630985916
3675.4 630985916 634387553 637823761 640814483 643307984 645251453 646956921 649017453 651642323
3691.7 651642323 654261231 656460643 658207893 659665585 661267519 663134933 664679289 665612757
3708 665612757 666422486 668059945 670370698 672275603 673577189 674609601 675641894 676742911 677992225
3726.4 677992225 679289818 680112660 680387616 680985093 682669640 684615254 685709536 685813665 685953379
3744.7 685953379 686835229 687504888 688398540 690336525 692154586 693195462 694080949 695385933 696564019
3763.1F96564019P49588O67333P70390J077474J213491R06288N78582N63085P68781
3781.4G03859031P66754P40767Q57949Q81553O95348L02612J03057K06053M5240K85387
3801.8G08743751J010597R65059J044333J215577P10427J133j27077K22206K58386
3820.2G14044392Q03232J205743Q45551N90444L87251K67267K57492l0994j6570P05719
3840.6G19059527J141906J124561P92622P5996q28505r00447R77218J774490R71317
3858.9G24188685J81258q8572L08036M01974o258K54273Q21173J019180P12812N6326
3879.3G27848887P8559M12643M19498N44607L84689K44796N39422M16219j59621m42088
3899.7G30287611j43170M89235J078904J086056O26683K31505j5200j47044P7605L64065
$$ plain form
3763.1 696564019 697313607 697980940 698751330 699828804 701042295 701948583 702527165 703090250 703859031
3781.4 703859031 704625785 705366552 706224501 707106054 707801402 708104014 708207071 708413124 708458364 708743751
3801.8 708743751 709754348 710719407 711763740 712979317 713689744 713690877 713563800 713786006 714044392
3820.2 714044392 714847624 716053367 716898918 717489362 717876613 718143880 718401372 718370378 718353808 719059527
3840.6 719059527 720201433 721325994 722118616 722194612 721366107 720465660 721442878 723217368 724188685
3858.9 724188685 724369943 724281371 724589407 724991381 724985123 725239396 726060569 727079749 727792561 727848887
3879.3 727848887 727927446 728340089 728759587 729304194 729688883 729933679 730473101 730889320 730729699 730287611
3899.7 730287611 730144441 730633676 731712580 732798636 733425319 733656824 733641624 733494580 733572185 733936250
3920.1G33936250K14040O6460K60114K83599J02937K61426N38588M21286J02937j19209
3940.5G36068428n5433K21014K96653K43306L13997L45051K42710J24276J01388J39057
3960.9G38040447J71542K27034K45095J80065J05381Q4162J47641K40743K78652K68996
3981.3G39989758J91152O4492j8656J9788J24753J35243J42872K15054
3997.6G40864456
$$ plain form
3920.1 733936250 734150290 734216750 734476864 734760463 734863400 735124826 735663414 736084700 736187637 736068428
3940.5 736068428 736012995 736234009 736530662 736773968 737087965 737433016 737675726 737800002 737901390 738040447
3960.9 738040447 738211989 738439023 738684118 738864183 738969564 739053726 739201367 739442110 739720762 739989758
3981.3 739989758 740180910 740245402 740226746 740246534 740371287 740506530 740649402 740864456
3997.6 740864456
##END=$$ End of the data block
