##TITLE=$$ Begin of the data block
##JCAMP-DX=5.00 $$ ACD/SpecManager v 10.08
##SPECTROMETER/DATA SYSTEM=16PC
##DATE=02 May 2013 19:05:16
##DATA TYPE=INFRARED SPECTRUM
##DATA CLASS=XYDATA
##ORIGIN=
##OWNER=
##NPOINTS=3601
##FIRSTX=400.00000000
##LASTX=4000.00000000
##MAXX=4000.00000000
##MINX=400.00000000
##MAXY=73.19026947
##MINY=33.04601288
##XFACTOR=1.0000000000
##YFACTOR=0.000000100000000
##FIRSTY=33.68251801
##DELTAX=1.00000000
##XUNITS=1/CM
##YUNITS=TRANSMITTANCE
##XYDATA=(X++(Y..Y))
400C36825180Q6334953O6042900M0461808J7895622L758812j239586k43835K355308
408E52191162L502846K588386Q11997l35007k74544M78592R91631P31811j14555r45282
418E59627037j288757j126519p90367o14051o74286q09937q38547p46688o83175p98835
428E51255875j091767j404800j558685j497956j321296j188012j189460j299324j423302
437E39281273j491852j504974j504669j513482j508445j448555j326180j183662j079788
446E26719666j038704j028138r91363q98323p71485o64062o12755o09321o14052n93682
456E18897781n44471m82369m11835l09906j46980P8087L22533N25055O55555P43904
466E19327354Q59528J054649J316224J571350J744766J826935J897583K085037K484970
$$ y = [336825180, 423160133, 489203033, 529664841, 547560463, 551319275, 550079689, 549835854, 552191162, 555694008, 558282394, 559094391, 558759384, 558484840, 558963432, 559955063, 560686874, 560572319, 559627037, 558338280, 557211761, 556421394, 555807343, 555133057, 554323120, 553484573, 552737885, 552054710, 551255875, 550164108, 548759308, 547200623, 545702667, 544381371, 543193359, 542003899, 540704575, 539281273, 537789421, 536284447, 534779778, 533266296, 531757851, 530309296, 528983116, 527799454, 526719666, 525680962, 524652824, 523661461, 522763138, 521991653, 521327591, 520714836, 520105515, 519491463, 518897781, 518353310, 517870941, 517459106, 517149200, 517002220, 517080307, 517402840, 517927895, 518583450, 519327354, 520186882, 521241531, 522557755, 524129105, 525873871, 527700806, 529598389, 531683426, 534168396]
475E34168396L096046L812447M474564M945793N169105N177803N065995M938354M862709
484E75711212M848786M852676M812851M696121M534035M419975M463234M719086N137367
493F18195343N566673N822182N778542N432777M900436M345703L892899L570175L314972
502F60819702L029328K644653K160110J637650J167755Q24738O39419N87845O02417
511F74113617N98755N06592L01971J8005k69088m76914n57251n22461m38232l91007
521F72883987m43420o08749q45337j079483j240006j291351j249161j176376j155625
530F63794479j248474j459961j726455j939011j995316j851959j548309j182175q58459
539F49984360o29196m71802l14102q8196K19574N52139Q09021R02252Q03681N64727
$$ y = [534168396, 537264442, 541076889, 545551453, 550497246, 555666351, 560844154, 565910149, 570848503, 575711212, 580559998, 585412674, 590225525, 594921646, 599455681, 603875656, 608338890, 613057976, 618195343, 623762016, 629584198, 635362740, 640795517, 645695953, 650041656, 653934555, 657504730, 660819702, 663849030, 666493683, 668653793, 670291443, 671459198, 672283936, 672923355, 673511200, 674113617, 674712372, 675218964, 675520935, 675538940, 675269852, 674792938, 674235687, 673713226, 673274994, 672883987, 672440567, 671831818, 670986481, 669906998, 668666992, 667375641, 666126480, 664950104, 663794479, 662546005, 661086044, 659359589, 657420578, 655425262, 653573303, 652024994, 650842819, 649984360, 649355164, 648883362, 648569260, 648481064, 648700638, 649252777, 650061798, 650964050, 651767731, 652332458]
549F52332458K95105J11771Q2932J95465L59192M51507L79563J35192j98211m81720
559F53663254n94483m99191k62146j7700J06964N8441j15890l02964l90014l27835
569F51318436j51139M5777J65329J59301N0354q2168j45035p7972J15204L67736N80292
580F52346115O67496O02035M28696K46506J58767K22474M17022O56662Q32596Q68683
590F57447052P57217N60151L76129K90222L36761M87671O69022Q01773Q35953P72476
600F63334427O57806N54886N12772N42450O17523O91070P23038O99005O30799N46951
610F69510727M75540M34952M31061M60281N12085N69229O13709O31942O25000O07529
620F74872055N97611N98449N87998N26809L82080J55411j08948l43780m94995n54581
$$ y = [652332458, 652627563, 652739334, 652822266, 653017731, 653376923, 653828430, 654207993, 654343185, 654144974, 653663254, 653068771, 652569580, 652307434, 652289734, 652396698, 652455139, 652339249, 652036285, 651646271, 651318436, 651167297, 651213074, 651378403, 651537704, 651588058, 651505890, 651360855, 651282883, 651398087, 651765823, 652346115, 653013611, 653615646, 654044342, 654290848, 654449615, 654672089, 655089111, 655745773, 656578369, 657447052, 658204269, 658764420, 659140549, 659430771, 659767532, 660255203, 660924225, 661725998, 662561951, 663334427, 663992233, 664547119, 665059891, 665602341, 666219864, 666910934, 667633972, 668332977, 668963776, 669510727, 669986267, 670421219, 670852280, 671312561, 671824646, 672393875, 673007584, 673639526, 674264526, 674872055, 675469666, 676068115, 676656113, 677182922, 677565002, 677720413, 677611465, 677267685, 676772690, 676218109]
630F76218109n64194n92346o91376q68988j079101j245117j294251j189194r47875
639F67745667o35758l45077j52665q3542r3154q5297L5019L01590O55060R70001J125717
650F69437561J081390R00422P08160O03180N94177O04553N42221L82843J91346O2713
660F75108566K1973l3875k87704q69064j719513k565537l037185k871171k077941r59168
670F60709381L7613N45502M47082j01928p95670j357269j661301j745529j729660j716080
680F52632141j739197j782531j825409j874466j954651k074051k201576k275315k242393
689F34662552k093010j866341j622886j404915j212960j011924p60727m39148o2523
698F24188118L28674O86531R74274J177101J303978J385803J466065J587524J773720
$$ y = [676218109, 675653915, 675061569, 674370193, 673501205, 672422104, 671176987, 669882736, 668693542, 667745667, 667109909, 666764832, 666612167, 666528625, 666435471, 666350174, 666385193, 666686783, 667341843, 668311844, 669437561, 670518951, 671419373, 672127533, 672730713, 673324890, 673929443, 674471664, 674854507, 675045853, 675108566, 675130539, 675096664, 674808960, 673939896, 672220383, 669654846, 666617661, 663746490, 661668549, 660709381, 660746994, 661292496, 661739578, 661637650, 660841980, 659484711, 657823410, 656077881, 654348221, 652632141, 650892944, 649110413, 647285004, 645410538, 643455887, 641381836, 639180260, 636904945, 634662552, 632569542, 630703201, 629080315, 627675400, 626462440, 625450516, 624689789, 624250641, 624188118, 624516792, 625203323, 626177597, 627354698, 628658676, 630044479, 631510544, 633098068, 634871788]
707F34871788K013893K262802K455292K534866K478180K304535K065659J820831J614151
716F54421997J462402J354752J269379J186752J100693J022491R72138R66034J001205
725F64757843J048813J059341R86176Q09555N55954K90451Q7051j1062j8463k060m4403
736F69519196j97907m50516p30285r41849j016464r47419p90863o36749n57937n78080
746F62671127o60324p31582p23038o09207m20761k32087j22909j37863k63977m36707
756F58332672n73044o13403n51300m35028l37906l21198m01306n44433o86951p70874
766F53097229p69958p01905o13556n56717n63202o29425p24411q00018q18405p65533
776F46154099o59256n41459m59671m44717m97208n85861o62079o83899o35833n36728
$$ y = [634871788, 636885681, 639148483, 641603775, 644138641, 646616821, 648921356, 650987015, 652807846, 654421997, 655884399, 657239151, 658508530, 659695282, 660795975, 661818466, 662790604, 663756638, 664757843, 665806656, 666865997, 667852173, 668661728, 669217682, 669508133, 669595184, 669584122, 669565659, 669563599, 669519196, 669321289, 668870773, 668140488, 667198639, 666182175, 665234756, 664443893, 663807144, 663249207, 662671127, 662010803, 661279221, 660556183, 659946976, 659526215, 659294128, 659171219, 659033356, 658769379, 658332672, 657759628, 657146225, 656594925, 656159897, 655821991, 655500793, 655099487, 654555054, 653868103, 653097229, 652327271, 651625366, 651011810, 650455093, 649891891, 649262466, 648538055, 647738037, 646919632, 646154099, 645494843, 644953384, 644493713, 644048996, 643551788, 642965927, 642303848, 641619949, 640984116, 640447388]
786F40447388m30374l61214l54309m00353m61845m91600m56810l52440k04391n2529
796F36881523P1259J60026K37084L43704N17006P68623J075859J388092J648636J818543
806F44910355J894302J905975J905594J939926K030564K163009K294617K373886K367325
815F63785553K276840K142945K027130J985702K042465K178955K341996K474441K543106
824F83799133K557679K562637K610931K730332K903747L073731L171615L156586L037338
833G09603729K872391K735748K676544K685090K692794K601929K334061J868210J253051
842G31323547N79148o0273o14471j083832j504059j905670k281799k578354k719192
851G19155045k645188k353668j909561j426850j025466p85218p18307p70569q47550
$$ y = [640447388, 640017014, 639655800, 639301491, 638901138, 638439293, 637947693, 637490883, 637138443, 636934052, 636881523, 636952782, 637112808, 637349892, 637693596, 638210602, 638979225, 640055084, 641443176, 643091812, 644910355, 646804657, 648710632, 650616226, 652556152, 654586716, 656749725, 659044342, 661418228, 663785553, 666062393, 668205338, 670232468, 672218170, 674260635, 676439590, 678781586, 681256027, 683799133, 686356812, 688919449, 691530380, 694260712, 697164459, 700238190, 703409805, 706566391, 709603729, 712476120, 715211868, 717888412, 720573502, 723266296, 725868225, 728202286, 730070496, 731323547, 731902695, 731842422, 731227951, 730144119, 728640060, 726734390, 724452591, 721874237, 719155045, 716509857, 714156189, 712246628, 710819778, 709794312, 709009094, 708290787, 707520218, 706672668]
860G06672668q58306p50657n30777k54135J145J72500K37427K19803J72348J45874
870G05227890J61209J95236J96762J09559r3384l95508p39670j053696j281509j405868
880G00921021j455155j484756j550141j678543j857986k043457k181931k242203k228012
889F84198837k180176k153167k188263k291794k432022k556152k616501k595444k514038
898F62671280k421188k368927k387009k465592k558593k604142k550048k379151k116089
907F40820541j816749j541977j331673j185493j068802r33876p49664n24254l04337
916F31363716j53961j21994k13509l84559n60837o71272o82679o10542n10101m43535
926F27010727m48723n19791o13403o72264o55556n60341m21981k96288k32201k50206
$$ y = [706672668, 705814362, 705063705, 704532928, 704278793, 704279938, 704452438, 704689865, 704909668, 705082016, 705227890, 705389099, 705584335, 705781097, 705890656, 705797272, 705401764, 704662094, 703608398, 702326889, 700921021, 699465866, 697981110, 696430969, 694752426, 692894440, 690850983, 688669052, 686426849, 684198837, 682018661, 679865494, 677677231, 675385437, 672953415, 670397263, 667780762, 665185318, 662671280, 660250092, 657881165, 655494156, 653028564, 650469971, 647865829, 645315781, 642936630, 640820541, 639003792, 637461815, 636130142, 634944649, 633875847, 632941971, 632192307, 631668053, 631363716, 631209755, 631087761, 630874252, 630489693, 629928856, 629257584, 628574905, 627964363, 627454262, 627010727, 626562004, 626042213, 625428810, 624756546, 624100990, 623540649, 623118668, 622822380, 622590179, 622339973]
936F22339973l32298m33502n03120n09110m52385l66249l00064k94685l61824m76952
946F18309784n90134o50253o30837n45921m42886l80707l98941m96712o34117p52334
956F12786942q05779p84798p22885o75773o93360p91206r41353j085663j163521j141624
966F03980980j030693q81081p60650p25212p97654r61761j176949j403198j622696
975E94621086j847916k112541k448692k865486l337517l812447m231491m553566m770355
984E64641075m905853m999199n084038n169105n236245n249290n175324n002899m752502
993E19066620m470024m210320m015808l902931l860512l859634l873520l888855l913231
1002D83071785l965645m064293m211769m392052m572792m720268m811859m844742m835892
$$ y = [622339973, 622007675, 621574173, 621071053, 620561943, 620109558, 619743309, 619443245, 619148560, 618786736, 618309784, 617719650, 617069397, 616438560, 615892639, 615449753, 615069046, 614670105, 614173393, 613539276, 612786942, 611981163, 611196365, 610473480, 609797707, 609104347, 608313141, 607371788, 606286125, 605122604, 603980980, 602950287, 602069206, 601308556, 600583344, 599785690, 598823929, 597646980, 596243782, 594621086, 592773170, 590660629, 588211937, 585346451, 582008934, 578196487, 573964996, 569411430, 564641075, 559735222, 554736023, 549651985, 544482880, 539246635, 533997345, 528822021, 523819122, 519066620, 514596596, 510386276, 506370468, 502467537, 498607025, 494747391, 490873871, 486985016, 483071785, 479106140, 475041847, 470830078, 466438026, 461865234, 457144966, 452333107, 447488365, 442652473]
1011D42652473m813690m802398m812088m832268m838867m804879m716606m581032m423904
1020D00026741m277306m163475m084701m022293l947869l838234l687667l508416l323402
1029C65173378l152008l000412k861214k717056k551155k355843k133827j896057j657257
1038C42848549j429749j221237j034050q65784p11784n67436m31862l07884k03629
1047C36075134j28898r0523q7471j11046j44463j71241j80321j70975j51672j34697
1057C34703827j30119j39161j55410j65863j60561j34735r3155m6806p897J5908K4566
1068C33710594K6169L2578N3291R0217J35346J74103J91803J81465J48277J08070P9804
1079C34931717P5340R3994J22338J41067J36414J07612O7253L4600K5253M2267P5264
$$ y = [442652473, 437838783, 433036385, 428224297, 423392029, 418553162, 413748283, 409031677, 404450645, 400026741, 395749435, 391585960, 387501259, 383478966, 379531097, 375692863, 372005196, 368496780, 365173378, 362021370, 359020958, 356159744, 353442688, 350891533, 348535690, 346401863, 344505806, 342848549, 341418800, 340197563, 339163513, 338297729, 337585945, 337018509, 336586647, 336278763, 336075134, 335946236, 335855713, 335768242, 335657196, 335512733, 335341492, 335161171, 334990196, 334838524, 334703827, 334573708, 334434547, 334279137, 334113274, 333952713, 333817978, 333724823, 333678017, 333670120, 333686028, 333710594, 333736763, 333769341, 333822632, 333912849, 334048195, 334222298, 334414101, 334595566, 334743843, 334851913, 334931717, 335007057, 335101051, 335223389, 335364456, 335500870, 335608482, 335675735, 335710335, 335735588, 335777855, 335853119]
1090C35853119J05514J15433R6855N5847P172l1433m9095m6539l5706l3073n2376r7504
1102C35888214j60141k23961k72140k95182k95028k83013k74353k79121k98576l23792
1112C33182907l41530l40118l17116k78397k36549k04163j87950j84669j84670j75132
1122C30732613j46294r5978l0212M0321J05667J58997K02179K40898K84004L37372
1132C31829567M02565M75922N51490O23970O92711P62215Q40416R35058J048470J176529
1142C39338913J308365J430588J532325J610108J667976J715241J761512J811676J863442
1151C54040146J907997J933289J929245J891517J824265J737404J643600J553154J469536
1160C69930153J389694J308441J221962J133538J055564J002541R88884J020012J090813
$$ y = [335853119, 335958633, 336074066, 336170921, 336226768, 336233940, 336202507, 336153412, 336106873, 336071167, 336038094, 335985718, 335888214, 335728073, 335504112, 335231972, 334936790, 334641762, 334358749, 334084396, 333805275, 333506699, 333182907, 332841377, 332501259, 332184143, 331905746, 331669197, 331465034, 331277084, 331092415, 330907745, 330732613, 330586319, 330490341, 330460129, 330500450, 330606117, 330765114, 330967293, 331208191, 331492195, 331829567, 332232132, 332708054, 333259544, 333883514, 334576225, 335338440, 336178856, 337113914, 338162384, 339338913, 340647278, 342077866, 343610191, 345220299, 346888275, 348603516, 350365028, 352176704, 354040146, 355948143, 357881432, 359810677, 361702194, 363526459, 365263863, 366907463, 368460617, 369930153, 371319847, 372628288, 373850250, 374983788, 376039352, 377041893, 378030777, 379050789, 380141602]
1169C80141602J187553J293869J396408J489143J573296J655464J740723J829376J914139
1178C94221573J979751K008973J987762J911507J788292J636352J478615J334343J215553
1187D09562721J124802J060448J021919J013222J042289J116295J235848J391029J562729
1196D20131302J728554J869812J979026K060967K130966K206078K298965K410011K529183
1205D39344864K639122K726097K784882K824287K863045K920990L011627L134804L278656
1214D65528374L424530L556137L665390L754921L833237L908348L979225M034538M054527
1223D99739227M018669L913536L738556L503189L221627K905159K557182K177315J768989
1232E27543449J349144R51615O22368M06875L34130M06303N96848Q58421J138496J394730
$$ y = [380141602, 381329155, 382623024, 384019432, 385508575, 387081871, 388737335, 390478058, 392307434, 394221573, 396201324, 398210297, 400198059, 402109566, 403897858, 405534210, 407012825, 408347168, 409562721, 410687523, 411747971, 412769890, 413783112, 414825401, 415941696, 417177544, 418568573, 420131302, 421859856, 423729668, 425708694, 427769661, 429900627, 432106705, 434405670, 436815681, 439344864, 441983986, 444710083, 447494965, 450319252, 453182297, 456103287, 459114914, 462249718, 465528374, 468952904, 472509041, 476174431, 479929352, 483762589, 487670937, 491650162, 495684700, 499739227, 503757896, 507671432, 511409988, 514913177, 518134804, 521039963, 523597145, 525774460, 527543449, 528892593, 529844208, 530466576, 530873451, 531207581, 531613884, 532210732, 533069153, 534207649, 535602379]
1242E35602379J605949J774063J917725K059517K214355K381287K543640K677918K766380
1251E55543213K804756K804909K785797K760925K725792K656059K514000K263794J887245
1260E78746490J395035Q23822K29073l31307q08944j171646j402779j495056j444855
1269E74539833j247177r01375m16832J79100Q38661J499634K098503K585640K936402
1278E82112389L154716L265343L300323L286591L235779L145485L005638K810249K565880
1287F09882393K294121K025871J789894J600342J450767J318398J174583J002083Q02879
1296F23341331N96619M10690K62337J48544M4709q4229k67296n13572q07114j108932
1306F22023087j370049j541939j586647j483612j230087q40874l45764K14806P95517
$$ y = [535602379, 537208328, 538982391, 540900116, 542959633, 545173988, 547555275, 550098915, 552776833, 555543213, 558347969, 561152878, 563938675, 566699600, 569425392, 572081451, 574595451, 576859245, 578746490, 580141525, 580965347, 581194420, 580863113, 580054169, 578882523, 577479744, 575984688, 574539833, 573292656, 572391281, 571974449, 572153549, 572992210, 574491844, 576590347, 579175987, 582112389, 585267105, 588532448, 591832771, 595119362, 598355141, 601500626, 604506264, 607316513, 609882393, 612176514, 614202385, 615992279, 617592621, 619043388, 620361786, 621536369, 622538452, 623341331, 623937950, 624348640, 624610977, 624759521, 624804230, 624720001, 624452705, 623939133, 623132019, 622023087, 620653038, 619111099, 617524452, 616040840, 614810753, 613969879, 613624115, 613838921, 614634438]
1315F14634438J349029J834297K218361K481613K618828K640190K570381K443467K295570
1324F35086174K157021K043991J957092J882706J802139J700821J575775J434784J291046
1333F50931549J151810J013946Q63266O86875M83246K68020P0038q3466j78146k20642
1343F54986496k29263k24076k14157j96686j62200j00708n112J31302L15933N51605
1353F54853134Q26264J104888J333390J459274J455078J334915J150055R63822Q22982
1362F65303802P41349P04345O87027O71616O54678O37436O16303N77621N06134L94745
1372F71495056K54593J08948j4496r1782j06735n0125P7744K60162M61120O31562P29828
1383F73755875P45010P09229O83975P26776Q53805J024781J156921J165924J009827
$$ y = [614634438, 615983467, 617817764, 620036125, 622517738, 625136566, 627776756, 630347137, 632790604, 635086174, 637243195, 639287186, 641244278, 643126984, 644929123, 646629944, 648205719, 649640503, 650931549, 652083359, 653097305, 653960571, 654647446, 655130692, 655398712, 655468750, 655385284, 655207138, 654986496, 654757233, 654533157, 654319000, 654122314, 653960114, 653859406, 653854294, 653985596, 654301529, 654853134, 655679398, 656784286, 658117676, 659576950, 661032028, 662366943, 663516998, 664480820, 665303802, 666045151, 666749496, 667436523, 668108139, 668762817, 669400253, 670016556, 670594177, 671100311, 671495056, 671749649, 671858597, 671844101, 671752319, 671645584, 671595459, 671673203, 671933365, 672394485, 673026047, 673755875, 674500885, 675210114, 675894089, 676620865, 677474670, 678499451, 679656372, 680822296, 681832123]
1392F81832123P09533L42331M425k30331l39661l57589l51715l89557n02472o73676
1402F80043411q47168r61075r80377r14917q06808o93588n78309m19616j63880K07901
1412F73885574O46592J041793J271820J271973J073532P97501N94864N72357P44552
1421F81900558J025391J274033J357269J205368Q37555L42636j65710o07453r74273
1430F86195374j325608j743316k261429k816086l252640l391113l122711k476349j613159
1439F64192963p49436n9509L89328O27747P32193P69882P87658Q34732R78699J275788
1449F69780045J698989K088623K183609J755753P70493n27878j691590k284240k115097
1458F71658707j352616m35257J72577K27738j79367p16935j034698r77554o61698l78647
$$ y = [681832123, 682541656, 682883987, 682888412, 682658081, 682318420, 681960831, 681609116, 681219559, 680717087, 680043411, 679196243, 678235168, 677254791, 676339874, 675533066, 674839478, 674261169, 673841553, 673677673, 673885574, 674532166, 675573959, 676845779, 678117752, 679191284, 679988785, 680583649, 681156006, 681900558, 682925949, 684199982, 685557251, 686762619, 687600174, 687942810, 687777100, 687169647, 686195374, 684869766, 683126450, 680865021, 678048935, 674796295, 671405182, 668282471, 665806122, 664192963, 663443527, 663384018, 663773346, 664401093, 665133286, 665903168, 666690826, 667525558, 668504257, 669780045, 671479034, 673567657, 675751266, 677507019, 678277512, 677749634, 676058044, 673773804, 671658707, 670306091, 669870834, 670043411, 670271149, 670091782, 669374847, 668340149, 667362595, 666700897, 666322250]
1468F66322250m00467q11615j460800k047577k285308k037278j363449m66690M19922
1477F55868988J138306J650085K018738K337875K661133K963104L153992L135300K866516
1486F77794037K406921J904984J537781J426620J568222J825485J985474J870651J443787
1495F93763962Q54492L81927K97089P00913J436920K135238K382660J938782Q73108
1504G04765091m57306j583557k158356k115326j667862j159439q69827q90808j131363
1513F92731247j421738j627655j700134j649094j487121j199112p66525k08130M05960
1522F83077698R84497J464844J836242K115402K299805K349854K225418J950302J645737
1531F99949799J481628J568832J859360K141342K144928J702652Q61664j25656r28116
$$ y = [666322250, 665921783, 665110168, 663649368, 661601791, 659316483, 657279205, 655915756, 655449066, 655868988, 657007294, 658657379, 660676117, 663013992, 665675125, 668638229, 671792221, 674927521, 677794037, 680200958, 682105942, 683643723, 685070343, 686638565, 688464050, 690449524, 692320175, 693763962, 694618454, 695000381, 695297470, 695998383, 697435303, 699570541, 701953201, 703891983, 704765091, 704307785, 702724228, 700565872, 698450546, 696782684, 695623245, 694753418, 693862610, 692731247, 691309509, 689681854, 687981720, 686332626, 684845505, 683646393, 682879868, 682671738, 683077698, 684062195, 685527039, 687363281, 689478683, 691778488, 694128342, 696353760, 698304062, 699949799, 701431427, 703000259, 704859619, 707000961, 709145889, 710848541, 711710205, 711584549, 710656433]
1540G10656433j297226j173782o86112o4315M72183P92999Q79669Q12683P31888P80182
1550G11904602J035690J447678J818161J864014J356582K75650j117859k352829k952041
1559G13279648k667389j619797k54669Q61282J305390R83047J40991p81936j382675
1568G09863892j477738j158218p02973m04358m10614o59484r32084r91287p20443j84021
1578G02222672M11758Q37402R58863P89108M57687J19095j26038k61535l27225l72543
1588G04709244m23050m83704n55038o45523p60498q87680r96476j056900j066131j052017
1598F96782227j052781j085205j135025j176834j208801j260910j367798j517639j633606
1607F85343628j611023j402588j083374q38928q62274j224823j804276k335739k555618
$$ y = [710656433, 709359207, 708185425, 707499313, 707434998, 707907181, 708700180, 709579849, 710392532, 711124420, 711904602, 712940292, 714387970, 716206131, 718070145, 719426727, 719702377, 718584518, 716231689, 713279648, 710612259, 708992462, 708737793, 709599075, 710904465, 711887512, 712028503, 711246567, 709863892, 708386154, 707227936, 706524963, 706120605, 705709991, 705050507, 704118423, 703127136, 702406693, 702222672, 702634430, 703471832, 704430695, 705219803, 705677490, 705796585, 705670547, 705409012, 705081787, 704709244, 704286194, 703802490, 703247452, 702601929, 701841431, 700953751, 699957275, 698900375, 697834244, 696782227, 695729446, 694644241, 693509216, 692332382, 691123581, 689862671, 688494873, 686977234, 685343628, 683732605, 682330017, 681246643, 680407715, 679545441, 678320618, 676516342, 674180603, 671624985]
1616F71624985k355652j843338j276856r16290q93021j164321j569748j931000k130966
1625F57543793k133408j965637j698380j445465j367111j644287k406387l643036n151139
1634F36088943o573677p519950p720490p132759n943337m465065k979393j613960l10631
1643E91829681J092835K714653M492874O145897P265587P510872O809196N445748L977050
1652F37284393K986985K809372L366470M220657M820786M801712M170837L269577K546005
1661F70276794K283402K449493K757340K875747K648011K171707J700592J447067J433411
1670F90043564J492996J416245J130981P82623O49185R42688J632081K408828K833863
1679G03333054K582321J638183L27835q35876j404877j205597l96652O42014J512909
$$ y = [671624985, 669269333, 667425995, 666149139, 665232849, 664339828, 663175507, 661605759, 659674759, 657543793, 655410385, 653444748, 651746368, 650300903, 648933792, 647289505, 644883118, 641240082, 636088943, 629515266, 621995316, 614274826, 607142067, 601198730, 596733665, 593754272, 592140312, 591829681, 592922516, 595637169, 600130043, 606275940, 613541527, 621052399, 627861595, 633307343, 637284393, 640271378, 643080750, 646447220, 650667877, 655488663, 660290375, 664461212, 667730789, 670276794, 672560196, 675009689, 677767029, 680642776, 683290787, 685462494, 687163086, 688610153, 690043564, 691536560, 692952805, 694083786, 694866409, 695515594, 696458282, 698090363, 700499191, 703333054, 705915375, 707553558, 707881393, 707045517, 705640640, 704435043, 704038391, 704680405, 706193314]
1688G06193314J981430K043914J859589J617737J415176J220246R30175M75083j06278
1697G17630386o59637r91745r75189o26679j05362L63159O03409N77088M00085K72446
1707G16487961L65372P21435J217117J615143J675110J273651M74930m80270j268464
1716G22081985j617202j425400q06274l6393N74799Q36563P63779N59463M84314O90155
1726G22105789J111908J488953J514892J033554J56556p69577j343842j330643p85904
1735G23181686k1896N80139P79495N94559K57034N0431J30462M46625P90482R34066
1745G27723083P64008L33252j80054n74951p20138n98145k89688P7820L82614N44968
1755G27462769N40466L94516J66397o7520k32773k72064j54801J08261M59290P91550
$$ y = [706193314, 708174744, 710218658, 712078247, 713695984, 715111160, 716331406, 717261581, 717736664, 717630386, 716970749, 715979004, 715003815, 714377136, 714271774, 714634933, 715238342, 715815430, 716215515, 716487961, 716853333, 717574768, 718791885, 720407028, 722082138, 723355789, 723830719, 723350449, 722081985, 720464783, 719039383, 718233109, 718196716, 718771515, 719608078, 720371857, 720931320, 721415634, 722105789, 723217697, 724706650, 726221542, 727255096, 727411652, 726642075, 725298233, 723967590, 723181686, 723159790, 723739929, 724519424, 725113983, 725371017, 725421448, 725551910, 725998535, 726789017, 727723083, 728487091, 728820343, 728640289, 728065338, 727345200, 726747055, 726457367, 726535187, 726917801, 727462769, 728003235, 728397751, 728564148, 728496628, 728263855, 727991791, 727836990, 727945251, 728404541, 729196091]
1765G29196091R74960R01260N39399k7543o19659j028519j112442q61816m02985P3471
1775G27632217M02909N15136M39606K60086O0349j02234j89057j65786r384K60543
1785G29104385N54734P30743O60248L14712j93252o49262q45337o96029k87018J70593
1795G28864517M57154M57611K11639j26877l82385m45557l16391q2702J36108K49786
1805G29022903K28577J07041m4938j58386j94855j62201r9258n0049l2348k9908p400
1816G28579178N7373J54419K43149K83661K64816K10876J56174J13907N9814m5318
1826G30078049k12403m00390n28870n29709l95584j90277l433J10702J68381K33612
1836G28330078L53546N00489N75561M71191J55335k85492o80237q64639p74384m76226
$$ y = [729196091, 730171051, 731072311, 731611710, 731584167, 730964508, 729935989, 728823547, 727961731, 727558746, 727632217, 728035126, 728550262, 728989868, 729249954, 729310303, 729208069, 729019012, 728853226, 728843842, 729104385, 729659119, 730389862, 731050110, 731364822, 731171570, 730522308, 729676971, 728980942, 728693924, 728864517, 729321671, 729779282, 729990921, 729864044, 729481659, 729036102, 728719711, 728637009, 728773117, 729022903, 729251480, 729358521, 729313583, 729155197, 728960342, 728798141, 728698883, 728648834, 728616486, 728586578, 728579178, 728636551, 728790970, 729034119, 729317780, 729582596, 729793472, 729949646, 730063553, 730123367, 730078049, 729865646, 729465256, 728936386, 728406677, 728011093, 727820816, 727817383, 727928085, 728096466, 728330078, 728683624, 729184113, 729759674, 730230865, 730386200, 730100708, 729420471, 728555832, 727781448, 727305222]
1846G27305222j22147J37329K32163J90353R7275L4408L0289O1340Q1482O2638J4572
1857G28124924k0905K747J07956K72751M35714N16281M50669K28347r4680m10614o03791
1868G29009399o07147m34723j73568O3171J93024K01568J33896N7602J7166J8540L9520
1879G28518448N8441P2861R5291J29852J61591J60675J07269J1749q5830j40457j31836
1890G28958054p7897k0217N188p248l3417m3640k5559P553L0594L0136J7395J5488
1902G28856430L8071P2250Q4839N0049k6245j01471j20392n4398P5913K05307K61307
1913G29341660K05688N7449j19323k51999k97013k57644j74713r6665n4092m9591o4316
1924G28239441p5531p1488n4321l5400k5864l0212m3411n4474n0049k2660K6169Q1787
$$ y = [727305222, 727183075, 727320404, 727552567, 727742920, 727840195, 727874603, 727904892, 727966232, 728047714, 728110352, 728124924, 728104019, 728106766, 728214722, 728487473, 728923187, 729439468, 729890137, 730118484, 730023804, 729613190, 729009399, 728402252, 727967529, 727793961, 727857132, 728050156, 728251724, 728385620, 728443222, 728460388, 728478928, 728518448, 728576889, 728649750, 728745041, 728874893, 729036484, 729197159, 729304428, 729316177, 729230347, 729089890, 728958054, 728880157, 728859940, 728865128, 728857880, 728824463, 728780823, 728755264, 728762817, 728793411, 728823547, 728840942, 728856430, 728894501, 728966751, 729051590, 729101639, 729075394, 728973923, 728853531, 728799133, 728875046, 729080353, 729341660, 729547348, 729604797, 729485474, 729233475, 728936462, 728678818, 728504105, 728407440, 728353348, 728303757, 728239441, 728163910, 728092422, 728038101, 728002701, 727976837, 727946625, 727903214, 727848740, 727798691, 727776031, 727802200, 727883987]
1936G27883987J19858J15586N6457m9133j70059k66495l05252k76718j97678j02005
1946G26808548k5024J3504J3198j0604l9368n9509o8283o8589o4621n7144m4403k3956
1958G26373749K670K9297M6616M5700K2583j9761o9808j13373j35880j31149j01776
1969G25948868o0806k4262m730o256k3880m5166n9891o2866n5542m3717l0746j6556
1981G25514450L891L3188O9046J00021J10398Q7433L0365m6616j17340j55792j47477
1992G25481567r7885k8686L0212N7984N0735K1515p858k0371j2207P248K1668J9760
2004G25523682K136k0294l1052j9379J4420N6457Q5907Q4305M5700j9989q8195j30311
2016G25503387j28402q2703j4496M4709O8435M8752J144m5623o4469m6768m806L5553
$$ y = [727883987, 728003845, 728119431, 728175888, 728126755, 727956696, 727690201, 727384949, 727108231, 726910553, 726808548, 726783524, 726797028, 726810226, 726799622, 726760254, 726700745, 726632462, 726563873, 726499252, 726442108, 726397705, 726373749, 726376419, 726405716, 726452332, 726498032, 726520615, 726500854, 726431046, 726317673, 726181793, 726050644, 725948868, 725888062, 725863800, 725859070, 725852814, 725828934, 725783768, 725723877, 725661011, 725605469, 725561752, 725531006, 725514450, 725518341, 725551529, 725620575, 725720596, 725830994, 725918427, 725948792, 725902176, 725784836, 725629044, 725481567, 725383682, 725354996, 725385208, 725443192, 725493927, 725515442, 725507584, 725487213, 725475006, 725482254, 725503922, 725523682, 725525818, 725505524, 725474472, 725455093, 725469513, 725525970, 725611877, 725696182, 725741882, 725721893, 725633698, 725503387, 725374985, 725292282, 725277786, 725322495, 725390930, 725439682, 725440826, 725395203, 725330734, 725283966, 725279160, 725314713]
2028G25314713N0735L2196p324m4022n6839l7994Q39L6926M8676K6321k2201p5531
2040G25266495j08719j05438o5537n646M8600P4386O2332K1210k7923o0502o2789l6927
2052G24999542R16K9602L5705J7853j0605l1509l2349j2588J6861L7536L5935R231
2064G25096130l3187p1335q8044p4386l6163R613M2877M9209K7924r079m3564n9814
2076G24810181n1499k5482N264K6780L1356K0905M501p324o866O332K6321M3564M9591
2089G24933624M1352K0599m959k4414l0899k1210L05K4643M1962M5776L6087J9989
2101G25082855P553Q087K3499M8141P0801P8354O5689L6392K747k0294k2202l204K7695
2114G25406113N4626O5003N4855L0670N798n722K747K8305N9052Q0337Q1558O2409
$$ y = [725314713, 725365448, 725397644, 725390320, 725346298, 725289459, 725251465, 725252304, 725289230, 725337906, 725364227, 725342026, 725266495, 725157776, 725052338, 724986801, 724981155, 725029755, 725104141, 725166473, 725187683, 725159760, 725099258, 725036469, 724999542, 725000458, 725030060, 725065765, 725083618, 725073013, 725041504, 725009155, 724996567, 725013428, 725050964, 725086899, 725096130, 725062943, 724991608, 724903564, 724829178, 724793015, 724802628, 724845505, 724894714, 724922638, 724913559, 724869995, 724810181, 724758682, 724733200, 724738464, 724765244, 724796600, 724817505, 724822006, 724814682, 724807816, 724814148, 724840469, 724884033, 724933624, 724974976, 724995575, 724990616, 724966202, 724935303, 724914093, 724914398, 724939041, 724981003, 725026779, 725062866, 725082855, 725090408, 725098495, 725121994, 725170135, 725240936, 725319290, 725384979, 725421371, 725424118, 725403824, 725381622, 725378418, 725406113, 725460739, 725525742, 725580597, 725611267, 725617065, 725611343, 725614090, 725642395, 725701447, 725781784, 725863342, 725925751]
2126G25925751L1585M731m883P477L5247O3172P6065O6223L7994N951j3427r003J7700
2139G26244583N3635Q1711Q8577P1258L9063P629p705K28K7543O0424Q3161Q5144O4316
2152G26899567L0517j831j9226j6479K975K7466M5166M8141L6927J8844L739o11P553
2165G27082748K3652L9138M6158M0131K3193L281j0529j0834L434K6169M7683N8213
2177G27372437N3329L5400J2436o180j3427q087O027K0828K9984K8686J8540N798j984
2190G27553787J679J7242L7842N2795N2414L3875M730k2125l3493k5101l586J7090
2202G27687149K2965Q850j9074m7150o1721n6992l7079j3580K060L738o408k0981l1586
2215G27430191l1967k2431o256J0910K3499K9907K8839K3117J4649P477K899K289M043
$$ y = [725925751, 725957336, 725962067, 725957184, 725964661, 725999908, 726063080, 726139145, 726205368, 726243362, 726249313, 726235886, 726226883, 726244583, 726298218, 726379929, 726468506, 726539764, 726578827, 726586456, 726578751, 726578979, 726606522, 726666946, 726750107, 726835251, 726899567, 726930084, 726928253, 726909027, 726892548, 726895523, 726922989, 726968155, 727016296, 727053223, 727072067, 727075806, 727075195, 727082748, 727106400, 727145538, 727191696, 727231827, 727255020, 727258301, 727247772, 727236938, 727240372, 727266541, 727314224, 727372437, 727425766, 727461166, 727473602, 727467422, 727453995, 727445908, 727451935, 727472763, 727502747, 727531433, 727549973, 727555771, 727553787, 727555466, 727572708, 727610550, 727663345, 727715759, 727749634, 727754364, 727732239, 727698746, 727673645, 727670059, 727687149, 727710114, 727718964, 727699890, 727652740, 727591019, 727534027, 727496948, 727483368, 727485428, 727489166, 727482758, 727461777, 727430191, 727398224, 727375793, 727369537, 727380447, 727403946, 727433853, 727462692, 727485809, 727500458, 727507935, 727510834, 727513123, 727517166]
2228G27517166P095Q393P705N951N265Q316J4801K2354K5711K1744R613n646j8005
2241G27630463k1363j4724j221J2665K0981K1209J4572K900j0148k3193l4408m1199
2253G27556534m1580l4714k3651j4267j2284k1133l8376n7068o9275o9580n7830m0436
2265G27076340k5559j9912k5483l7841m8523m9363l6544j4267Q239K1439K1744J5487
2277G26885757J5336L2501O8664J11618J40152J34201Q5297K060r4528j79444k33459
2288G26968155k50855k36892k06986j78451j64719j72043j95083k19880k29949k14768
2298G24898529j77536j34430j07498j14746j59989k33459l19443m03213m76456n33905
2308G22237854n67932n66712n19866m30146l21350k38037k33307l45001n75333q81118
$$ y = [727517166, 727524261, 727532654, 727540359, 727546310, 727551575, 727559891, 727574692, 727597046, 727622757, 727644501, 727654114, 727648468, 727630463, 727609100, 727594376, 727593155, 727605820, 727626801, 727648010, 727662582, 727665482, 727655334, 727632141, 727597733, 727556534, 727514954, 727480240, 727456589, 727442322, 727430038, 727408905, 727370529, 727313461, 727244186, 727174606, 727116776, 727076340, 727050781, 727030869, 727005386, 726967545, 726919022, 726869659, 726833115, 726818848, 726827087, 726848526, 726870270, 726885757, 726901093, 726933594, 727002258, 727113876, 727254028, 727388229, 727473526, 727475586, 727381058, 727201614, 726968155, 726717300, 726480408, 726273422, 726094971, 725930252, 725758209, 725563126, 725343246, 725113297, 724898529, 724720993, 724586563, 724479065, 724364319, 724204330, 723970871, 723651428, 723248215, 722771759, 722237854, 721669922, 721103210, 720583344, 720153198, 719831848, 719593811, 719360504, 719015503, 718440170, 717559052]
2318G17559052j178589j372452j394653j238327r73511p22733o06308o80847r02100
2327G08489532j143722j263809j184693r36279o35986m13513l38898l96805n31006
2336G01644821p14187r80683j380386j878357k275162k238922j460571J34277K252960
2345F93103790M283066N527115N512619M211960K048416l04794k226487l380432l778457
2354G04996796l666153l335724k976990k638702k285157j881942j443482j019592o52237
2363F85096817l41492n1498K56576N91736R27506J222763J449890J611786J734085
2372F92498169J849365J979065K127304K285538K435455K553787K612153K586212K463073
2381G13390121K249985J973496J669922J370620J092758Q39310O10047M08630K46200
$$ y = [717559052, 716380463, 715008011, 713613358, 712375031, 711401520, 710678787, 710072479, 709391632, 708489532, 707345810, 706082001, 704897308, 703961029, 703325043, 702911530, 702572632, 702175827, 701644821, 700930634, 699949951, 698569565, 696691208, 694416046, 692177124, 690716553, 690850830, 693103790, 697386856, 702913971, 708426590, 712638550, 714686966, 714382172, 712155685, 708775253, 704996796, 701330643, 697994919, 695017929, 692379227, 690094070, 688212128, 686768646, 685749054, 685096817, 684755325, 684703827, 684960403, 685552139, 686479645, 687702408, 689152298, 690764084, 692498169, 694347534, 696326599, 698453903, 700739441, 703174896, 705728683, 708340836, 710927048, 713390121, 715640106, 717613602, 719283524, 720654144, 721746902, 722586212, 723196259, 723604889, 723851089]
2390G23851089J33667P4082N6381O0272O3782N3177K7466n341l3188m5471m0512k2888
2402G24172516l204O561j297k6093n7678q2397q7967p1869m1733j2360L510p63j9836
2415G23777390m3259n9281o2027n3558m0130l0365k8306l4637m5166n3864n6991n2948
2427G23216858m3564l3188k4414j8768j4801j1673q698p934j1826k1896l6316n0659
2439G22933121o0349o2408n7221m8828m1504l7994l8834m2495m6311m8752m9133n0201
2451G22349091n3559o0806p1487q1635q7128q5220p6370o6376o1951o7901q3924j03454
2463G21449280j17645j20011j10397r3994p9270p2326p3624p9575q3618q1787p3624
2474G20463409o2942n5161n3863o0730p2250q3390q7051q0109o3019m1275k2583j3961
$$ y = [723851089, 723984756, 724058838, 724115219, 724175491, 724239273, 724292450, 724319916, 724314575, 724281387, 724235916, 724195404, 724172516, 724169312, 724175873, 724174576, 724148483, 724090805, 724008408, 723920441, 723848572, 723806839, 723794479, 723797989, 723797226, 723777390, 723734131, 723674850, 723612823, 723559265, 723519135, 723488770, 723460464, 723425827, 723380661, 723326797, 723269806, 723216858, 723173294, 723140106, 723115692, 723096924, 723082123, 723070450, 723061752, 723053818, 723041992, 723020096, 722983780, 722933121, 722872772, 722810364, 722753143, 722704315, 722662811, 722624817, 722585983, 722543488, 722497177, 722448425, 722399292, 722349091, 722295532, 722234726, 722163239, 722081604, 721994476, 721909256, 721832886, 721766510, 721704559, 721636658, 721552734, 721449280, 721331635, 721211624, 721101227, 721007233, 720927963, 720855637, 720782013, 720702438, 720618820, 720537033, 720463409, 720400467, 720345306, 720291443, 720230713, 720158463, 720075073, 719988022, 719907913, 719844894, 719803619, 719781036, 719767075]
2486G19767075j7167k8762m1428m8523m7302l9292l0059k4338k3728k6474k9144k7923
2498G19382935k2812j5183q468n112o714j2589k0294k7313l2425l3798l2349k9602
2510G19136276k6397k3423k1057j7929j5564j4496j6403k2125l0747l9978m7378n0659
2522G18810120n0049m6616m2419l9673l9139m1122m6540n4473o4850p6523q7204r4757
2534G18126755r6665r2163q1939o9733o0120n6534o0043o9046p8659q4839q6288q4153
2546G17206573q3923q7738r6054j04217j05896r7580q0643o1417m7989m5547n4093
2557G16341476o7291p6523p5531o2866m2648k2965j0605j0070j9150l3112m5318n0888
2569G15824509m9057m3412l8986l8681m4021n1194n5465n2948m2572k7390j2665m043
$$ y = [719767075, 719749908, 719721146, 719679718, 719631195, 719583893, 719544601, 719514542, 719490204, 719466476, 719440002, 719410858, 719382935, 719360123, 719344940, 719336472, 719331360, 719324646, 719312057, 719291763, 719264450, 719232025, 719198227, 719165878, 719136276, 719109879, 719086456, 719065399, 719047470, 719031906, 719017410, 719001007, 718978882, 718948135, 718908157, 718860779, 718810120, 718760071, 718713455, 718671036, 718631363, 718592224, 718551102, 718504562, 718450089, 718385239, 718308716, 718221512, 718126755, 718030090, 717937927, 717855988, 717786255, 717726135, 717669601, 717609558, 717540512, 717461853, 717377014, 717290726, 717206573, 717122650, 717034912, 716938858, 716834641, 716728745, 716631165, 716550522, 716489105, 716441116, 716395569, 716341476, 716274185, 716197662, 716122131, 716059265, 716016617, 715993652, 715983047, 715972977, 715953827, 715920715, 715875397, 715824509, 715775452, 715732040, 715693054, 715654373, 715610352, 715559158, 715503693, 715450745, 715408173, 715380783, 715368118, 715364075]
2581G15364075m044j2817k6932m2877n5390o2790o4468o2637o0349o0196o2332o5307
2593G14783936o5155o0273n1193m2343l8452m3030n5237p0495q2856q7814q5678p8430
2605G14022980p1183o6299o4926o6452o9885p5150q1711q8882r3765r2698q3694o7596
2617G13100739m7837l0975k0371j7395j9149k1515k1286j7777j4496j5411k2354l4943
2629G12817230m8675n8747o1645n7373m8905m1351l8757m2725n2643o4621p5073q0795
2641G12145920p9193p1564o0120m9820m4479m6768n5771o8817q1253q9722r3231r2163
2653G11313019q8730q3389p5455o4240n0277l6774k8915l1281m4327o4239q3618r5673
2665G10566101r7275r1476q3618q0643q4610r3155j00326j01929r5673q5373p6370
$$ y = [715364075, 715360031, 715347214, 715320282, 715277405, 715222015, 715159225, 715094757, 715032120, 714971771, 714911575, 714849243, 714783936, 714718781, 714658508, 714607315, 714564972, 714526520, 714483490, 714428253, 714357758, 714274902, 714187088, 714101410, 714022980, 713951797, 713885498, 713820572, 713754120, 713684235, 713609085, 713527374, 713438492, 713344727, 713252029, 713168335, 713100739, 713052902, 713021927, 713001556, 712984161, 712965012, 712943497, 712922211, 712904434, 712889938, 712874527, 712852173, 712817230, 712768555, 712709808, 712648163, 712590790, 712541885, 712500534, 712461777, 712419052, 712366409, 712301788, 712226715, 712145920, 712066727, 711995163, 711935043, 711885223, 711840744, 711793976, 711738205, 711669388, 711588135, 711498413, 711405182, 711313019, 711224289, 711140900, 711065445, 711001205, 710950928, 710914154, 710885239, 710853958, 710809631, 710745392, 710661774, 710566101, 710468826, 710377350, 710293732, 710213089, 710128479, 710035324, 709934998, 709833069, 709737396, 709652023, 709575653]
2676G09575653p3852p9117q9722j00098j06048j05133r7657q7051p5607o5003n5771
2687G08640594m7149l9520l3417l0136Tl3722l8071m2191m4097m3946m3640m6463n4321
2700G08113785o6300q0566r1858r5978r1476q0261o8284o1340o2179o9809p8659q2856
2712G07184219p9498p0114o1340n9510o7520q2397r6512j01090r3231p5455n7907n1269
2724G06288376o1875q7966j19477j43051j47858j31912j02081p1259n0201m5090n2261
2735G05275345o3400p0420o9809o4773o0349o1722o8512p5912p8506p4997o8741o7368
2747G04450836p6141r5215j17950j34278j37329j27258j10474r7580r5215j03912j17874
2758G03237610j28555j30768j24283j13831j04751r9106r4986q8882p8202o4239n2567
$$ y = [709575653, 709501801, 709422684, 709332962, 709232864, 709126816, 709021683, 708924026, 708836975, 708761368, 708696365, 708640594, 708593445, 708553925, 708520508, 708490372, 708460236, 708426514, 708388443, 708346252, 708302155, 708258209, 708214569, 708168106, 708113785, 708047485, 707966919, 707875061, 707779083, 707687607, 707607346, 707539062, 707477722, 707415543, 707345734, 707267075, 707184219, 707104721, 707034607, 706973267, 706913757, 706846237, 706763840, 706667328, 706566238, 706473007, 706397552, 706339645, 706288376, 706226501, 706138535, 706019058, 705876007, 705728149, 705596237, 705494156, 705422897, 705372696, 705327606, 705275345, 705211945, 705141525, 705071716, 705006943, 704946594, 704884872, 704816360, 704740448, 704661942, 704586945, 704518204, 704450836, 704374695, 704279480, 704161530, 704027252, 703889923, 703762665, 703652191, 703554611, 703459396, 703355484, 703237610, 703109055, 702978287, 702854004, 702740173, 702635422, 702536316, 702441330, 702352448, 702274246, 702210007, 702157440]
2769G02157440m8828n7602p8125j06201j35193j59454j75171j82190j82266j78452
2779G00853958j73187j68533j65863j66169j69830j78986j94244k16217k42233k68021
2789F98910675k87247k95028k90680k77710k62757k52838k51846k57950k67563k73971
2799F96193085k74201k67944k55661k40707k24228k08130j93634j81885j74179j70059
2809F94002457j67084j62506j53198j38932j23062j09787j03454j05820j15662j29394
2819F92693558j44348j59836j77002j98364k25754k56653k88162l14713l33557l44315
2829F90250854l51333l59726l74603l99094m32281m73862n21164n74417o32172o93130
2839F85439072p55387q15811q70666r17740r56116r84192j000366j002731r88388r57032
$$ y = [702157440, 702108612, 702051010, 701972885, 701866684, 701731491, 701572037, 701396866, 701214676, 701032410, 700853958, 700680771, 700512238, 700346375, 700180206, 700010376, 699831390, 699637146, 699420929, 699178696, 698910675, 698623428, 698328400, 698037720, 697760010, 697497253, 697244415, 696992569, 696734619, 696467056, 696193085, 695918884, 695650940, 695395279, 695154572, 694930344, 694722214, 694528580, 694346695, 694172516, 694002457, 693835373, 693672867, 693519669, 693380737, 693257675, 693147888, 693044434, 692938614, 692822952, 692693558, 692549210, 692389374, 692212372, 692014008, 691788254, 691531601, 691243439, 690928726, 690595169, 690250854, 689899521, 689539795, 689165192, 688766098, 688333817, 687859955, 687338791, 686764374, 686132202, 685439072, 684683685, 683867874, 682997208, 682079468, 681123352, 680139160, 679138794, 678136063, 677147675, 676190643]
2849F76190643r09195q48083p77741p04116o33774n73960n32760n15976n26123n60227
2859F69608688o10962o67419p21359p67365q04596q35113q62580q88366r12400r32235
2869F61606293r45664r49783r42841r24530q95767q60748q24814p95898p81098p85141
2879F52900009q09250q51059r04159r61151j013260j052170j070862j063537j027756
2888F44146805r63593q75625p71103o58570n47103m44031l55034k84500k35367k09923
2898F38801956k10609k37313k89459l62854m50554n43823o33240p09915p69806q13141
2908F33781242q44993q73795r07097r48982r98268j047325j087341j109353j110267
2917F24853821j091805j060028j023330r87244r54971r25827q98743q73528q53576
$$ y = [676190643, 675281448, 674433365, 673655624, 672951508, 672317734, 671743774, 671211014, 670695038, 670168915, 669608688, 668997726, 668330307, 667608948, 666841583, 666036987, 665201874, 664339294, 663450928, 662538528, 661606293, 660660629, 659710846, 658768005, 657843475, 656947708, 656086960, 655262146, 654466248, 653685150, 652900009, 652090759, 651239700, 650335541, 649374390, 648361130, 647308960, 646238098, 645174561, 644146805, 643183212, 642307587, 641536484, 640877914, 640330811, 639886780, 639531746, 639247246, 639011879, 638801956, 638591347, 638354034, 638064575, 637701721, 637251167, 636707344, 636074104, 635364189, 634594383, 633781242, 632936249, 632062454, 631155357, 630206375, 629208107, 628160782, 627073441, 625964088, 624853821, 623762016, 622701988, 621678658, 620691414, 619736443, 618810616, 617911873, 617038345, 616184769]
2926F16184769q44193q49876q71887r02825r29909r36164r08013q38432p31163n97191
2936F07775116m49944l00941j57700k5787Q7433J72043K15530K08817J50032M7760
2946F07722359q1635k17628l41225m36668m92745n02090m61006l70789k37579p2899
2956F04508095J10283K98614M82407O54220Q07496R36088J033325J094933J121177
2965F11046638J116219J088181J044006R88159R21326Q43277P54967O61163N67741
2974F19031677M80767M02488L29361K54898J72310P8926k1553j19438k02789k62375
2984F20144272k95220l06549l06320l05862l11013l22570l33977l38860l32832l17764
2994F16973305k99454k84805k76528k72598k66571k52151k27318j94817j61095j32751
$$ y = [616184769, 615340576, 614490700, 613618813, 612715988, 611786079, 610849915, 609941902, 609103470, 608372307, 607775116, 607325172, 607024231, 606866531, 606840744, 606928177, 607100220, 607315750, 607524567, 607674599, 607722359, 607640724, 607423096, 607081871, 606645203, 606152458, 605650368, 605189362, 604818573, 604580994, 604508095, 604618378, 604916992, 605399399, 606053619, 606861115, 607797203, 608830528, 609925461, 611046638, 612162857, 613251038, 614295044, 615283203, 616204529, 617047806, 617802773, 618463936, 619031677, 619512444, 619914932, 620244293, 620499191, 620671501, 620750427, 620728874, 620609436, 620406647, 620144272, 619849052, 619542503, 619236183, 618930321, 618619308, 618296738, 617962761, 617623901, 617291069, 616973305, 616673851, 616389046, 616112518, 615839920, 615573349, 615321198, 615093880, 614899063, 614737968, 614605217]
3004F14605217j13030j00479r2315q6403q4305r0523j09672j42708j84059k24152k52266
3015F13125305k61841k53677k35100k16255k05383k05689k15225k28844k41851k51961
3025F10809479k59819k67372k76642k88239l02238l18184l35274l52707l67813l77808
3035F07663383l79371l71475l57552l44200l38364l46107l66593l93715m16336m24079
3045F03925591m10538l75939l27835k76680k32963k02027j83754j72004j59798j40305
3055F01443748j11351p6103l9749q430J4000K7313L3073L2921K6665J3008r766m0283
3067F01305046p2555r8267j07994r9487p6523n1956m0131n2528r0828j46790k05917
3078F00262070k54212k85225l01246l10707l21885l37600l53470l63579l64609l60107
$$ y = [614605217, 614492187, 614391708, 614299393, 614212990, 614128685, 614038162, 613928490, 613785782, 613601723, 613377571, 613125305, 612863464, 612609787, 612374687, 612158432, 611953049, 611747360, 611532135, 611303291, 611061440, 610809479, 610549660, 610282288, 610005646, 609717407, 609415169, 609096985, 608761711, 608409004, 608041191, 607663383, 607284012, 606912537, 606554985, 606210785, 605872421, 605526314, 605159721, 604766006, 604349670, 603925591, 603515053, 603139114, 602811279, 602534599, 602301636, 602099609, 601915855, 601743851, 601584053, 601443748, 601332397, 601256294, 601216545, 601208115, 601222115, 601249428, 601282501, 601315422, 601342087, 601355095, 601345329, 601305046, 601232491, 601134224, 601026230, 600926743, 600850220, 600798264, 600758133, 600705605, 600614777, 600467987, 600262070, 600007858, 599722633, 599421387, 599110680, 598788795, 598451195, 598097725, 597734146, 597369537, 597009430]
3088E97009430l59192l69110l90625m14124m25796m14772l81317l37448l01514k87323
3098E93328209k97012l20626l41034l45344l30391l04451k82059k75497k88964l17916
3108E90224915l50686l76167l87649l85895l78380l77007l92112m30527m90150n62134
3118E86094208o31752o83251p04574o90346o42967n72586m93813m22668l71476l45344
3128E80535431l40462l43551l39241l15209k69318k11181j58882j30005j34125j68571
3138E78124886k20757k73514l14102l36151l40538l31040l12271k87666k62756k45133
3148E75200958k45018k70576l23105l94058m67034n23681n52407n52139n33142n09415
3158E70830383m92515m86069m86107m85535m79812m69704m59060m52157m48875m45786
$$ y = [597009430, 596650238, 596281128, 595890503, 595476379, 595050583, 594635811, 594254494, 593917046, 593615532, 593328209, 593031197, 592710571, 592369537, 592024193, 591693802, 591389351, 591107292, 590831795, 590542831, 590224915, 589874229, 589498062, 589110413, 588724518, 588346138, 587969131, 587577019, 587146492, 586656342, 586094208, 585462456, 584779205, 584074631, 583384285, 582741318, 582168732, 581674919, 581252251, 580880775, 580535431, 580194969, 579851418, 579512177, 579196968, 578927650, 578716469, 578557587, 578427582, 578293457, 578124886, 577904129, 577630615, 577316513, 576980362, 576639824, 576308784, 575996513, 575708847, 575446091, 575200958, 574955940, 574685364, 574362259, 573968201, 573501167, 572977486, 572425079, 571872940, 571339798, 570830383, 570337868, 569851799, 569365692, 568880157, 568400345, 567930641, 567471581, 567019424, 566570549, 566124763]
3168E66124763m38995m27818m16031m09355m11720m22440m36058m46930m51965m53759
3178E61809692m56543m64592m76875m89387m96216m94805m86488m76036m68712m66575
3188E57033463m69513m74472m79584m85230m93011n04189n17692n29557n34286n27687
3198E52018242n10140m86030m63638m50669m50897m62494m78783m91561m95301m89197
3208E47239532m77180m65050m57725m57001m61464m68750m76112m81682m83971m81148
3218E42529449m72335m58145m41704m27895m20265m19655m21677m19158m07029l85360
3228E38256226l61138l46222l51028l78418m21562m66462m97093n04837m89692m60854
3238E33978920m30603m06685l90892l78075l62663l43246l23105l09792l07617l16200
$$ y = [566124763, 565685768, 565257950, 564841919, 564432564, 564020844, 563598404, 563162346, 562715416, 562263451, 561809692, 561353149, 560888557, 560411682, 559922295, 559426079, 558931274, 558444786, 557968750, 557500038, 557033463, 556563950, 556089478, 555609894, 555124664, 554631653, 554127464, 553609772, 553080215, 552545929, 552018242, 551508102, 551022072, 550558434, 550107765, 549656868, 549194374, 548715591, 548224030, 547728729, 547239532, 546762352, 546297302, 545839577, 545382576, 544921112, 544452362, 543976250, 543494568, 543010597, 542529449, 542057114, 541598969, 541157265, 540729370, 540309105, 539889450, 539467773, 539048615, 538641586, 538256226, 537895088, 537548866, 537197838, 536819420, 536397858, 535931396, 535434303, 534929466, 534439774, 533978920, 533548317, 533141632, 532750740, 532372665, 532010002, 531666756, 531343651, 531033859, 530726242, 530410042]
3248E30410042l29018l38631l40499l36419l32145l33290l39966l47557l48816l38249
3258E27025452l16620k88773k61993k39678k21710k03781j83029j60828j43585j39961
3268E24865494j56784j93863k44103k95105l34739l54233l52974l35960l12195k90833
3278E21994705k77900k76185k84156k96860l08762l14140l09372k95677k77786k64321
3288E19089546k63557k80533l14941l60795m09889m54025m86679n02815m99688m76722
3298E15039902m36363l87459l43819l21312l31535l78113m52347n38978o19469o80466
3308E10550041p14912p24945p16934p00036o83326o72608o70471o74629o79627o78749
3318E03633804o68716o52733o39534o39763o60744p01370p52029p99561q32824q47397
$$ y = [530410042, 530081024, 529742393, 529401894, 529065475, 528733330, 528400040, 528060074, 527712517, 527363701, 527025452, 526708832, 526420059, 526158066, 525918388, 525696678, 525492897, 525309868, 525149040, 525005455, 524865494, 524708710, 524514847, 524270744, 523975639, 523640900, 523286667, 522933693, 522597733, 522285538, 521994705, 521716805, 521440620, 521156464, 520859604, 520550842, 520236702, 519927330, 519631653, 519353867, 519089546, 518825989, 518545456, 518230515, 517869720, 517459831, 517005806, 516519127, 516016312, 515516624, 515039902, 514603539, 514216080, 513872261, 513550949, 513219414, 512841301, 512388954, 511849976, 511230507, 510550041, 509835129, 509110184, 508393250, 507693214, 507009888, 506337280, 505666809, 504992180, 504312553, 503633804, 502965088, 502312355, 501672821, 501033058, 500372314, 499670944, 498918915, 498119354, 497286530, 496439133]
3328D96439133q46749q38051q28285q20236q13713q07838q03605q06045q20503q50754
3338D88203354q95500r47647r95942j029357j039391j023598r87396r42116r04236
3347D79438171q89892r08966r60961j032982j103515j151161j162644j139259j095543
3356D69993248j052170j026344j023789j037445j053009j057510j045914j024513j005974
3365D60666580j003036j021958j060371j107369j148872j172218j170235j142197j094780
3374D50745544j037025r80072r31969q97560q75931q62922q51670q35075q06885p64465
3384D41901970p10106o51588o02608n76477n83191o20613o73866p18651p29599o93741
3394D35341530o16646n24483m52766m30565m67606n47409o35872o95343p03048o59027
$$ y = [496439133, 495592384, 494754333, 493926048, 493105812, 492292099, 491484261, 490680656, 489874611, 489054108, 488203354, 487307854, 486360207, 485364265, 484334908, 483295517, 482271919, 481284523, 480342407, 479438171, 478548279, 477639313, 476678352, 475645370, 474541855, 473390694, 472228050, 471088791, 469993248, 468941078, 467914734, 466890945, 465853500, 464800491, 463742981, 462697067, 461672554, 460666580, 459663544, 458641586, 457581215, 456473846, 455324974, 454152756, 452982521, 451840324, 450745544, 449708519, 448728447, 447796478, 446898918, 446022987, 445160065, 444308395, 443473320, 442666435, 441901970, 441191864, 440540276, 439937668, 439361191, 438778000, 438157387, 437483521, 436764870, 436035271, 435341530, 434724884, 434200401, 433747635, 433317070, 432849464, 432302055, 431666183, 430970840, 430267792, 429608765]
3404D29608765n83878n06210m48456m17328m05426l99513l90244l76701l64952l60604
3414D25355453l64303l70445l70903l59269l34167k97127k51388j99128j43737q8997
3424D22575989m2076q545R765J7472K3575L6544N9853Q7585J10131J18446J11618R7389
3436D23197746Q9379R8762J27754J68038K04315K24037K24114K14805K13318K35672
3446D24997940K85988L53775M19960M67148M89311M94881M99229N14679N41878N70679
3456D29635468N87692N87044N74455N65071N73349O04858O52428O99882P30057P31430
3466D35941734P01104O45942N81322N26848N03158N23377N85632O70548P45239P79114
3476D42204018P58018O93703O18400N66864N59655N93643O45866O91948P18498P29638
$$ y = [429608765, 429024887, 428518677, 428070221, 427652893, 427247467, 426847954, 426457710, 426081009, 425716057, 425355453, 424991150, 424620705, 424249802, 423890533, 423556366, 423259239, 423007851, 422808723, 422664986, 422575989, 422533913, 422525368, 422535133, 422552605, 422576180, 422612724, 422672577, 422760162, 422870293, 422988739, 423100357, 423197746, 423287125, 423385887, 423513641, 423681679, 423885994, 424110031, 424334145, 424548950, 424762268, 424997940, 425283928, 425637703, 426057663, 426524811, 427014122, 427509003, 428008232, 428522911, 429064789, 429635468, 430223160, 430810204, 431384659, 431949730, 432523079, 433127937, 433780365, 434480247, 435210304, 435941734, 436642838, 437288780, 437870102, 438396950, 438900108, 439423485, 440009117, 440679665, 441424904, 442204018, 442962036, 443655739, 444274139, 444841003, 445400658, 445994301, 446640167, 447332115, 448050613, 448780251]
3486D48780251P38449P55272P79266Q00629Q11424Q13370Q17260Q33817Q62007Q84705
3496D56876450Q79402Q32329P51915O66084O09131O00090O34308O86149P27921P45201
3506D64008980P45735P51076P79037Q32596Q97064R50089R76524R76486R62563R51423
3516D72831573R51500R60122R64965R51233R09996Q42324P59735O82907O36368O40869
3526D81131592P04231Q14171R39712J041146J086960J071510J018600R72939R77249
3535D89758110J047783J162605J267586J301727J229210J060715Q52623O81953O07529
3544D98969841O41937P46537Q56094R19342R26475R10302R18159R77173J075859J179199
3554E08120918J261177J326714J403732J504669J590348J570015J353111R20067L68767
$$ y = [448780251, 449518700, 450273972, 451053238, 451853867, 452665291, 453478661, 454295921, 455129738, 455991745, 456876450, 457755852, 458588181, 459340096, 460006180, 460615311, 461215401, 461849709, 462535858, 463263779, 464008980, 464754715, 465505791, 466284828, 467117424, 468014488, 468964577, 469941101, 470917587, 471880150, 472831573, 473783073, 474743195, 475708160, 476659393, 477569389, 478411713, 479171448, 479854355, 480490723, 481131592, 481835823, 482649994, 483589706, 484630852, 485717812, 486789322, 487807922, 488780861, 489758110, 490805893, 491968498, 493236084, 494537811, 495767021, 496827736, 497680359, 498362312, 498969841, 499611778, 500358315, 501214409, 502133751, 503060226, 503970528, 504888687, 505865860, 506941719, 508120918, 509382095, 510708809, 512112541, 513617210, 515207558, 516777573, 518130684, 519050751, 519419518]
3563E19419518j09215l16887j55602L18718R22203J437226J717148J737442J579742
3572E26550293J366310J199532J137199J198845J380653J647339J917687K065124J963120
3581E40426102J559791R37844L05366r0790r0255K92816Q73871J397819J669350J640472
3591E48922386J406517J127625R33876Q73718R26971J054764J235047J461067J707992
3600E59649963J908722J967087J809960J442413R66911N47524L38020M14124P41882
3609E69786606J194420J596641J782990J647300J187134N27916q5106l55720o1455
3618E77220726Q07953J980591K963218L244553K553711J032486p84226k200164k682839
3627E84136009k111625q08564O52123J742554K208099K118683J745186J377182J197357
$$ y = [519419518, 519310303, 518993416, 518837814, 519156532, 520078735, 521515961, 523233109, 524970551, 526550293, 527916603, 529116135, 530253334, 531452179, 532832832, 534480171, 536397858, 538462982, 540426102, 541985893, 542923737, 543229103, 543138313, 543048058, 543340874, 544214745, 545612564, 547281914, 548922386, 550328903, 551456528, 552390404, 553264122, 554191093, 555245857, 556480904, 557941971, 559649963, 561558685, 563525772, 565335732, 566778145, 567745056, 568292580, 568630600, 569044724, 569786606, 570981026, 572577667, 574360657, 576007957, 577195091, 577723007, 577637901, 577282181, 577220726, 578028679, 580009270, 582972488, 586217041, 588770752, 589803238, 589019012, 586818848, 584136009, 582024384, 581215820, 581867943, 583610497, 585818596, 587937279, 589682465, 591059647, 592257004]
3636E92257004J264496J560249K021790K520446K835350K688904J883087M68445j184502
3645F06315269k496299k954254k391015j095161L36075J313896J558571J196022O24504
3654F02407608K48642K70462O46286J193695J735840K170792K444000K494507K251548
3663F15863380J702843R62105K54250k04888l56102l53851m68407q87833j555137k166023
3673F12790337k337952j840248p32994O70471J976318K891465L299522L211708K672615
3682F22601242J719971M32701r89533k210121k858925k706947j801109m64478Q50296
3691F14573097J764260K111702J950531J463813Q43850K34718k49977m91219l73573
3700F21827202J39465R18656J656417J968613J585465N19485q93211k120552k675553
$$ y = [592257004, 593521500, 595081749, 597103539, 599623985, 602459335, 605148239, 607031326, 607499771, 606315269, 603818970, 600864716, 598473701, 597378540, 597714615, 599028511, 600587082, 601783104, 602407608, 602656250, 602926712, 603572998, 604766693, 606502533, 608673325, 611117325, 613611832, 615863380, 617566223, 618528328, 618782578, 618577690, 618221588, 617867737, 617399330, 616511497, 614956360, 612790337, 610452385, 608612137, 607879143, 608549614, 610525932, 613417397, 616716919, 619928627, 622601242, 624321213, 624753914, 623764381, 621554260, 618695335, 615988388, 614187279, 613722801, 614573097, 616337357, 618449059, 620399590, 621863403, 622707253, 622941971, 622691994, 622200775, 621827202, 621966667, 622885323, 624541740, 626510353, 628095818, 628615303, 627722092, 625601540, 622925987]
3709F22925987k338829j253052J61400J408501K126579K205315J768646J064568L40080
3718F28409195k37656n91011p00340n70869k23847K88773Q66966J358566J582566J380195
3728F31562538O83289m13971j623497k509270k635879j778870r9678J837158L263779
3737F28285599L564682K605095Q34694r29032j937141j917801j204338m99039m11262
3746F28391457j065827k029571k601433k270279j046906N42183J777230K168502J708909
3755F25574265Q21914O8474j82457Q2283N83763R62563R81979O17104J2359o19392
3765F28902855j086044j256409j074753n71365J25236Q02269J225281J234512Q28514
3774F29130096J77231m53186q26645q47549n91583k44904J0109R3155N5313K4910J14174
$$ y = [622925987, 620587158, 619334106, 619495506, 620904007, 623030586, 625235901, 627004547, 628069115, 628409195, 628171539, 627580528, 626880188, 626309319, 626085472, 626374245, 627241211, 628599777, 630182343, 631562538, 632245827, 631831856, 630208359, 627699089, 625063210, 623284340, 623184662, 625021820, 628285599, 631850281, 634455376, 635290070, 634361038, 632423897, 630506096, 629301758, 628802719, 628391457, 627325630, 625296059, 622694626, 620424347, 619377441, 619919624, 621696854, 623865356, 625574265, 626396179, 626464653, 626282196, 626364479, 626948242, 627910805, 628892784, 629509888, 629522247, 628902855, 627816811, 626560402, 625485649, 624914284, 625039520, 625841789, 627067070, 628301582, 629130096, 629307327, 628854141, 628027496, 627179947, 626588364, 626343460, 626353569, 626446724, 626502037, 626526947, 626641121]
3785F26641121L41759O26564Q48465R34791R07059Q52775Q39005Q36411P19375L53661
3795F33900986k78168j019821j603127j807289j604576j183586q16841o60973o33964
3804F24292641m72870N8632R57184J922607K511978K410927J634178N17616m93393
3813F33339500j106605j322098j357918j435051j591682j656609j396484p16209K34870
3822F22991714J133385J669846J727676J434784J059189Q28857P92389Q03528O28624
3831F33069992J07956p28264j652641k342949k543182k190323j439209n64499K05345
3840F21922226Q18901J407356K140007L016396L737678L782616K682838L62206k673569
3849F37196655n449447o919632o459351m185448r26628K149964M058342M392357L418655
$$ y = [626641121, 626982880, 627609444, 628457909, 629392700, 630299759, 631152534, 631991539, 632827950, 633547325, 633900986, 633622818, 632602997, 630999870, 629192581, 627588005, 626404419, 625587578, 624926605, 624292641, 623819771, 623878403, 624835587, 626758194, 629270172, 631681099, 633315277, 633832893, 633339500, 632232895, 630910797, 629552879, 628117828, 626526146, 624869537, 623473053, 622756844, 622991714, 624125099, 625794945, 627522621, 628957405, 630016594, 630845451, 631637840, 632441368, 633069992, 633177948, 632449684, 630797043, 628454094, 625910912, 623720589, 622281380, 621716881, 621922226, 622741127, 624148483, 626288490, 629304886, 633042564, 636825180, 639508018, 639870224, 637196655, 631747208, 624827576, 618368225, 614182777, 613256149, 615406113, 619464455, 623856812, 627275467]
3858F27275467J849518M48837l18489m26941j93787l5362k18582p34482j335678j692963
3868F24617538j579322r85680j15776P23343J268806J409073J201401Q02689L69949
3877F27712021p134l10249n48019p07245p50237o51245m43725k25525j09368j41983
3887F23817291k54554k86370q0566M05464J043625J575317J731339J367492N35851
3896F29854889n35774j545868k238236k480240k276496j728821r82971j87493N25971
3905F18404961J055603J341629J377830J206742R00497N28374J39923k28806n35927
3914F24190826p25517p45849n91088l23639n6839J07422J38626R3041O3781J02272
3924F22253036J70098J67694J6174k64244n46875o71844n51834k29111J50680M28353
$$ y = [627275467, 629124985, 629573822, 629255333, 628828392, 628634605, 628599243, 628380661, 627646179, 626310501, 624617538, 623038216, 622052536, 621936760, 622660103, 623928909, 625337982, 626539383, 627342072, 627712021, 627704887, 627394638, 626846619, 626139374, 625389137, 624737892, 624294167, 624068642, 623959274, 623817291, 623562737, 623276367, 623195801, 623601265, 624644890, 626220207, 627951546, 629319038, 629854889, 629319115, 627773247, 625535011, 623054771, 620778275, 619049454, 618066483, 617878990, 618404961, 619460564, 620802193, 622180023, 623386765, 624287262, 624815636, 624955559, 624726753, 624190826, 623465309, 622719460, 622128372, 621804733, 621747894, 621855316, 621993942, 622086983, 622150764, 622253036, 622423134, 622590828, 622607002, 622342758, 621795883, 621124039, 620572205, 620343094, 620493774, 620922127]
3934F20922127N17654M32511K48603M5090j29204k52266l10897k98806k34146j68381
3944F20772285j59988k28577l25927l63045k79083r7580Q1215J53923R5291k6055j09100
3955F19513359j09405p2403q1902j69601k74620k94915j88827k7924N5924j3237j77574
3966F18158875k94190k66190j42974q2169j98326m33960n89676n03120k21711M006
3976F15430565o5613m22401p75605p95974m38118m4327p4158o63376j411590j666260
3986F09073143j139183l18031k03438j436691l495522m789009l904762j297531r2469
3995E92396507m999008j9556160m3244018p0435715r2252541
4000C61909065
$$ y = [620922127, 621439781, 621872292, 622120895, 622165985, 622036781, 621784515, 621473618, 621174812, 620940666, 620772285, 620612297, 620383720, 620057793, 619694748, 619415665, 619318085, 619399300, 619553223, 619648514, 619622459, 619513359, 619403954, 619331551, 619249649, 619080048, 618805428, 618510513, 618321686, 618293762, 618349686, 618336449, 618158875, 617864685, 617598495, 617455521, 617373352, 617175026, 616741066, 616151390, 615648270, 615426559, 615430565, 615364952, 614942551, 614166946, 613370972, 612932854, 612888527, 612814369, 612150993, 610739403, 609073143, 607933960, 607615929, 607412491, 605975800, 602480278, 597691269, 593786507, 592488976, 592396507, 587397499, 567841339, 524597321, 454161606, 361909065]
##END=$$ End of the data block
