##TITLE=4-Cl-Benz VR $$ Begin of the data block
##JCAMP-DX=5.00 $$ ACD/SpecManager v 10.08
##SPECTROMETER/DATA SYSTEM=Alpha
##DATE=04 Dec 2015 11:34:10
##DATA TYPE=INFRARED SPECTRUM
##DATA CLASS=XYDATA
##ORIGIN=
##OWNER=
##NPOINTS=1765
##FIRSTX=399.76428223
##LASTX=3997.64306641
##MAXX=3997.64306641
##MINX=399.76428223
##MAXY=0.89007890
##MINY=0.52322513
##XFACTOR=1.0000000000
##YFACTOR=1.000000000000000e-9
##FIRSTY=0.82665157
##DELTAX=2.03961372
##XUNITS=1/CM
##YUNITS=ARBITRARY UNITS
##XYDATA=(X++(Y..Y))
399.8 826651573 826451600 825479746 823999405 823321939 822096825 819777012 818062842 816282690 812644064
418.1 812644064 809340954 807913184 806436837 806008160 807046771 806904435 805417836 804081798 801863313
436.5 801863313 798682153 796489954 794816256 792174697 789806485 788243473 786076248 784235179
452.8 784235179 783768356 782736659 781172752 780814946 779960275 777440250 774862945 772343934 768979490
471.2 768979490 766918480 767837524 769743145 772360682 776799023 781363070 784594178 787613988 789922535
489.5 789922535 790308118 790561855 791464329 791188240 790263832 790264428 790075660 789249897 789325178 789590359
509.9 789590359 788734972 788202882 788405716 787795484 787244439 787844121 787861526 786979914 787061393 787464559
530.3 787464559 786912203 786778927 787440002 787375748 787238479 788150012 788766682 788726330 789427221 790380120
550.7 790380120 790682733 791395187 792742193 793540478 794274569 795784056 796941578 797431529 798606932
569.1 798606932 800056338 800644934 801342845 802563667 803072453 803324640 804393291 805229187 805357814
587.4 805357814 805999100 806989372 807422519 808275938 810027301 811287045 812233448 814029753 815681517
605.8 815681517 816439033 817557871 819026589 819617808 820017397 821225762 822334111 823160172 824633300
624.1 824633300 826108336 826906502 828050613 829569221 830304861 830925226 832347095 833413482 833794415
642.5 833794415 834757268 835919797 836307049 836947143 838195324 838722110 838840187 839710057 840384841
660.8 840384841 840270817 840590417 841127455 840701580 840859115 841677368 841616750 840878427 840601146 839989007
681.2 839989007 838229656 836382151 834536612 831666231 828633666 826605678 824993491 824045718 825089157
699.6 825089157 827665210 830723166 834951699 840411544 845307291 849020660 852147639 854152083
715.9 854152083 854966521 856073797 857507408 858161569 858782351 860089600 861001551 861417890 862457991
734.3 862457991 863597095 864018202 864698589 865881562 866484821 866904616 867931247 868680775 868893743
752.6 868893743 869628668 870609820 870904922 871208608 872040033 872495413 872683465 873411775 873987794 873932838
773 873932838 874276638 875055850 875299871 875520527 876379311 876974761 877099872 877715766 878506005 878677964
793.4 878677964 878949046 879746020 880171239 880361080 881098449 881753862 881911814 882431805 883253753 883491278
813.8 883491278 883652568 884411931 884943306 884976447 885419309 886043787 886123419 886305809 886916041 887095273
834.2 887095273 887023568 887548506 888090789 888125718 888430536 889001310 889053226 889043808 889541447 889798760 889613509
856.6 889613509 889792204 890078902 889829099 889706731 890003383 889870584 889441252 889430225 889304757 888738215
877 888738215 888638675 889024675 889030576 889030993 889525533 889692783 889372826 889431357 889605761 889286160 889139712
899.5 889139712 889437139 889381468 889136195 889323771 889337838 888887465 888797164 888968825 888641000 888280690
919.9 888280690 888377666 888217926 887726605 887679756 887743413 887309015 886975348 886980355 886644125 886165321 886111021
942.3 886111021 885945380 885378838 885095835 885011017 884499133 883973062 883789897 883349597 882669628 882383287
962.7 882383287 882167041 881570935 881124914 880955040 880455256 879814208 879498303 879038334 878231287 877695262
983.1 877695262 877374530 876766026 876215637 876019478 875645578 875022709 874664307 874366343 873773217 873295367
1003.5 873295367 873013377 872402847 871606529 871061862 870489240 869745076 869237065 868824184 868070006 867288470
1023.9 867288470 866753459 866017997 865011513 864164829 863302529 862104356 860959351 860062778 859019637
1042.2 859019637 857902110 857101142 856478989 855981886 856006801 856450498 856812477 857181549 857733369 858106852
1062.6 858106852 858246863 858537734 858848214 858888209 858933628 859068274 858916998 858544409 858251810 857775807
1083 857775807 856929779 856121123 855437100 854634047 853929102 853520274 853085577 852511585 852050543 851579607
1103.4 851579607 850956500 850596309 850741327 851214349 852075398 853368640 854666054 855715632 856711507
1121.8 856711507 857583225 858106017 858561814 859240234 859908402 860468447 861091197 861604393 861828864 861991167
1142.2 861991167 862162054 862185061 862186193 862296879 862300515 862124026 862006426 861941874 861750841 861540377 861452639
1164.6 861452639 861428440 861493051 861741960 862049699 862268686 862500668 862810493 863059402 863240957 863466382
1185 863466382 863664627 863765895 863878727 864024758 864088118 864099503 864179969 864300191 864399374 864561439 864814699
1207.5 864814699 865055561 865287840 865563273 865786910 865918696 866082489 866245449 866285801 866307795 866421461
1227.9 866421461 866497278 866483867 866530716 866616786 866612136 866600931 866653502 866654634 866643310 866726637 866774738 866703153
1252.3 866703153 866669595 866695702 866635084 866558135 866555750 866483867 866337776 866298974 866326034 866355896 866532624
1274.8 866532624 866841376 867063940 867210925 867429554 867624640 867732286 867888093 868046284 868048072 868025541
1295.2 868025541 868070304 868019938 867896914 867840052 867732406 867466629 867201269 866961181 866654038 866362095
1315.6 866362095 866163552 865982413 865805566 865709186 865596235 865346551 865076780 864870191 864539504 864001215
1336 864001215 863395452 862896979 862578511 862333357 861958325 861313641 860526979 859746218 858851433 857784986
1356.4 857784986 856651247 855242908 853428066 851667702 849974871 847862840 845408976 842697382
1372.7 842697382 839647114 836592674 833416283 829600215 825470448 822194993 820028782 818060398
1389 818060398 815754533 813048124 810291588 808322847 807442784 807328582 807125568 806310594 805048108
1407.3 805048108 803288639 801107645 799100161 797481775 796078324 795443594 795945704 796767473 797509074
1425.7 797509074 798028886 798241317 798559070 799750209 803329945 810310185 818617284 827375352 835922837
1444.1 835922837 843351424 849818051 854969561 858449936 860577226 862072289 863847792 865649402
1460.4 865649402 866905868 867746711 868532777 869265795 869529366 869376481 869520426 869985402 870228171
1478.7 870228171 870135427 869985819 869674027 868890584 867915809 867451549 867233396 866500080 865257680 864096284
1499.1 864096284 862931967 861332238 858514190 854999304 853873372 854062200 854072571 853717864 853418767
1517.5 853418767 853440225 853969514 855431139 857466400 859645844 861504197 862795889 863846600 864663959
1535.8 864663959 864628494 863818407 863513350 863833666 864105225 863980770 863436580 862764120 861964643 860764980
1556.2 860764980 858880401 857889831 858029723 857605875 856614113 855189979 853586257 852300763 850589097
1574.6 850589097 848138094 846140921 844296396 841794789 838707924 835198283 831273913 826781631
1590.9 826781631 821678519 815912008 809411049 802011728 793390214 783301890 771460950 757089198
1607.2 757089198 739160001 717872739 694940388 669484973 643572330 626979589 618820906
1621.5 618820906 617064774 622329295 632145762 643647075 654120207 663914919 675720990 687543392
1637.8 687543392 697387397 706762075 715926886 726331174 737547278 745773554 754370153 768044472
1654.1 768044472 780281425 791014910 802329481 814051032 824568927 832191944 838523924 844778895
1670.5 844778895 849784553 853832960 857664943 860669553 862706244 864133298 866096735 868373513
1686.8 868373513 869977772 871253908 872131228 872459650 872610152 872991621 873914361 875019014 875751197
1705.1 875751197 876456499 877127290 877470493 877457380 877165735 877112567 877805769 878602862 878999233 879188776
1725.5 879188776 879256546 879162312 878834546 878497601 878835499 879260838 879348159 879467309 879657745 879690111
1745.9 879690111 879596829 879577816 879872680 880213141 880341232 880398452 880367815 880358279 880534291 880521417 880209446
1768.4 880209446 879844725 879632175 879845560 880190969 880281329 880142689 880012155 879962981 879928529 879773617
1788.8 879773617 879410207 879176199 879265368 879369080 879309833 879200041 879264712 879435837 879439414 879245520
1809.2 879245520 879179716 879344165 879467666 879519284 879623413 879616797 879410803 879275978 879224360 879105330
1829.6 879105330 879234731 879497588 879475772 879341543 879301429 879078448 878655195 878583074 878748298 878756225
1850 878756225 878684163 878628910 878532887 878388822 878282905 878184557 877975047 877600670 877258122 877251804 877425194
1872.4 877425194 877487302 877407789 877253592 877106786 876999378 876873016 876696348 876488268 876343191 876248479
1892.8 876248479 876143932 876073599 875996768 875879169 875752926 875584662 875345647 875153720 875081360 874997556
1913.2 874997556 874772549 874468327 874246120 874078631 873970807 873968542 873900354 873735607 873574138 873390257
1933.6 873390257 873195469 873048723 872844219 872521520 872322202 872284472 872170508 871994257 871872485 871734321
1954 871734321 871522605 871336401 871189177 870983243 870743811 870543957 870375812 870214701 870068252 869902134
1974.4 869902134 869675338 869495451 869400680 869237900 868997395 868808210 868612468 868330896 868148565 868127048
1994.8 868127048 868034482 867844343 867684662 867500603 867287457 867172778 867101729 866931617 866719663 866518855
2015.2 866518855 866250694 865934253 865576684 864934862 864229739 864265800 864840567 865085304 865015864 864979863
2035.6 864979863 864932239 864794731 864670098 864557385 864399910 864286661 864245534 864182353 864098191 864053965
2056 864053965 864001513 863919735 863871872 863841712 863761604 863676131 863626063 863544762 863425195 863350272 863319278 863251090
2080.4 863251090 863167524 863113344 863009870 862852812 862783849 862803042 862797022 862765014 862741590 862704992 862670243
2102.9 862670243 862691045 862719655 862694263 862671435 862670481 862650871 862657726 862711906 862740219 862732708 862748206 862770855
2127.3 862770855 862751424 862730026 862755120 862788677 862796903 862808764 862812281 862786770 862800419 862877548 862930715 862932205
2151.8 862932205 862943947 862951517 862932026 862959027 863033116 863031685 862916946 862794101 862772286 862850010 862962306
2174.3 862962306 863050222 863065720 863040388 863014996 862952054 862879217 862876117 862908959 862908006 862877786 862835944 862778902
2198.7 862778902 862725079 862699866 862666547 862594306 862539887 862533808 862507999 862465858 862474561 862476707 862420678 862383604
2223.2 862383604 862395227 862386942 862356365 862338305 862292409 862219572 862184584 862154067 862081945 862045228 862053335 861999512
2247.7 861999512 861911178 861873746 861835420 861773014 861740947 861711025 861628830 861531675 861473024 861425638 861365378
2270.1 861365378 861331224 861294508 861195147 861096978 861047089 860982299 860894561 860824704 860738337 860601902 860477090
2292.5 860477090 860378861 860249579 860115230 859998822 859848619 859657884 859455884 859229684 858951271 858668089
2312.9 858668089 858431339 858161330 857814431 857488692 857236385 857058108 856954098 856863916 856742799 856652796
2333.3 856652796 856592894 856451273 856255352 856173873 856301785 856658459 857077956 857254207 857079864 856727302
2353.7 856727302 856427431 856219649 856089294 856031239 856025338 856135190 856396079 856682122 856898010 857042968
2374.1 857042968 857147694 857248425 857348621 857407153 857414305 857398927 857351065 857253253 857145190 857066095 856990159
2396.6 856990159 856904745 856832385 856746256 856639445 856568575 856503665 856380522 856266975 856208324 856114924 855986416
2419 855986416 855899155 855793715 855642259 855551898 855497301 855375111 855251133 855179906 855087757 854985297 854941845
2441.4 854941845 854882956 854745686 854634464 854568481 854450703 854316950 854245365 854156971 853996634 853857636
2461.8 853857636 853759170 853643715 853547215 853478312 853356361 853210509 853124797 853045285 852920711 852819920
2482.2 852819920 852745056 852627575 852505088 852420270 852309704 852182746 852119684 852051795 851899385 851759255
2502.6 851759255 851676285 851569951 851465106 851410568 851319313 851169467 851051629 850960553 850847840 850756109
2523 850756109 850693345 850564122 850383341 850261569 850156486 850012541 849895358 849781692 849609196 849455357
2543.4 849455357 849356115 849228442 849083364 848998725 848906040 848735213 848571062 848445177 848301411 848163784
2563.8 848163784 848068833 847959220 847802877 847671628 847583890 847465575 847321868 847196460 847068250 846939921
2584.2 846939921 846827924 846704662 846564591 846439183 846314728 846137226 845936060 845792353 845685184 845550120
2604.6 845550120 845395386 845228076 845042408 844895363 844791055 844648898 844466686 844300270 844131768 843954623
2625 843954623 843810439 843639731 843384445 843118846 842900872 842701435 842478573 842216551 841916502 841605663
2645.4 841605663 841321290 841038823 840720177 840389550 840076625 839764178 839449048 839164615 838901758 838613749
2665.8 838613749 838319719 838085949 837908745 837752938 837633491 837527096 837359011 837130606 836904883 836694300
2686.2 836694300 836487114 836284816 836053252 835799813 835578024 835376680 835163951 834951758 834757268 834575355
2706.6 834575355 834402978 834237933 834077418 833917141 833778381 833722651 833736241 833770156 833847344 833896935
2727 833896935 833850026 833844304 833944917 834066987 834179401 834277332 834342837 834407449 834538162 834691703 834753454
2749.4 834753454 834711432 834627151 834558368 834530830 834518671 834491849 834457040 834419191 834370434 834318221 834312081 834339857
2773.9 834339857 834257901 834046900 833863556 833740354 833610177 833524168 833496451 833379626 833146572 832946658
2794.3 832946658 832829773 832673192 832399309 832110822 831873894 831664622 831482470 831256151 830950737 830675840
2814.7 830675840 830460906 830243170 830027342 829825163 829608023 829385221 829166770 828941822 828729928 828544796
2835.1 828544796 828373849 828058064 827471673 826824069 826290548 825761199 825116992 824459970 823981345 823710799
2855.5 823710799 823602200 823576450 823493898 823309064 823067546 822795808 822570980 822459698 822266638 821796119
2875.9 821796119 821242034 820802271 820412457 820012391 819606423 819195807 818770885 818375587 818068027 817718744
2896.3 817718744 817216873 816715360 816335142 815986395 815604091 815297782 815129757 814911187 814396918 813560188
2916.6 813560188 812563539 811604500 810874403 810428798 810252190 810290217 810249269 810019553 809850872 809821427
2937 809821427 809841633 809981465 810256243 810397923 810171723 809735060 809376776 808980823 808388352 807801187
2957.4 807801187 807334006 806884766 806330264 805646658 804942369 804327726 803837121 803385317 802899301 802533507
2977.8 802533507 802340448 802039325 801530302 801019907 800619125 800350606 800060034 799472988 798711002 797901273
2998.2 797901273 796941340 795972645 795103431 794287264 793681085 793377638 793063879 792423069 791525841 790584087
3018.6 790584087 789668858 788820446 788032770 787200689 786390483 785726607 785140395 784386992 783438981 782679737
3039 782679737 782167017 781541407 780629575 779576123 778652489 777843773 776963472 776010156 774959207 773810863
3059.4 773810863 772713900 771750629 770878136 769828856 768375099 766751528 765290737 764072359 762888432
3077.8 762888432 761368513 759488642 757482588 755352497 753089905 750728190 748125255 745306969
3094.1 745306969 742524803 739827752 736925900 733581305 730002165 726465821 722848892 718958855
3110.4 718958855 715151131 711912096 709157884 706682563 704433978 702462912 701060534 700406492
3126.7 700406492 700269997 700203598 700045288 700020134 700193822 700188398 699602187 698562622 697363734 696003437
3147.1 696003437 694487870 692776978 690556169 687714994 684541225 681212246 677675724 673865318
3163.4 673865318 669814825 665671229 661606193 657780707 654389143 651625514 649586737 648343861
3179.8 648343861 647968411 648477077 649856687 652004957 654663920 657609463 660781443 664140403 667631447
3198.1 667631447 671239138 674970746 678823173 682771981 686792552 690863073 694815397 698390424
3214.4 698390424 701460660 703913033 705589950 706526458 706839800 706514537 705612957 704308987 702611089
3232.8 702611089 700402856 697737217 694774091 691599488 688300550 684927166 681394756 677631438
3249.1 677631438 673736155 669809878 665836573 661768138 657599151 653418243 649314761 645332575
3265.4 645332575 641536057 637955010 634486794 631080270 627910733 625238121 623214543 621849358
3281.7 621849358 621163189 621163547 621722162 622720480 623996317 625219345 626163244 626839578 627415359 628072560
3302.1 628072560 628731549 628989398 628536940 627544522 626380503 625154555 623797476 622335196 620794952
3320.5 620794952 619159222 617396057 615283787 612727165 610034466 607434988 604929924 602470338
3336.8 602470338 599784136 596685827 593357444 589920878 586535811 583347917 579924464 575935185
3353.1 575935185 571791589 567902386 564218998 560504317 556796551 553478181 550562024 547514975
3369.4 547514975 544106960 540861070 538233399 536004186 533873379 531794906 529850423 528175652
3385.7 528175652 526948214 526200891 525434792 524274409 523294866 523225129 523809373 524195731 524337113
3404.1 524337113 524997890 526366293 528011978 529684424 531299710 532938123 534830272 536927819
3420.4 536927819 539038062 541197300 543531001 545988798 548293293 550470233 552708328 554690242
3436.7 554690242 556124687 557399392 558958530 560751498 562598109 564393461 566142738 567900062
3453.1 567900062 569697797 571623266 573630154 575452268 577207327 579329073 581637084 583491862
3469.4 583491862 584778726 586069345 587765515 589803457 591813564 593454361 595005929 596833706
3485.7 596833706 598731577 600536764 602402866 604393184 606474161 608498931 610426664 612396061
3502 612396061 614251018 615860522 617587447 619724810 622111440 624332070 626241624 628132284 630254805
3520.4 630254805 632635951 634908855 636847198 638878882 641208172 643646836 646194637 648729444
3536.7 648729444 651064456 653443456 656012833 658583224 660936356 663092077 665344954 667844653
3553 667844653 670413435 672976375 675642192 678265691 680510879 682684600 685745358 689336777 692346096
3571.3 692346096 694962502 697735965 700729132 703927577 707213640 710238039 713060677 716207504
3587.7 716207504 719599187 722696960 725717127 729002237 732408285 735763311 739017904 741947770
3604 741947770 744561672 747440457 750638008 753723979 756656051 759276807 762075543 765547574 768567681
3622.3 768567681 770460308 771824121 774135828 777467787 780048847 782107294 784095764 785912991
3638.7 785912991 787586451 788931012 789676011 790217638 791854382 794404328 795951784 796816945 798225224
3657 798225224 799765110 800635695 801013827 801126003 800993860 801070869 801504433 801548839 801808834 802909851
3677.4 802909851 803871572 804463804 804758906 804792762 805034339 805762410 806587458 807247460 807624578 807639897
3697.8 807639897 807532430 807739854 808130503 808122158 807663441 807288229 807669282 808364570 808564067 808335304
3718.2 808335304 808040321 807855666 807774603 807811677 807674110 807095587 806516528 806650281 807499528 807990313
3738.6 807990313 807376862 806252360 805950463 806140423 805825353 805952430 806814551 807231724 807133079 807164729
3759 807164729 807418764 807388246 807122827 806918383 806895018 807121634 807259321 807081938 806841433 806809545
3779.4 806809545 806790888 806587875 806453407 806477189 806469738 806253970 805795491 805314600 804830551 804331005
3799.8 804331005 804344416 804543436 804490507 804737210 804934859 804525077 803865731 803510308 803240180 802998960
3820.2 802998960 803359509 803711116 803641498 803410411 803083539 802787244 802496374 802148640 802030265 802203774
3840.6 802203774 802496076 802830219 802781761 801955640 800558090 799891472 800974727 801856637 801786661 801307797
3861 801307797 800902128 800764799 800514698 800240338 800404966 800680280 800786018 800563216 800164163 800065160
3881.4 800065160 800089896 800194323 800269961 800005972 799896479 800051391 799817145 799196422 798706472 798607647
3901.8 798607647 798900485 799385309 799633682 799588263 799415886 799125671 798871815 798878908 798953593 798840821
3922.1 798840821 798714876 798730195 798664868 798553288 798674643 798842013 798731446 798422158 798114359 797945499
3942.5 797945499 797910333 797882199 797894418 797964394 797994912 797960877 797866344 797741532 797673464 797695696 797700763
3965 797700763 797593653 797453701 797384024 797335088 797270477 797210991 797136128 797108531 797156990 797096133 796868622
3987.4 796868622 796693206 796679616 796675205 796572268 796431243
3997.6 796431243
##END=$$ End of the data block
