##TITLE=4-5M-17 $$ Begin of the data block
##JCAMP-DX=5.00 $$ ACD/SpecManager v 10.08
##SPECTROMETER/DATA SYSTEM=Alpha
##DATE=02 Jun 2015 08:56:44
##DATA TYPE=INFRARED SPECTRUM
##DATA CLASS=XYDATA
##ORIGIN=
##OWNER=
##NPOINTS=1765
##FIRSTX=399.76428223
##LASTX=3997.64306641
##MAXX=3997.64306641
##MINX=399.76428223
##MAXY=1.00105953
##MINY=0.73967069
##XFACTOR=1.0000000000
##YFACTOR=0.000000010000000
##FIRSTY=1.00000000
##DELTAX=2.03961372
##XUNITS=1/CM
##YUNITS=ARBITRARY UNITS
##XYDATA=(X++(Y..Y))
399.8A00000000Tq2350q3637N9062l4928j46175p0536q6313j21534j4848n4270j28752
424.2I9235719l0726j6981q9836k0290r59p6831K677N9253l2276k0284J6534n7798
448.7I8968202j9330O3586k2918p5841k2268n2881l9584N1833J472n9170J6058J0013
473.2I8819172l2657M6343M1103l8892M816J2201p1382k9821L1185l3420l8433p695
497.7I8702520p5298o4701J4239l7521p4637k9886p8660j11514k6435k5475p7951k8729
522.1I8085952k2048p9107m5187j5479o1422m4603j5103o2132m3661J628o9339j00028
546.6I7529471k1768j8996o7156m3136k6864m5103k5636k6715o5350m7779k2924m5669
571.1I7072375k7573k957m3225m4513R239j568l8254p081P486k1070l785J1212n031
$$ plain form
399.8 100000000 100000000 99917650 99834013 99893075 99858147 99711972 99641436 99555123 99433589 99418741 99364471 99235719
424.2 99235719 99204993 99188012 99098176 99077886 99076927 99000096 99002773 99062026 99029750 99009466 99026000 98968202
448.7 98968202 98948872 99012458 98989540 98913699 98891431 98838550 98798966 98850799 98852271 98793101 98809159 98819172
473.2 98819172 98786515 98832858 98873961 98835069 98839885 98852086 98780704 98750883 98782068 98748648 98710215 98702520
497.7 98702520 98627222 98562521 98576760 98539239 98464602 98434716 98356056 98244542 98218107 98192632 98114681 98085952
522.1 98085952 98063904 97984797 97939610 97924131 97862709 97818106 97803003 97740871 97697210 97698838 97629499 97529471
546.6 97529471 97507703 97488707 97421551 97378415 97351551 97306448 97280812 97254097 97188747 97140968 97118044 97072375
571.1 97072375 97044802 97041845 96998620 96954107 96963346 96961778 96923524 96916443 96923929 96902859 96899074 96910286 96905255
597.6I6905255K1357M7469K9063M4936O9642L2800J9652M3857J0026o336O6423J02616
622.1I7386760Q0990R2793R7596P1615Q1861Q8388N9688O8331Q8626O0642N2458P1692
646.6I8301440N2655M9675Q3434P2974M7374O4218O2841N0819R0450J26648O8540K6124
671I9097192N4550N7078N1898N3560M2504M8900N8067K8253R334K4068J6725m601K80
697.5I9537808J1569J1444J0336K390J895J6320K0742K0373K0528J1152K605L135M965
724.1I9675262N257L487j669j901M881K945m101m238j0222j2356M41K372K182K2942
752.6I9685282K4193m953n835J2981Q220N108J2606L642n829k968p350q40J8567J0377
781.2I9753201L076K6488K4873n841R89K2227J2147J6713L5030K3556J2868J5742Q315
$$ plain form
597.6 96905255 96926612 96974081 97003144 97048080 97117722 97150522 97170174 97214031 97224057 97217721 97284144 97386760
622.1 97386760 97467750 97560543 97658139 97729754 97811615 97900003 97959691 98028022 98116648 98177290 98229748 98301440
646.6 98301440 98354095 98403770 98487204 98560178 98607552 98671770 98734611 98785430 98875880 99002528 99071068 99097192
671 99097192 99151742 99208820 99260718 99314278 99356782 99405682 99463749 99492002 99501336 99525404 99542129 99537528 99537808
697.5 99537808 99549377 99560821 99571157 99573547 99575442 99591762 99612504 99632877 99653405 99664557 99667162 99670297 99675262
724.1 99675262 99680519 99684006 99682337 99680436 99685317 99688262 99684161 99679923 99669701 99657345 99657786 99660158 99662340 99685282
752.6 99685282 99709475 99704522 99698687 99711668 99719888 99724996 99737602 99741244 99735415 99732447 99725097 99724257 99742824 99753201
781.2 99753201 99756277 99782765 99807638 99801797 99802786 99825013 99837160 99853873 99888903 99912459 99925327 99941069 99949384
807.7I9949384J5861L4022J6588l016J5998K4998O688N388N531j5163j6260R41n340
834.2A00035620j3435O67j013j5032o390m17N460O795J0276m375p451P75j1480j6713
862.8I9983287l731m149j4943r119j5390l1311j5306M148k551K182J8591N573p862
889.3I9909419Q029O836r113K145R686o926q213l833j8352j3626K587j3804k5118p695
917.8I9832022r256j7155M131R954q071p51O479j1777m858J3286n555j5903K09p832
946.4I9784923k2567j4841k1977l6042k5052k6042m1919l2110k5832m3255m0251k9540
970.9I9425495m5020m5597k6703m0651n9610m4036l9315n0968l9673l2926m8309m9156
995.3I8903531m4865n3519m5317l3772n0277n7166m3643m9186n1426k6936j9932l3170
$$ plain form
807.7 99949384 99965245 99999267 100015855 100012839 100028837 100053835 100060523 100065911 100071442 100056279 100040019 100040960 100035620
834.2 100035620 100022185 100022852 100021839 100006807 100000417 100000000 100005460 100012255 100022531 100018156 100010705 100011480 100000000 99983287
862.8 99983287 99979556 99975407 99960464 99951345 99935955 99904644 99889338 99893486 99890935 99893117 99911708 99917281 99909419
889.3 99909419 99917448 99924284 99915171 99917316 99927002 99920076 99911863 99908030 99889678 99876052 99878639 99864835 99839717 99832022
917.8 99832022 99822766 99805611 99809742 99819696 99811625 99810874 99817353 99805576 99800718 99814004 99808449 99792546 99792755 99784923
946.4 99784923 99762356 99747515 99725538 99689496 99664444 99638402 99596483 99564373 99538541 99495286 99455035 99425495
970.9 99425495 99380475 99334878 99308175 99267524 99207914 99163878 99124563 99073595 99033922 99000996 98952687 98903531
995.3 98903531 98858666 98805147 98759830 98726058 98675781 98618615 98574972 98525786 98474360 98447424 98427492 98394322
1019.8I8394322k4789j5456k9969l2800k4748l7277m3559k7645k1189j9193n799p606
1044.3I8104292k0969j0001Q624J3620K2733K3562N001L427J7971J0043l040J437p540
1070.8I8169160k4825j9056j2600j5510l999R173R358J5473K3729J6361J2225K0272
1095.3I8199761J6093O533J0311O396q720r608p630j6635j1474O532R781R442J4537
1121.8I8225319R287j538N734M2474P9072Q4376O6698M8697M4024M0555K7924K1875
1146.3I8694497K6125K7013K3836J9401R650j79j651L88J657R876K4891L4761L6610
1172.8I8906875L4064K9355K6828K7698K6048J9109J5437J7214J5670J0479O658K694
1197.3I9138129j639j26J580j460m59j43p248j1009r501j4198j9270j3298q374r329
$$ plain form
1019.8 98394322 98369533 98354077 98324108 98291308 98266560 98229283 98185724 98158079 98136890 98117697 98111898 98104292
1044.3 98104292 98083323 98073322 98081946 98095566 98118299 98141861 98146862 98150289 98168260 98178303 98175263 98176700 98169160
1070.8 98169160 98144335 98125279 98112679 98097169 98093170 98102343 98111701 98127174 98150903 98167264 98179489 98199761
1095.3 98199761 98215854 98222387 98232698 98239094 98230374 98220766 98213136 98196501 98185027 98191559 98201340 98210782 98225319
1121.8 98225319 98234606 98233068 98238802 98281276 98360348 98444724 98511422 98560119 98604143 98644698 98672622 98694497
1146.3 98694497 98720622 98747635 98771471 98790872 98800522 98800343 98798692 98799080 98800737 98810613 98835504 98870265 98906875
1172.8 98906875 98940939 98970294 98997122 99024820 99050868 99069977 99085414 99102628 99118298 99128777 99135435 99138129
1197.3 99138129 99136490 99136364 99137944 99136484 99136025 99135882 99128634 99117625 99108124 99093926 99074656 99061358 99052984 99043655
1225.8I9043655k211O878Q047J1379J5264J3060J4364J4866L427n031l647r132j9204
1252.3I9091715k1422k5118l3652l2014k8134l7527m3737l5859k4914r686Q392J2315
1276.8I8820359L469j675o789j5885j2618L606K2524M6099O4069O1160M9412M2290
1301.3I9076021L0499J7715J3316M756n811L69J0759J1921K0235L0184K4349J9353
1325.8I9253666J8353N465l612l707j9318l4964j7244K617n752j3184j4496j9592j3501
1352.3I9134731q243j8597k6911l3641m1145k9272j9538l4804m8023n4669o4963o4546
1376.7I8690379p3767j27631j48160k7227J31255J51438P6729J2815k3443k1940n961
1399.2I8634487k426q678q452o109j2303j6963k6942m3785n3680m1294o193K3562L8188
$$ plain form
1225.8 99043655 99041444 99048322 99056369 99067748 99083012 99096072 99110436 99125302 99128729 99123698 99120051 99110919 99091715
1252.3 99091715 99070293 99045175 99011523 98979509 98951375 98913848 98870111 98834252 98809338 98799652 98808044 98820359
1276.8 98820359 98823828 98822153 98815364 98799479 98786861 98790467 98812991 98859090 98923159 98984319 99033731 99076021
1301.3 99076021 99106520 99124235 99137551 99142307 99136496 99136865 99147624 99159545 99179780 99209964 99234313 99253666
1325.8 99253666 99272019 99277484 99273872 99270165 99250847 99215883 99198639 99201256 99195504 99182320 99167824 99148232 99134731
1352.3 99134731 99126488 99107891 99080980 99047339 99006194 98976922 98957384 98922580 98874557 98819888 98754925 98690379
1376.7 98690379 98616612 98488981 98340821 98313594 98444849 98596287 98673016 98685831 98662388 98640448 98634487
1399.2 98634487 98632061 98623383 98614931 98608822 98596519 98579556 98552614 98508829 98455149 98413855 98407662 98431224 98469412
1425.7I8469412K9010J8126K0498L016j7488P260L3015K6750J9264M596j0443o801
1450.2I8596215j6039n0831q4478n1480J7136L9315N1576P6789Q9562P5185N3203M9985
1474.7I8846138N4538L9786J6904Q404l439l1769l6580j460J9580J0216M852J6832
1499.1I8944002L0476K4575k3782m7171J6922L3128K956j6129j9985k6143k4819n329
1523.6I8888701o574r859j806k1285l2615r305k9838q1825n4264q345o151j7553l5024
1550.1I8574257m3780m3708n1737r0944o9982n526k4282n7495p7027q4877o8242q4710
1574.6I7871947j31994j21898j04093j30099j64229j84840k01619k31576k58117k73854
1595I6069628k91193l10087l22282l35050l48550l54546l62855l67499l58110l83401
$$ plain form
1425.7 98469412 98498422 98516548 98537046 98540062 98522574 98529834 98562849 98589599 98608863 98613459 98603016 98596215
1450.2 98596215 98580176 98529345 98444867 98393387 98410523 98449838 98501414 98578203 98667765 98742950 98796153 98846138
1474.7 98846138 98900676 98940462 98957366 98965770 98962331 98930562 98893982 98892522 98912102 98922318 98927170 98944002
1499.1 98944002 98974478 98999053 98975271 98928100 98945022 98978150 98981106 98964977 98944992 98918849 98894030 98888701
1523.6 98888701 98882127 98872268 98870462 98849177 98816562 98807257 98777419 98695594 98641330 98632985 98626834 98609281 98574257
1550.1 98574257 98530477 98486769 98435032 98344088 98274106 98268580 98244298 98186803 98109776 98024899 97956657 97871947
1574.6 97871947 97739953 97618055 97513962 97383863 97219634 97034794 96833175 96601599 96343482 96069628
1595 96069628 95778435 95468348 95146066 94811016 94462466 94107920 93745065 93377566 93019456 92636055
1615.4I2636055l96967k80786k03818k14290j99241j64610j30922o6656J2422R8300
1635.8I1089487J66398K04009K36398K55269L13860L87454L51858L68572M92906M31043
1656.2I4297254L54397L66599L89355L73644L19743K92486K92200K70968K62380K66945
1676.6I7485971K43652K14732J94407K20668K33531J91516J62076J30922Q9759O3014
1697I9230248O5750Q9532Q6182N4729M1694K7787Q971J67j4586j4031K9558M4161K2799
1723.5I9672961K1631K3770J4818R137J0681L5483M8256L4803K1041K2596K8252J2559
1748I9955988m852J8787L0077Q059M971M494m935P534O365j1861j2493l731O413J1838
1776.5A00016654R453N72m506J752M328r919k3508j1581P314R441q34j0580K694J5360
$$ plain form
1615.4 92636055 92239088 91958302 91754484 91540194 91340953 91176343 91045421 90978765 90991187 91089487
1635.8 91089487 91255885 91459894 91696292 91951561 92265421 92652875 93004733 93373305 93866211 94297254
1656.2 94297254 94651651 95018250 95407605 95781249 96100992 96393478 96685678 96956646 97219026 97485971
1676.6 97485971 97729623 97944355 98138762 98359430 98592961 98784477 98946553 99077475 99167234 99230248
1697 99230248 99295998 99385530 99471712 99526441 99568135 99595922 99604893 99605060 99590474 99576443 99606001 99650162 99672961
1723.5 99672961 99694592 99718362 99733180 99742317 99752998 99788481 99836737 99871540 99892581 99915177 99943429 99955988
1748 99955988 99951136 99969923 100000000 100008059 100013030 100017524 100012589 100020123 100026488 100014627 100002134 99998403 100004816 100016654
1776.5 100016654 100026107 100026679 100022173 100023925 100028253 100018334 99994826 99983245 99990559 100000000 99999166 99988586 99991280 100006640
1805.1A00006640K384r763l511J139l118j692K408k891r316p946p677r292R71M638
1833.6I9962974N42M333j454k0468k6179n054Q797P117L422k748n698o891q845n972
1862.2I9903876n448j8150k2972r53J3310K801n519n901r162r763m321o878j7137j2714
1890.7I9801069m416q667j0127n871n501q041j0514j3006j2445q047o920j4090j9473
1917.3I9673951j2791q935r960m482m775r906q106r358j4323j3751j6320k0843j2643
1943.8I9527758m017p689j0639r168j2004j6809j6450j4353j2553r817j1468j4281
1968.3I9388510j0443q160j3190j3632q940j1105j2660q988j1712j5456j1545p546
1992.7I9255133p207p659q660r907p617p165j2457j3226r400r763j2815j7703l3843
$$ plain form
1805.1 100006640 100009024 99999261 99995750 99996889 99993771 99992079 99994487 99991596 99982280 99974334 99966657 99957365 99958336 99962974
1833.6 99962974 99963516 99967849 99966395 99945927 99919748 99914694 99923491 99930608 99934030 99931282 99925584 99918693 99909848 99903876
1862.2 99903876 99898428 99880278 99857306 99856353 99869663 99872464 99866945 99861044 99851882 99842119 99837798 99830920 99813783 99801069
1890.7 99801069 99796653 99787986 99777859 99771988 99766487 99758446 99747932 99734926 99722481 99714434 99707514 99693424 99673951
1917.3 99673951 99661160 99652225 99642265 99637783 99633008 99623102 99614996 99605638 99591315 99577564 99561244 99540401 99527758
1943.8 99527758 99523741 99516052 99505413 99496245 99484241 99467432 99450982 99436629 99424076 99414259 99402791 99388510
1968.3 99388510 99378067 99369907 99356717 99343085 99334145 99323040 99310380 99301392 99289680 99274224 99262679 99255133
1992.7 99255133 99247926 99240267 99231607 99221700 99214083 99206918 99194461 99181235 99171835 99162072 99149257 99131554 99097711
2019.2I9097711n3901p2687o3152J6696P9363N3114J5151P415L594n966m661L242l355
2045.8I9072564j1999m554K009r60Q59K056k682n436o402n978n12L910k039q088l106
2076.4I9029642K301K62O44M143L361M83j925k468L016P129J615l516k420l165o694
2106.9I9032408l678O32l791r763j1760j4132j6338j5670j7094k2495k9153l6615m3142
2133.5I8809409m4960m4924n3894o9678p8195p5925o5768m4357j1814K5773P3594J40566
2157.9I8559827K16198K69544K67780J95819R0044J5426k2036m4542l9637j2321J6791
2180.4I9512893M7517O7776O2210M5734L3331J7399M625P653P570k664k748M452L231
2206.9I9808979%O6l219l415Q94l529p272O98M17o431J25M267j370J704M328l958m435
$$ plain form
2019.2 99097711 99043810 98971123 98907971 98924667 99004030 99057144 99072295 99079710 99083304 99077338 99072677 99075919 99072564
2045.8 99072564 99060565 99056011 99058020 99057060 99057919 99059975 99057293 99051857 99045455 99039477 99038965 99042875 99040836 99032748 99029642
2076.4 99029642 99031943 99032205 99032849 99036992 99040353 99040836 99038911 99036443 99039459 99046588 99048203 99044687 99042267 99039102 99032408
2106.9 99032408 99028730 99029362 99025571 99015808 99004048 98989916 98973578 98957908 98940814 98918319 98889166 98852551 98809409
2133.5 98809409 98764449 98719525 98665631 98595953 98517758 98441833 98376065 98331708 98319894 98345667 98419261 98559827
2157.9 98559827 98776025 99045569 99313349 99509168 99599212 99614638 99592602 99548060 99508423 99496102 99512893
2180.4 99512893 99560410 99628186 99690396 99736130 99769461 99786860 99791485 99799138 99806708 99804044 99801296 99805748 99808979
2206.9 99808979 99808979 99809045 99805826 99802411 99803305 99799776 99792504 99793202 99793619 99787188 99787313 99791580 99790210 99791914 99796242 99792284 99787849
2241.6I9787849K235j382m048L612L392m256k026j26m017J663O223j854k313N347J734
2272.2I9792033n722k861O62q9K151M18l946J555N305j132k259J311M53L761R877O675
2304.8I9808192K629O789O127J228Q142J7673J4949J2719J4591Q470O843J1617J210
2331.3I9921179j0550l660o235j9902j6796j5718k4193l571L3224N1445M7111L1352
2355.8I9983686J6314J3828O950j8740l3086k4861k9779m4530l6079j9914j8775k0343
2380.2I9774671j5152j1003n203L868M566N06n90l052l600K271J866n525n91M018o646
2410.8I9740404r483J79L510P04j037m894o896m29M786K634Q29q64n919m679K664J097
2443.5I9722606k497J841O14m011J496M792m077p415O74K187j740M11L28n019n340
$$ plain form
2241.6 99787849 99790084 99788702 99784654 99788266 99791658 99787402 99785376 99785250 99781233 99782896 99789119 99787265 99784952 99790299 99792033
2272.2 99792033 99786311 99783450 99784112 99784023 99786174 99786592 99782646 99784201 99789506 99788374 99786115 99787426 99787879 99791640 99801517 99808192
2304.8 99808192 99810821 99817610 99823737 99824965 99833107 99850780 99865729 99878448 99893039 99901509 99908352 99919969 99921179
2331.3 99921179 99910629 99906969 99900734 99880832 99864036 99848318 99824125 99820554 99853778 99905223 99952334 99983686
2355.8 99983686 100000000 100013828 100020778 100002038 99968952 99944091 99914312 99869782 99833703 99813789 99795014 99774671
2380.2 99774671 99759519 99748516 99743313 99747181 99751747 99752253 99751663 99748611 99745011 99747282 99749148 99743623 99743032 99747050 99740404
2410.8 99740404 99730921 99731100 99734610 99735314 99734277 99729383 99722487 99722058 99726844 99729478 99730307 99729443 99723524 99718845 99721509 99722606
2443.5 99722606 99720109 99721950 99722564 99718553 99720049 99724841 99720764 99713349 99714023 99716210 99714470 99714881 99715209 99710190 99704850
2474.1I9704850l910l088K831L082n430m298L851J329j591K801j407q463l404J240
2502.6I9688393k504k658j395m375k169L153k98m649J31K390k50K50j860k253K426
2533.2I9674332l069j0819k199N567j246l785K063k355r191k187K879l267m780j925
2561.8I9640018j657M11M35m554l993J085j502k766L433j2p212j925K384j681j526
2592.4I9620938n30o449p099q11p33j127J967k604m983K259J472m840j222R24p755
2623I9589407q183J162K50l230J96j120m202j985l213q070n830n78j669k581k616q434
2655.6I9539304q524m53J8j120M279K080m792k163j32m529k760%o032p910j943j013
2688.2I9504310l797k456k354m941l916l720n239k944k325n704o056n722p218j741
$$ plain form
2474.1 99704850 99700940 99697852 99700683 99703765 99698335 99694037 99697888 99699217 99697626 99700427 99699020 99690557 99687153 99688393
2502.6 99688393 99685889 99683231 99681836 99677461 99675292 99678445 99678147 99673498 99673629 99676019 99675769 99676019 99674159 99671906 99674332
2533.2 99674332 99671263 99660444 99658245 99663812 99662566 99658781 99660844 99658489 99649298 99647111 99649990 99646723 99641943 99640018
2561.8 99640018 99638361 99638772 99639207 99634653 99630660 99631745 99630243 99627477 99630910 99630898 99623686 99621761 99624145 99622464 99620938
2592.4 99620938 99620408 99613959 99606860 99606049 99605316 99604189 99606156 99603552 99598569 99600828 99602300 99597460 99596238 99597162 99589407
2623 99589407 99581224 99582386 99582636 99579406 99579602 99578482 99574280 99572295 99569082 99561012 99555182 99554604 99552935 99550354 99547738 99539304
2655.6 99539304 99530780 99530327 99530345 99529225 99533504 99535584 99530792 99528629 99528497 99523968 99521208 99521208 99515176 99507266 99505323 99504310
2688.2 99504310 99500513 99498057 99495703 99490762 99486846 99483126 99477887 99474943 99472618 99466914 99460858 99455136 99447918 99446177
2716.8I9446177O861N037j181l57l916j2887q464k253n358m208k194n042j574Q726
2745.3I9419367P683p504j4156q833n073k742l784j0294j0175l183l182n073J359L535
2773.9I9357945l368o825q672j0711n102J579K45n782j2344j4639o580k253j6028k2155
2802.4I9245310j1945j0192j2553r728j4400k3162j8865p558q685j6099j4752j1504
2826.9I9085867j1676j3173j6200j3793p301k2984n8079o7740n3788n2321n9783n2756
2851.4I8656273l1245j0657Q726J8799R901K008L499j526k968J2600J2362j1760j8859
2877.9I8647153j0401q452q332j0234j6743j9014j3024r137j6982k8842k9475k1159
2902.4I8455358k0206k5291k4068j3679j0228l4911o6322p3397o2198l6865m745K1369
$$ plain form
2716.8 99446177 99453038 99458075 99456894 99456537 99452621 99439734 99431270 99429017 99423659 99419451 99417257 99412215 99410641 99419367
2745.3 99419367 99427050 99419546 99405390 99396557 99391484 99388742 99384958 99374664 99364489 99361306 99358124 99353051 99354410 99357945
2773.9 99357945 99354577 99347752 99339080 99328369 99323267 99324846 99325091 99319309 99306965 99292326 99285746 99283493 99267465 99245310
2802.4 99245310 99233365 99223173 99210620 99200892 99186492 99163330 99144465 99136907 99128222 99112123 99097371 99085867
2826.9 99085867 99074191 99061018 99044818 99031025 99023724 99000740 98942661 98874921 98821133 98768812 98709029 98656273
2851.4 98656273 98625028 98614371 98623097 98641896 98651797 98653805 98657304 98655778 98652810 98665410 98677772 98666012 98647153
2877.9 98647153 98636752 98628300 98619968 98609734 98592991 98573977 98560953 98551816 98534834 98505992 98476517 98455358
2902.4 98455358 98435152 98409861 98385793 98372114 98361886 98326975 98260653 98187256 98125058 98088193 98083448 98104817
2926.8I8104817L6448L3039K6685L3259M3637M7540M8155N1743M1497P754j4359o395
2951.3I8453820o563k0492j5753m95O312Q077J0579J4162K1363L4451M1098L5733L6418
2977.8I8618710M0782K9319J5956J6821K1732L1280L2103R567o20j407j5014j4294
3002.3I8784935o026o967Q124L2335K2567j1427k8467k8145k5618j8591j3864k1446
3026.8I8687410j9729l081M083j1105k9087j5050R698J794k6822m0138k6441j4293
3051.3I8517239k3019k8604k6769k7555k0439p677k616j4747l4570m0221k5511L493
3075.7I8269004J7064p653l0994l2377m0484l9196k5773l6514m7773l3432j9878k4075
3100.2I7947919l5721l6186k1636j2958k6894l5041j0944J145k3312n5855p6801p1460
$$ plain form
2926.8 98104817 98141265 98174304 98200989 98234248 98277885 98325425 98373580 98425323 98466820 98474574 98460215 98453820
2951.3 98453820 98447257 98426765 98411012 98410517 98416829 98424906 98435485 98449647 98471010 98505461 98546559 98582292 98618710
2977.8 98618710 98659492 98688811 98704767 98721588 98743320 98774600 98806703 98816270 98815650 98814243 98799229 98784935
3002.3 98784935 98778909 98771942 98780066 98812401 98834968 98823541 98795074 98766929 98741311 98722720 98708856 98687410
3026.8 98687410 98667681 98664600 98668683 98657578 98628491 98613441 98623139 98624933 98598111 98557973 98531532 98517239
3051.3 98517239 98494220 98465616 98438847 98411292 98390853 98383176 98380560 98365813 98331243 98291022 98265511 98269004
3075.7 98269004 98286068 98278415 98247421 98215044 98174560 98135364 98109591 98073077 98025304 97991872 97971994 97947919
3100.2 97947919 97912198 97876012 97854376 97841418 97814524 97779483 97768539 97769684 97746372 97690517 97613716 97542256
3124.7I7542256m6795l0786l9244n3745m4978k4802k7889n4401o8408n8299m5920l7151
3149.2I7009838l1990n0163p7415q0353p0840o5500o5350o9022p0179o9702p4088q0353
3173.6I6204883q1259p9703q1093q6420q9604q8716r0158r4288r7943j01476j03164
3196.1I5211059j03218j03151r8884r5052r7710j05291j09214j03939j01035j03689
3216.5I4189876j08194j13285j14214j16283j18613j11127r4032q9008j16962j43665
3236.9I3064493j36465j15108j00273r4289r7251j10882j14996r5123p8982q6081r5832
3259.3I1939211r1553q1432p1191n4992m4793o9296j02228j07402j02579r6262r1928
3281.7I1025555j00285j08140j00863q6832r1136j18023j45543j64526j64843j39320
$$ plain form
3124.7 97542256 97495461 97464675 97425431 97371686 97326708 97301906 97274017 97219616 97151208 97092909 97046989 97009838
3149.2 97009838 96977848 96927685 96850270 96769917 96699077 96633577 96568227 96499205 96429026 96359324 96285236 96204883
3173.6 96204883 96123624 96043921 95962828 95876408 95786804 95698088 95607930 95513642 95415699 95314223 95211059
3196.1 95211059 95107841 95004690 94905806 94810754 94713044 94607753 94498539 94394600 94293565 94189876
3216.5 94189876 94081682 93968397 93854183 93737900 93619287 93508160 93414128 93325120 93208158 93064493
3236.9 93064493 92928028 92812920 92712647 92618358 92521107 92410225 92295229 92200106 92121124 92035043 91939211
3259.3 91939211 91847658 91766226 91695035 91640043 91595250 91525954 91423726 91316324 91213745 91117483 91025555
3281.7 91025555 90925270 90817130 90716267 90629435 90538299 90420276 90274733 90110207 89945364 89806044
3302.1H9806044j18250j34980j80990k16543k19459k08699k11466k19655k17962k18392
3322.5H7859648k28166k48367k73931k84940k82091k73388k61545k75708l13526l31950
3342.9H5086036l37762l37797l22599l36438l81619l95643l77417l67588l76755l80963
3363.3H1471455l59273l41773l68595m15027m15129l69018l37553l28922l18009l02809
3383.7G7915347k82956k48563k04998k02644k48045k57104k00504j62805k07293k54184
3404.1G5646251k25693j80685j63257j57851j61278j60915j42968j22803j07706q7410
3424.5G4135685o2311l8010k9105j8942P928O705k1195j3686K7281N9557P6372Q6307
3449G4216586R8062J12992J22911J34379J50949J50591J51670J86676K10654J74308
$$ plain form
3302.1 89806044 89687794 89552814 89371824 89155281 88935822 88727123 88515657 88296002 88078040 87859648
3322.5 87859648 87631482 87383115 87109184 86824244 86542153 86268765 86007220 85731512 85417986 85086036
3342.9 85086036 84748274 84410477 84087878 83751440 83369821 82974178 82596761 82229173 81852418 81471455
3363.3 81471455 81112182 80770409 80401814 79986787 79571658 79202640 78865087 78536165 78218156 77915347
3383.7 77915347 77632391 77383828 77178830 76976186 76728141 76471037 76270533 76107728 75900435 75646251
3404.1 75646251 75420558 75239873 75076616 74918765 74757487 74596572 74453604 74330801 74223095 74135685
3424.5 74135685 74073374 74035364 74006259 73987317 73995245 74001950 73980755 73967069 73994350 74053907 74130279 74216586
3449 74216586 74314648 74427640 74550551 74684930 74835879 74986470 75138140 75324816 75535470 75709778
3469.4G5709778J22941J24031J59323J92368J96523J64842J55741J80042J82837J72198
3489.8G7360624J86539K03603K02340J97959K01422K05940J95515J80352J85025K09796
3510.2G9329115K33561K31343K14208K12538K27314K43741K36929K14940K15858K35069
3530.6H1594616K49940K61951K60395K44224K46739K67172K70432K43724K27868K44439
3551H4111500K59656K61384K65062K73060K73908K63345K66224L10349L51179L43472
3571.3H6979139L22664L19504L29054L45152L58111L52651L36093L38560L62211L65037
3591.7I0408176L55655L65079L77094L70205L56978L39210L15422L18330L39526L42536
3612.1I3888211L31658L06207K98721L25352L13151K52545K00951K21270K80589K66009
$$ plain form
3469.4 75709778 75832719 75956750 76116073 76308441 76504964 76669806 76825547 77005589 77188426 77360624
3489.8 77360624 77547163 77750766 77953106 78151065 78352487 78558427 78753942 78934294 79119319 79329115
3510.2 79329115 79562676 79794019 80008227 80220765 80448079 80691820 80928749 81143689 81359547 81594616
3530.6 81594616 81844556 82106507 82366902 82611126 82857865 83125037 83395469 83639193 83867061 84111500
3551 84111500 84371156 84632540 84897602 85170662 85444570 85707915 85974139 86284488 86635667 86979139
3571.3 86979139 87301803 87621307 87950361 88295513 88653624 89006275 89342368 89680928 90043139 90408176
3591.7 90408176 90763831 91128910 91506004 91876209 92233187 92572397 92887819 93206149 93545675 93888211
3612.1 93888211 94219869 94526076 94824797 95150149 95463300 95715845 95916796 96138066 96418655 96684664
3632.5I6684664K28942K12485J95312J74588J58161J35660J12438J33825J71017J42080
3652.9I8349172J00267J13374J30290R6106O0678M9603K5940R71J5062J6207O044M7457
3677.4I9011171P1072N5993N1492N8896O4504O3837P1090Q1885O8951L9935K4187L4201
3701.9I9697214M6415K8306m411j5980J2267M6670M1032J8853P146J544p09R328J6946
3728.4I9904621l004k2841n698L0249M2045K778n9331m7552K4140J4788j2529K1839
3752.9I9889505M4829J9925l725Q804J4877L6m280p21Q339J5074Q255k03p15L529m399
3783.5I9999130q041N043O944k361p850j3572j8173k2644n615J6249M53L492K7424
3810I9980479J4395j8942k7609j5414k0355L034L6180J8549n931j1182j132L689k2095
$$ plain form
3632.5 96684664 96913606 97126091 97321403 97495991 97654152 97789812 97902250 98036075 98207092 98349172
3652.9 98349172 98449439 98562813 98693103 98789209 98849887 98899490 98925430 98926401 98941463 98957670 98963714 99011171
3677.4 99011171 99082243 99138236 99189728 99248624 99313128 99376965 99448055 99529940 99598891 99638826 99663013 99697214
3701.9 99697214 99743629 99771935 99767524 99751544 99763811 99810481 99851513 99870366 99877512 99879056 99878347 99887675 99904621
3728.4 99904621 99901617 99878776 99873078 99903327 99945372 99948150 99888819 99841267 99865407 99880195 99867666 99889505
3752.9 99889505 99934334 99954259 99950534 99959338 99974215 99974251 99969971 99969250 99977589 99992663 100000918 100000715 100000000 100003529 99999130
3783.5 99999130 99991089 99996132 100003076 100000715 99992865 99979293 99961120 99938476 99932861 99949110 99949563 99953055 99980479
3810 99980479 99994874 99975932 99948323 99932909 99912554 99915588 99951768 99970317 99964386 99953204 99952072 99955761 99933666
3836.5I9933666l0762N567K2465J8710J6117r608o2269p9221J4681P7730M2278l451
3861I9945903k3681r704k74j1790P755K8455J1444o610r322K557M285l969M411L272
3889.5I9942732m041Q529O944j7661k7382j5289K188K5356L5429K4336P296j3227k3353
3916I9951857o652J3364J2111K742K694P81n889N997K0277P069l826J478J001l004
3944.6A00000000j651L737O247M303M161J227J646Q547J0621R966L100j0526o879J2601
3973.1A00047100J7285Q511O366K837n388p689l540N889J3947J3411O247R77
3997.6A00105953
$$ plain form
3836.5 99933666 99902904 99908471 99930936 99949646 99965763 99956155 99893886 99814665 99829346 99907076 99949354 99945903
3861 99945903 99922222 99912518 99912244 99900454 99908209 99936664 99948108 99941498 99932176 99934733 99939018 99935049 99939460 99942732
3889.5 99942732 99938691 99947220 99954164 99936503 99909121 99893832 99896020 99921376 99956805 99981141 99988437 99975210 99951857
3916 99951857 99945205 99958569 99970680 99973422 99976116 99976897 99971008 99977005 99997282 100004351 100000525 100002003 100003004 100000000
3944.6 100000000 99998349 100002086 100008333 100012636 100016797 100018024 100019670 100028217 100038838 100048804 100051904 100041378 100034499 100047100
3973.1 100047100 100064385 100072896 100079262 100082099 100076711 100069022 100065482 100071371 100085318 100098729 100104976 100105953
3997.6 100105953
##END=$$ End of the data block
