##TITLE=4 meg-com $$ Begin of the data block
##JCAMP-DX=5.00 $$ ACD/SpecManager v 10.08
##SPECTROMETER/DATA SYSTEM=Alpha
##DATE=16 Oct 2013 10:19:54
##DATA TYPE=INFRARED SPECTRUM
##DATA CLASS=XYDATA
##ORIGIN=
##OWNER=
##NPOINTS=1765
##FIRSTX=399.75695801
##LASTX=3997.56933594
##MAXX=3997.56933594
##MINX=399.75695801
##MAXY=0.84742945
##MINY=0.36460045
##XFACTOR=1.0000000000
##YFACTOR=1.000000000000000e-9
##FIRSTY=0.60744095
##DELTAX=2.03957629
##XUNITS=1/CM
##YUNITS=ARBITRARY UNITS
##XYDATA=(X++(Y..Y))
399.8 607440948 604343235 599983335 596968591 597447872 600371361 602617323 602397084 600840628 600351155
418.1 600351155 601473272 601506531 598925292 595028281 592201531 591347516 591406584 590377331 587575614
436.5 587575614 585356951 586423159 590595901 595036745 597226501 597706139 598617852 600708127 602613986
454.8 602613986 602363527 599621832 596583247 595009387 594535649 593356669 590162337 585641503 581998110
473.2 581998110 580810070 580942631 580103874 577805221 575772107 575668633 577117085 578103244 577167213
491.5 577167213 574860573 572900355 572240412 572112024 570798159 567681253 563985705 561278284 559873462
509.9 559873462 558338583 555097580 550260544 545649946 542962909 541842461 540792048 539228499
526.2 539228499 537981927 538405836 540999532 544738472 548290610 551337719 554520667 558326364 561920643
544.6 561920643 563741922 563006639 560589612 558393896 557313085 556259334 553585172 549000561 543759346
562.9 543759346 539157391 535173535 531009257 526473343 522640467 521325588 523475826 528180122
579.2 528180122 533554018 538392782 542868018 547676146 552704394 556667328 558172464 557524741 556617320
597.6 556617320 556944311 558301687 559294879 558942795 557867765 557849705 559775770 562727034 565138221
616 565138221 566516340 568104088 571370900 576207995 580904543 583840966 585159242 586449027 588871479
634.3 588871479 592015445 594308913 594818711 594514310 595176399 597400963 600005865 601295829 600988448
652.7 600988448 600592732 601642966 603959739 605867684 606169462 605389833 605070531 607250750 610215306
671 610215306 611736000 611901104 611817002 613034904 615705669 618273914 619205654 618681967 618248761 618998051
691.4 618998051 620258570 620251000 618029654 614691794 612205982 611349285 611266971 610760987 609837353 609894872
711.8 609894872 612256110 616641283 621392965 625251770 628542244 632622778 638203859 644312263
728.1 644312263 649085760 651720524 653346658 655632734 658785462 661307871 661649466 659944236 657673895
746.5 657673895 655970275 654488981 651892900 647583485 642663002 638877749 637043536 636659443 636762679
764.8 636762679 637334764 639624655 644677877 651905835 659484863 665854096 670893073 675720930 681151986
783.2 681151986 686623991 690784812 693161368 694841802 697403967 701398730 705846190 709349513
799.5 709349513 711618066 713623106 716359019 719506621 721718252 722331226 722063661 722191215 723232090
817.9 723232090 724338114 724125862 722138941 719201088 716408372 713936448 710927069 706693649 701594353
836.2 701594353 696721315 692932606 690068126 687227905 683931231 680606008 677931547 675998032
852.5 675998032 674145341 671718180 669090867 667969048 670181155 676000118 683996677 692352951
868.9 692352951 700125992 707331240 713829458 718691289 720874727 720039964 716821432 712437630 707719803
887.2 707719803 702638209 696970046 690989673 685371101 680599332 676480114 672227383 667043030
903.5 667043030 660764992 653829575 646615028 639030814 630797565 622137964 613930166 607226849
919.8 607226849 602647007 599987090 598537266 597780406 597719491 598571599 600281894 602548599 605153322
938.2 605153322 608038902 610952914 612928629 612431645 608301759 600452602 589690328 577071667
954.5 577071667 563369274 548814356 533343852 517062008 500268102 483245939 466134906
968.8 466134906 448980361 432002634 415733814 400894612 388200760 378172576 371010303 366602480
985.1 366602480 364625037 364600450 365961313 368171513 370809376 373530447 376077384 378339261 380238920
1003.5 380238920 381583095 382242620 382332504 382140368 382040441 382332951 383131474 384401113 386111766
1021.8 386111766 388277739 390857935 393724531 396657288 399396300 401742548 403594583 404973000
1038.1 404973000 406061709 407027572 407920301 408827364 409960985 411619902 414059252 417376161 421554476
1056.5 421554476 426631272 432766318 440056443 447960109 454747945 457866102 455627382 448948234
1072.8 448948234 440929234 434490114 430793583 429643154 430420041 432581335 435745925 439593643
1089.1 439593643 443817496 448099405 452066094 455345452 457696497 459094554 459834248 460497260 461684436
1107.5 461684436 463699371 466457069 469617516 472797364 475759864 478419304 480809867 483115375
1123.8 483115375 485599130 488486588 491869390 495421380 498277366 499434114 498247892 494704634
1140.1 494704634 489420772 483322352 477155805 471327096 466089368 461681277 458306432 456077814
1156.4 456077814 454978675 454921812 455904394 458093822 461804509 467317283 474666119 483604461 493757278
1174.8 493757278 504776776 516405463 528349876 540105700 551096380 560934186 569479644 576718807
1191.1 576718807 582584977 586953521 589877129 591748297 593204081 594812274 596828222 599268794
1207.4 599268794 602113664 605408072 609177351 613224328 617039740 620029151 621877551 622671843
1223.7 622671843 622699261 622182250 621189892 619766653 618136168 616669893 615623653 615026712 614799559
1242.1 614799559 614925444 615533471 616765320 618561327 620601892 622491062 624032795 625321269 626638651
1260.4 626638651 628202319 629949093 631698370 633397758 635055125 636613846 637915432 638732672
1276.8 638732672 638987303 638882816 638745785 638785481 638927341 638864994 638362527 637458384 636391282 635353565
1297.2 635353565 634360969 633354783 632338345 631405711 630631030 629954934 629191339 628183186 626925528
1315.5 626925528 625549853 624188125 622733057 620832086 618227124 615011156 611569703 608319879
1331.8 608319879 605487764 603099763 601149976 599775910 599102437 598930299 598870039 598582149 597928345
1350.2 597928345 597030520 596075118 595085144 593935907 592540324 590993941 589639604 588650942 587930560
1368.5 587930560 587417841 587016106 586758673 586835742 587294579 587967694 588768423 589984596 591951311
1386.9 591951311 594349921 596379101 597627342 598074555 597949326 597532034 597073197 596543074 595760226
1405.3 595760226 594744623 593553722 592316270 591289699 590540767 589864135 589336693 589287281 589625537
1423.6 589625537 590161264 590704262 591119826 591504395 591881275 592315257 593093574 594037175 594824851 595369935
1444 595369935 595649838 595603704 595133543 594096899 592473269 590334415 588788509 588786721 589561403 591078401
1464.4 591078401 594005883 598484695 604694426 613170862 622294962 630316317 637415349 643996179
1480.7 643996179 650245786 655900538 660956800 665655732 670028865 673682749 676753759 679761648
1497 679761648 682612062 684923470 686490476 687444448 688507557 689868510 690816164 691235185 691406906
1515.4 691406906 691828489 692649961 693696797 694759429 695519924 696004510 696409523 696682453 696801066
1533.7 696801066 696841955 696462274 695645332 695348382 695620894 695807695 695648551 695196867 694689631 694212258
1554.1 694212258 693570316 692378283 691290379 690909028 690419257 689701915 688785970 687764108 686905086
1572.5 686905086 685889840 684819341 684355974 684072495 683427811 682505250 681513608 680575907 679597437
1590.9 679597437 678363860 676730752 674795926 672714114 670469761 667971969 665065408 661649048
1607.2 661649048 657849431 654043794 650330186 646099985 641329885 637463987 634034514 630171895
1623.5 630171895 626422524 622742414 618944407 615474284 612141132 608844519 606872022 606092036
1639.8 606092036 605678618 605547488 605989933 607430279 609143972 610810399 613469660 616680443 619819880
1658.2 619819880 623239517 627125323 631242871 635016203 638974071 643832862 648746073 653579414
1674.5 653579414 658621490 663329124 667673111 672304034 678205490 683988154 688762546 693526089
1690.8 693526089 698227525 703233957 708467007 713039100 717555106 721503854 724737287 727800250
1707.1 727800250 730307877 732146919 733638465 735190570 737309992 739786029 741668999 742730319
1723.4 742730319 743336916 743731022 743894696 743508816 742264032 740942478 740116239 739513099 739511967 740389168
1743.8 740389168 742210329 745358527 750370383 756947100 763414383 769212902 774407208 778851449
1760.1 778851449 783075750 786947072 789966226 792157769 793768883 795479655 797643602 799663305
1776.5 799663305 801151395 802186191 803067803 804113925 805387557 806539237 807230353 807750523 808518410
1794.8 808518410 809503436 810580432 811617434 812429130 813025415 813653886 814476252 815441430 816274107
1813.2 816274107 816790700 817167580 817747355 818551719 819281161 819748759 819971442 820214987 820874274 821787834
1833.6 821787834 822456896 822739899 822807074 822864711 823163688 823817611 824373305 824542820 824577451 824811399
1854 824811399 825306833 825788379 825992167 825952172 825925291 826056182 826382279 826861978 827204883 827312827
1874.4 827312827 827471733 827889800 828397036 828728616 828824282 828833938 829005182 829490185 830023050 830249131
1894.7 830249131 830227971 830248177 830506086 830926180 831226349 831222296 831061125 831084192 831389427 831718862
1915.1 831718862 831815898 831728041 831647754 831762671 832127869 832473993 832536697 832374752 832273901 832456708
1935.5 832456708 832818806 833021462 832932591 832787156 832861006 833179772 833562553 833767951 833724082 833640695
1955.9 833640695 833756864 834069431 834373474 834460795 834337115 834274471 834459066 834777772 834995866 834968805
1976.3 834968805 834804893 834763944 834967613 835248470 835342646 835182250 834969878 834981322 835229695 835422039
1996.7 835422039 835348308 835105121 834913790 834909976 835015714 835003138 834741354 834337533 834027708 833932221
2017.1 833932221 833902299 833677709 833226681 832770348 832509160 832423508 832328737 832022607 831519902 831098437
2037.5 831098437 830932736 830912411 830815852 830534339 830177724 829989195 830066919 830234706 830245614 830067933
2057.9 830067933 829929054 830022037 830284178 830496669 830508649 830363035 830285728 830442905 830715120 830861449
2078.3 830861449 830805540 830685794 830708802 830946803 831237018 831368804 831316829 831242979 831338525 831618488
2098.7 831618488 831885993 831986129 831965446 831989944 832178593 832450211 832605481 832556844 832431257 832423508
2119.1 832423508 832593799 832804918 832859039 832740963 832623601 832663596 832849979 833025098 833034933 832919598
2139.5 832919598 832866549 832958877 833114624 833209574 833190680 833145380 833222330 833454967 833735764 833925366 834004641
2161.9 834004641 834103703 834361553 834782720 835217416 835510015 835678339 835903645 836303055 836802423 837235630
2182.3 837235630 837511659 837699234 837941766 838309348 838741183 839097321 839309275 839477837 839742541 840121031
2202.7 840121031 840512812 840803564 840988636 841196954 841533482 841944277 842288315 842484713 842597783 842775345
2223.1 842775345 843083203 843431056 843683779 843806922 843865573 843971670 844195187 844462574 844631791 844676495
2243.5 844676495 844707787 844842374 845092535 845333755 845427096 845396578 845402479 845552504 845782876 845953643
2263.9 845953643 845998406 845989585 846102238 846373260 846653402 846824050 846872926 846905053 847034931 847235024
2284.3 847235024 847391665 847429454 847343326 847229481 847227395 847338438 847414315 847347379 847171426 846984446 846883059
2306.7 846883059 846878707 846841931 846665084 846394241 846128285 845900357 845678985 845410705 845067859 844680190
2327.1 844680190 844353557 844170153 844003856 843669832 843254030 842972517 842901468 843054652 843428850 843720138
2347.5 843720138 843545258 842914402 842172921 841590941 841106236 840637267 840346575 840424836 840756536 841136098
2367.9 841136098 841464758 841727972 842022479 842423618 842875183 843240678 843396544 843366802 843293369 843263507
2388.3 843263507 843241513 843125343 842848122 842486620 842213452 842079222 841960371 841710567 841308951 840894639
2408.7 840894639 840613782 840425849 840171695 839759290 839243293 838774502 838431656 838139594 837750316 837205946
2429.1 837205946 836622775 836158037 835827172 835490465 834998906 834363818 833744407 833255529 832869112 832464933
2449.5 832464933 831939876 831327200 830777347 830383837 830074608 829684734 829141557 828535974 828030527 827694535
2469.9 827694535 827397466 826970458 826416731 825880587 825482488 825208008 824912250 824464023 823912442 823435903
2490.3 823435903 823132932 822925091 822662294 822278142 821852446 821532011 821343601 821152866 820825994 820361435
2510.7 820361435 819895685 819562972 819341063 819082141 818665087 818128943 817642868 817298293 816996872 816585004
2531.1 816585004 816025853 815405905 814848781 814410746 814014018 813511193 812875152 812244058 811749399 811372340
2551.5 811372340 810959876 810389996 809718549 809115708 808660746 808280289 807833493 807255030 806632817 806100667
2571.9 806100667 805686712 805281460 804788053 804215550 803653061 803200722 802852631 802499712 802038193 801499665
2592.3 801499665 801029325 800690293 800405502 800048411 799538553 798930943 798373699 797923326 797464788 796865344
2612.7 796865344 796121240 795345962 794644177 793987989 793246746 792333663 791327953 790372372 789506376
2631 789506376 788656116 787706017 786646724 785582721 784604251 783716857 782832801 781843603 780742228
2649.4 780742228 779671371 778734267 777859151 776945710 775959134 774943709 774005830 773188651 772412121
2667.7 772412121 771560311 770623207 769719958 768933117 768221319 767492354 766702771 765902281 765162528 764493167
2688.1 764493167 763848484 763152778 762361348 761531293 760736763 759975612 759185374 758328140 757439077 756563365
2708.5 756563365 755729675 754924953 754085183 753192365 752298474 751462698 750685811 749916077 749121845 748313963
2728.9 748313963 747549117 746862531 746217370 745571256 744903147 744214356 743537486 742909372 742318630 741703451
2749.3 741703451 741042972 740404904 739847183 739335477 738798797 738212049 737608790 737030327 736473978 735893250
2769.7 735893250 735255957 734573841 733848929 733086407 732302248 731479824 730600357 729677141 728730381 727741539
2790.1 727741539 726673663 725535452 724347651 723119974 721853912 720520020 719098330 717594445
2806.4 717594445 716032147 714426637 712753356 711000860 709155977 707217872 705234647 703202307
2822.7 703202307 701057613 698764563 696337521 693793595 691115379 688241065 685039759 681307435
2839.1 681307435 676846206 671537638 665345252 658414543 651224256 644620895 639596045 636781156
2855.4 636781156 636030793 636534870 637284338 637481451 636744082 635043859 632609725 629859507 627122343
2873.7 627122343 624462247 621856630 619339406 616930366 614614725 612416208 610370338 608485639
2890.1 608485639 606766462 605157793 603538692 601796687 599879503 597735643 595242620 592264771
2906.4 592264771 588693380 584421217 579356611 573508263 567093849 560597479 554672062 549983144
2922.7 549983144 547036886 546034575 546874523 549285591 553043127 557976186 563806474 570152223
2939 570152223 576641083 582953691 588815093 594046772 598638833 602709711 606414258 609988570 613743901
2957.4 613743901 617905617 622516513 627448142 632515728 637605190 642663896 647612572 652283013
2973.7 652283013 656514764 660306990 663736105 666812718 669523537 671906352 673978984 675727487
2990 675727487 677120745 678110540 678720176 678900182 678558946 677823246 676890075 675891459 674967647 674192727
3010.4 674192727 673504114 672825634 672142267 671427011 670561671 669430912 668040991 666469157 664847910
3028.7 664847910 663250506 661588192 659740746 657705426 655653238 653706789 651730597 649561465
3045.1 649561465 647258759 644998312 642805636 640605211 638387680 636107922 633776307 631521523
3061.4 631521523 629399061 627359450 625265539 623017669 620716453 618537307 616555810 614664555
3077.7 614664555 612631083 610426903 608236432 606108308 604014635 601932645 599765658 597537220
3094 597537220 595415771 593454897 591507494 589428961 587304771 585304320 583400190 581436992 579452157
3112.4 579452157 577566028 575702071 573770404 571736515 569598496 567471206 565452039 563523054
3128.7 563523054 561613917 559698343 557837844 556048393 554213762 552257180 550282359 548397541
3145 548397541 546585977 544849455 543186128 541447580 539573252 537720025 535955548 534222603 532485425
3163.4 532485425 530766726 529119253 527504742 525858641 524195254 522548079 520932078 519361973
3179.7 519361973 517813504 516247153 514689028 513186276 511731565 510279596 508796573 507274747
3196 507274747 505758166 504323363 502990484 501693368 500345230 498944879 497596204 496341616 495100170
3214.3 495100170 493846089 492613435 491395921 490191668 488995850 487796158 486630410 485546231
3230.7 485546231 484510213 483382016 482136458 480920285 479780942 478697509 477691442 476706833
3247 476706833 475655794 474589854 473588467 472628623 471658170 470677823 469735265 468847126 467991114
3265.3 467991114 467189908 466483504 465754449 464885771 463947564 463025451 462151766 461330622 460539758 459734529
3285.7 459734529 458918333 458172768 457470804 456696659 455827773 454875052 453898728 453040838 452341586 451600820
3306.1 451600820 450577259 449316025 448043793 446884930 445792943 444674730 443526685 442368865
3322.4 442368865 441173404 439873248 438479066 437096179 435741574 434407800 433149129 431863189
3338.8 431863189 430396676 428820550 427239507 425713032 424292684 422809750 421087623 419274569
3355.1 419274569 417584538 416013986 414436370 412839741 411350101 409929901 408346981 406528026
3371.4 406528026 404729813 403165847 401709616 400233179 398769021 397400707 396190852 395167470
3387.7 395167470 394333214 393442780 392251849 391029507 390178204 389556557 388655931 387441844 386385918
3406.1 386385918 385624707 384951591 384268403 383558333 382858127 382269859 381782144 381328732 380978823 380783707
3426.5 380783707 380711079 380676180 380708456 380887270 380991489 380859882 380760938 380941510 381328076 381762952
3446.8 381762952 382202357 382719398 383331805 384005934 384772420 385623068 386429518 387234747 388273865
3465.2 388273865 389485806 390473515 391089439 391710758 392620623 393763930 394940495 395919412 396831453
3483.6 396831453 397922903 399059832 400111556 401180834 402307332 403476417 404645830 405816346
3499.9 405816346 407034963 408185571 409210533 410281926 411518574 412896693 414248616 415438354
3516.2 415438354 416585863 417881191 419381499 420860052 422142923 423420250 424862683 426443189
3532.5 426443189 428127229 429805011 431359351 432951510 434727550 436570168 438291967 439969331
3548.8 439969331 441755205 443639070 445618123 447704971 449904680 452148408 454258680 456272721
3565.1 456272721 458637446 461467475 464302033 467010438 469797492 472707808 475749165 478953749
3581.5 478953749 482171744 485226631 488282114 491670758 495179713 498627096 502182841 505896091
3597.8 505896091 509667277 513482273 517265558 520843565 524412155 528207779 532113194 536072314
3614.1 536072314 539947867 543779016 547895849 552022934 555774033 559136808 562625647 566764534
3630.4 566764534 570894599 574768126 578560412 582259893 585919380 589506805 592841327 595924854
3646.7 595924854 599260986 603141904 606853724 610139847 613569319 617147326 620404601 623386502
3663 623386502 626261055 628857970 631313920 634074152 636643291 638964534 641776860 644732118 647426724
3681.4 647426724 649920702 652190983 654268146 656306863 658476293 660712838 662820458 664669931
3697.7 664669931 666255474 667819142 669598341 671331286 672704220 673851967 675293863 677182019
3714 677182019 678941846 680313587 681479037 682613790 683755755 684975863 686264575 687358677 688253105
3732.4 688253105 689209223 690485179 692023873 693205357 693623424 694026291 695129931 696021855 696644366
3750.7 696644366 697860181 699356914 700497508 701390684 702421069 703450441 704287469 705022395 705720425
3769.1 705720425 706569374 707564652 708441019 709155738 709873021 710658312 711377501 712066293 712835670 713626862
3789.5 713626862 714340091 714878917 715320408 715780914 716087520 716513515 717346966 718058169 718743801 719661832
3809.9 719661832 720392942 720642030 720790684 721233487 721631587 722229898 723164022 723935843 724514306 724967897
3830.3 724967897 725368798 725779891 726012707 726224959 726792097 727548122 728285313 728926539 729304969 729152560
3850.7 729152560 728670239 729114413 730324209 731182575 731608748 731866300 732198894 732475758 732545435 732845664
3871.1 732845664 733482838 734205544 734774947 734994352 735203326 735551655 735908210 736340344 736621201 736784399
3891.5 736784399 737187564 737671018 737911701 737943292 737980962 738189161 738680661 739268780 739706457 739996731
3911.9 739996731 740134597 740133464 740219295 740525007 740846694 741052806 741246045 741457880 741649985 741879761
3932.3 741879761 742155015 742376506 742526352 742643774 742809951 743109524 743409872 743572772 743708074 743926048
3952.7 743926048 744179666 744368613 744478881 744581461 744726181 744938254 745191276 745388746 745495200 745611310
3973.1 745611310 745812416 746061742 746258795 746380508 746520638 746668220 746785879 746950507 747141123 747257829
3993.4 747257829 747324228 747421682
3997.5 747421682
##END=$$ End of the data block
