##TITLE=4 meg-com $$ Begin of the data block
##JCAMP-DX=5.00 $$ ACD/SpecManager v 10.08
##SPECTROMETER/DATA SYSTEM=Alpha
##DATE=16 Oct 2013 10:19:54
##DATA TYPE=INFRARED SPECTRUM
##DATA CLASS=XYDATA
##ORIGIN=
##OWNER=
##NPOINTS=1765
##FIRSTX=399.75695801
##LASTX=3997.56933594
##MAXX=3997.56933594
##MINX=399.75695801
##MAXY=0.84846640
##MINY=0.36463451
##XFACTOR=1.0000000000
##YFACTOR=1.000000000000000e-9
##FIRSTY=0.60726011
##DELTAX=2.03957629
##XUNITS=1/CM
##YUNITS=ARBITRARY UNITS
##XYDATA=(X++(Y..Y))
399.8F07260108l051758m435301l153860M80354K956569J989484m22180j272500o0856
418.1F00290060J293659J90497k407253l989160l141403j052380j10567j298904k809525
436.5E86965024k004265J231372M284084M501700K186179K80381P26342K318621K229631
454.8F02719069k19226k805829l056884j600385n01513j268506l318668m510105l529906
473.2E81908047j070261K45154p67946k327562k201974k14994J504123R91583j092195
491.5E76973975k549410k001047m26531J3947j326024l168404l773749k701998j364946
509.9E59675813j606584l363252m820227m469514k577841j037717j012981j606345
526.2E39181352j264215L97802K505064L721714L576040L015041L158808L816605L633678
$$ plain form
399.8 607260108 604208350 599773049 596619189 597099543 600056112 602045596 601623416 600350916 600290060
418.1 600290060 601583719 601774216 599366963 595377803 592236400 591184020 591073453 589774549 586965024
436.5 586965024 584960759 586192131 590476215 594977915 597164094 597444475 598170817 600489438 602719069
454.8 602719069 602499843 599694014 596637130 595036745 594535232 593266726 589948058 585437953 581908047
473.2 581908047 580837786 581082940 580314994 577987432 575785458 575570464 577074587 578066170 576973975
491.5 576973975 574424565 572423518 571996987 572010934 570684910 567516506 563742757 561040759 559675813
509.9 559675813 558069229 554705977 549885750 545416236 542838395 541800678 540787697 539181352
526.2 539181352 537917137 538314939 540820003 544541717 548117757 551132798 554291606 558108211 561741889
544.6E61741889J867890p38740k403915k132058j106501j166105k767503m594744n183219
562.9E43516994m565418l906965m060805m540682l902674j425743K006829M689455
579.2E27810991N524933M960478M475772M805088N076229L993273J486540o76215r44972
597.6E56512117K49982J254320Q86977l74913r74715J12653K020717K970993K421320
616E65079451J475870J668990L226638M721999M622340L004253J421988J304388K417386
634.3E88943303L138303K305627N85258k31802O45220K114356K503752J296938k13862
652.7F01087093l21746J071513K305508J880228L09050p14838k40326K120495K847791
671F10344768J510202K17081l5942J243234K680301K592147R62555n48601m72903P37846
$$ plain form
544.6 561741889 563609779 562871039 560467124 558335066 557228565 556062460 553294957 548700213 543516994
562.9 543516994 538951576 535044611 530983806 526443124 522540450 521114707 523121536 527810991
579.2 527810991 533335924 538296402 542772174 547577262 552653491 556646764 558133304 557457089 556512117
597.6 556512117 556762099 558016419 558903396 558528483 557553768 557666421 559687138 562658131 565079451
616 565079451 566555321 568224311 571450949 576172948 580795288 583799541 585221529 586525917 588943303
634.3 588943303 592081606 594387233 594972491 594740689 595385909 597500265 600004017 601300955 601087093
652.7 601087093 600765347 601836860 604142368 606022596 606331646 605616808 605376482 607496977 610344768
671 610344768 611854970 612072051 612036109 613279343 615959644 618551791 619514346 618965745 618492842 619230688
691.4F19230688J241684k7836k189100l249704k442658r04024j58787n72920r82761
709.8F09944582P0691K459884M454732M744053L805101L255128M095257N599260O092548
728.1F44521236M752458K651572J643896K279103L154277K542854L66092j689077k242803
746.5F57979608j691461j553953k667725m301548m946530l868401j868486l94225Q1420
764.8F36768699O07311K365530N123436P298470P618248O364704N002439M762113N393922
783.2F81304872N491614M190565K399504J691937K576530L996730M418135L535270
799.5G09605157K378226K060353K666474L055394K202153O44862k50160J25527J029372
817.9G23517358J082301k70664k068758k991557k808750k458334k955020m201292n136967
$$ plain form
691.4 619230688 620472372 620444536 618255436 615005732 612563074 611659050 611500263 610927343 609944582
709.8 609944582 610015273 612475157 616929889 621673942 625479043 628734171 632829428 638428688 644521236
728.1 644521236 649273694 651925266 653569162 655848265 659002542 661545396 661911488 660222411 657979608
746.5 657979608 656288147 654734194 652066469 647764921 642818391 638949990 637081504 636687279 636768699
764.8 636768699 637376010 639741540 644864976 652163446 659781694 666146398 671148837 675910950 681304872
783.2 681304872 686796486 690987051 693386555 695078492 697655022 701651752 706069887 709605157
799.5 709605157 711983383 714043736 716710210 719765604 721967757 722612619 722362459 722487986 723517358
817.9 723517358 724599659 724328995 722260237 719268680 716459930 714001596 711046576 706845284 701708317
836.2G01708317m921496l799081k857268k840519l312945l366113k700627j906693
852.5F76003575j804828k400577k617896j123011K171576N758285P985771Q403003
868.9F92375898P792235P122636O375908M818917K209425q15094l203809m381299m760623
887.2G07534194n117893n663574n974472n611002m749238m107595m289508n257666
903.5F66763246o328583o934523p173002p531822q200228q675218q248448o724954
919.8F06946468m586219k650619j413882o96957m4763P84457J659512K296150K664030
938.2F04958177K918362K887190J905858n63502m163921p845283j0732710j2578070
954.5E76786101j3695181j4582514j5482724j6284883j6799182j7028153j7116397
$$ plain form
836.2 701708317 696786821 692987740 690130472 687289953 683977008 680610895 677910268 676003575
852.5 676003575 674198747 671798170 669180274 668057263 670228839 675987124 683972895 692375898
868.9 692375898 700168133 707290769 713666677 718485594 720695019 719879925 716676116 712294817 707534194
887.2 707534194 702416301 696752727 690778255 685167253 680418015 676310420 672020912 666763246
903.5 666763246 660434663 653500140 646327138 638795316 630595088 621919870 613671422 606946468
919.8 606946468 602360249 599709630 598295748 597598791 597554028 598338485 599997997 602294147 604958177
938.2 604958177 607876539 610763729 612669587 612106085 607942164 600096881 589364171 576786101
954.5 576786101 563090920 548508406 533025682 516740799 499941617 482913464 465797067
968.8D65797067j7137140j6937405j6220719j4790386j2659430j0010988p134348m344344
985.1C66562307j914591j3202J366407K250045K654612K705246K554387K279699J877189
1003.5C80322099J311242O68407J22696j57416p6234K82794P79539J269907J708090
1021.8C86231124K138704K550990K858370K949775K794057K387434J824170J344860
1038.1D05079484J091450R76205R08435R13471J117497J657427K461701L329337M165500
1056.5D21700507N059868O126434P264853P866442O782114L144771k211153o656468
1072.8D49077368p996232o415009l682047j172453P34001K149284L191769L889382
1089.1D39776063M246652M256845L919363L250330K353639J438498P82311O58453J160472
$$ plain form
968.8 465797067 448659927 431722522 415501803 400711417 388051987 378040999 370906651 366562307
985.1 366562307 364647716 364634514 366000921 368250966 370905578 373610824 376165211 378444910 380322099
1003.5 380322099 381633341 382301748 382424444 382267028 382190794 382473588 383253127 384523034 386231124
1021.8 386231124 388369828 390920818 393779188 396728963 399523020 401910454 403734624 405079484
1038.1 405079484 406170934 407147139 408055574 408969045 410086542 411743969 414205670 417535007 421700507
1056.5 421700507 426760375 432886809 440151662 448018104 454800218 457944989 455733836 449077368
1072.8 449077368 441081136 434666127 430984080 429811627 430545628 432694912 435886681 439776063
1089.1 439776063 444022715 448279560 452198923 455449253 457802892 459241390 460023701 460682154 461842626
1107.5D61842626K026141K805948L191859L170878K926945K618551K375186K317548
1123.8D83275682K490967K877951L363311L529310K850175J175911j157195l510505
1140.1D94895607n262613o114423o190718n808830n191624m380852l368586k230317
1156.4D56347644j100003o4522R61899K183825L727228N512714P326424Q908808J0118932
1174.8D93922949J1009097J1641324J1945486J1754870J1013091R873092Q569598P249057
1191.1E76978564N875111M369140K902388J852393J462639J619517K007783K423942
1207.4E99491477K843201L300905L764034M030287L809214L007471J867056P86901
1223.7F22900546O616n25415r86219j402020j608670j461744j047850o04272k34544
$$ plain form
1107.5 461842626 463868767 466674715 469866574 473037452 475964397 478582948 480958134 483275682
1123.8 483275682 485766649 488644600 492007911 495537221 498387396 499563307 498406112 494895607
1140.1 494895607 489632994 483518571 477327853 471519023 466327399 461946547 458577961 456347644
1156.4 456347644 455247641 455183119 456145018 458328843 462056071 467568785 474895209 483804017 493922949
1174.8 493922949 504932046 516573370 528518856 540273726 551286817 561159909 569729507 576978564
1191.1 576978564 582853675 587222815 590125203 591977596 593440235 595059752 597067535 599491477
1207.4 599491477 602334678 605635583 609399617 613429904 617239118 620246589 622113645 622900546
1223.7 622900546 622907162 622381747 621395528 619993508 618384838 616923094 615875244 615270972 615036428
1242.1F15036428J26243O01470J218140J791537K045929J897037J542807J277626J303613
1260.4F26840830J542806J723648J745760J706779J667440J580179J321077Q29995
1276.8F38958514K63989j10567j44601N2154J71483n1737n25355r19998j072586j051366
1297.2F35569930r99391j000047r92715q92282p55131o80387p67767j027227j291156
1315.5F27163827j387000j344680j439989j896918k601147l215611l440856l237665
1331.8F08599961k820492k388179j957357j379311o60241j44780m5478k98917o63221
1350.2E98241985q95024r73761j004159j129866j408755j604438j372457r64045o95348
1368.5E88194132n05924m23134k75671P7426M56989O78718Q10146J203359J950681
$$ plain form
1242.1 615036428 615162671 615764141 616982281 618773818 620819747 622716784 624259591 625537217 626840830
1260.4 626840830 628383636 630107284 631853044 633559823 635227263 636807442 638128519 638958514
1276.8 638958514 639222503 639111936 638967335 639019489 639190972 639139235 638613880 637693882 636621296 635569930
1297.2 635569930 634570539 633570492 632577777 631685495 630930364 630249977 629482210 628454983 627163827
1315.5 627163827 625776827 624432147 622992158 621095240 618494093 615278482 611837626 608599961
1331.8 608599961 605779469 603391290 601433933 600054622 599394381 599249601 599204123 598905206 598241985
1350.2 598241985 597346961 596373200 595369041 594239175 592830420 591225982 589853525 588889480 588194132
1368.5 588194132 587688208 587265074 586989403 587066829 587523818 588202536 589012682 590216041 592166722
1386.9E92166722K410829K035916J209378L93450j46985l89695l94404m85957p71761
1405.3E96027493j021504j205146j233161j016021p87615p68483n69463M828M08471
1423.6E89839399N81086N46515L98457L78668L46959L76164P88570J013875Q29101
1442E95098794N34713K30849o2645m28200j033306j726568k298355j542508J55389
1460.3E88928163Q62837J517117K919674M445612O094992Q369446R161353Q117199
1476.6F30416393P153034O597996O247103N610347M973769M658401M432798L712118
1493F73801959L025591K946436K896726K381921J516104P53462R78768J544297J096666
1511.3F90941930M20630R4712L64124P59662R90748J120329Q68142N97119M71771K20418
$$ plain form
1386.9 592166722 594577551 596613467 597822845 598216295 598069310 597679615 597285211 596799254 596027493
1405.3 596027493 595005989 593800843 592567682 591551661 590764046 589995563 589426100 589430928 589839399
1423.6 589839399 590420485 590967000 591365457 591744125 592091084 592467248 593255818 594269693 595098794
1442 595098794 595633507 595864356 595801711 595373511 594340205 592613637 590315282 588772774 588928163
1460.3 588928163 589791000 591308117 594227791 598673403 604768395 613137841 622299194 630416393
1476.6 630416393 637569427 644167423 650414526 656024873 660998642 665657043 670089841 673801959
1493 673801959 676827550 679773986 682670712 685052633 686568737 687322199 688300967 689845264 690941930
1511.3 690941930 691362560 691457272 691821396 692581058 693571806 694692135 695560277 696157396 696629167 696849585
1531.7F96849585O3300M3988n05328j045823k74420N05507L97742o5983m63724n65469
1552.1F94939375n79834q45432j402855r18031r0539m05252p70152r95636j017690
1570.5F87913954q24809j076579j086414l42428k12849o64532r63330j012385r37283
1588.8F80793345r89258j278401j680195j958013k099156k263129k520084k917528
1605.1F65087581l398717l783226l814578l772259m341960m800260l794610l410101
1621.4F33971870l878593l742993l670693l760159l444016l409624l361285j849711
1637.8F06854796o21855l52681j86085L46899J456559J722812J563668K770007L509283
1656.1F17063403L310561L470183L890514M143536L776014L897607M838169M949212
$$ plain form
1531.7 696849585 696912885 696956873 696451545 695405722 695131302 695636809 696034551 695968568 695504844 694939375
1552.1 694939375 694359541 693514109 692111254 691193223 691102684 690697432 689927280 688931644 687913954
1570.5 687913954 687089145 686012566 684926152 684583724 684370875 683706343 682743013 681730628 680793345
1588.8 680793345 679804087 678525686 676845491 674887478 672788322 670525193 668005109 665087581
1605.1 665087581 661688864 657905638 654091060 650318801 645976841 641176581 637381971 633971870
1621.4 633971870 630093277 626350284 622679591 618919432 615475416 612065792 608704507 606854796
1637.8 606854796 606232941 605880260 605694175 606041074 607497633 609220445 610784113 613554120 617063403
1656.1 617063403 620373964 623844147 627734661 631878197 635654211 639551818 644389987 649339199
1672.4F49339199M863024N119324M772007M277706M464567N854368N918324M862249
1688.8F89470768M778862M638016M838824N074263M496098M590869M095018L286540
1705.1G25269258L108382K577901J828730J388073J429081K094686K613664K031743
1721.4G42341518J125217O22094L76641R1315n19574j331210j228512p36892n85675
1739.7G40154922M6432R43542J845181L127813N021989O640733O498456N779862N158067
1758.1G75216997M392743M206478L908515L021002K112985J493990J683116K274037
1774.4G98309863K111196J502276J030683Q91149J070500J299917J119256N81503M70042
1792.8H08386385Q45969J050174J073242J036286Q32498N82695N93841Q10325R79901
$$ plain form
1672.4 649339199 654202223 659321547 664093554 668371260 672835827 678690195 684608519 689470768
1688.8 689470768 694249630 698887646 703726470 708800733 713296831 717887700 721982718 725269258
1705.1 725269258 728377640 730955541 732784271 734172344 735601425 737696111 740309775 742341518
1721.4 742341518 743466735 744088829 744465470 744556785 744037211 742706001 741477489 740740597 740154922
1739.7 740154922 740201354 741144896 742990077 746117890 751139879 757780612 764279068 770058930 775216997
1758.1 775216997 779609740 783816218 787724733 790745735 792858720 794352710 796035826 798309863
1774.4 798309863 800421059 801923335 802954018 803845167 804915667 806215584 807334840 807916343 808386385
1792.8 808386385 809232354 810282528 811355770 812392056 813224554 813807249 814401090 815211415 816191316
1811.1H16191316Q61168N38349L93390N95749P98821O86705M09663J65105K21968P30216
1831.5H21592450R90987O71864K65240O5148K3186K50697O86706O21795K05219N3048
1851.9H25426340K35975M72188M58360K12669k1637n3346N6327K81691N13673L94166
1872.3H27976406J42276J76966M18902N20288L41893O0796n0246J27792M96805N84364
1892.7H30796242K56598j6093J5974K51770M23252K99037k8909j86622K3008L15547
1913.1H32149804L17454P0751r6977p8321J32382L93927L66450Q9168j27852r0777
1933.5H33126009J54018L39329K03192j07169j77860O4969L35813M03702K10285m7445
1953.9H34504843p7725J34528L27945K92539N2870j52946p4327J81198L22402K36273
$$ plain form
1811.1 816191316 817052484 817590833 817984223 818579972 819378793 820065498 820475161 820640266 820862234 821592450
1831.5 821592450 822583437 823255301 823520541 823585689 823608875 823859572 824546278 825168073 825373292 825426340
1851.9 825426340 825662315 826134503 826592863 826805532 826783895 826730549 826786876 827068567 827582240 827976406
1872.3 827976406 828118682 828295648 828714550 829234838 829576731 829637527 829587281 829715073 830211878 830796242
1892.7 830796242 831052840 831036747 831052721 831304491 831727743 832026780 831997871 831811249 831834257 832149804
1913.1 832149804 832467258 832538009 832441032 832362711 832495093 832889020 833255470 833344638 833216786 833126009
1933.5 833126009 833280027 833619356 833822548 833715379 833537519 833602488 833938301 834342003 834552288 834504843
1953.9 834504843 834427118 834561646 834889591 835182130 835235000 835082054 835007727 835188925 835511327 835747600
1974.3H35747600l398j47462k9504K06351K71499Q3387j69694k24710L755K52486K12371
1996.7H36202681m5359k31981j99259j5735R8109p212k51889m06325l13342q1718j4365
2019.2H34733605k21729m55856m80473k85268p5996q2672l02136m87864m10676j59561
2039.6H31771374j0789r9122l02553l75092j91689Q2076J74224J7405j71423j40608
2060H30753803P9870K57314K26557J7822j55211p1108J63436K54571J39177l6537r3699
2082.4H31535995L7134K35140K85268J18792p3135p1466J09971K87294K80499J02163
2102.8H32847655k7180M3154K04980K49386J28210m4585j05321J1504J83820K15888
2123.2H33707511N4598j23322j18196N0068J87814J66953Q106j19626o5863J01149
$$ plain form
1974.3 835747600 835744202 835596740 835567236 835773587 836045086 836128473 835958779 835734069 835737824 835990310 836202681
1996.7 836202681 836157322 835925341 835726082 835710347 835808456 835801244 835549355 835143030 834829688 834747970 834733605
2019.2 834733605 834511876 834056020 833575547 833290279 833214283 833131611 832829475 832341611 831930935 831771374
2039.6 831771374 831760585 831661463 831358910 830983818 830792129 830874205 831048429 831065834 830894411 830753803
2060 830753803 830833673 831090987 831317544 831335366 831180155 831109047 831272483 831527054 831666231 831629694 831535995
2082.4 831535995 831573129 831808269 832093537 832212329 832139194 832067728 832177699 832464993 832745492 832847655
2102.8 832847655 832820475 832863629 833068609 833317995 833446205 833401620 833296299 833307803 833491623 833707511
2123.2 833707511 833762109 833638787 833520591 833570659 833758473 833925426 833933532 833813906 833748043 833849192
2143.6H33849192J82748J04725j9491m9591O5744K29001K81572J83285P7605J18613
2164H35023403K74718M06742M14491L03209K05338K49266L90649M74095M07815K62976
2184.4H38412702J96278K66910L84629M24563L42429K13981J82807K80917L83139L85165
2204.8H41473520K85685J80006K01940L38972M29928L58880J88112R7275J70827L17752
2225.2H44042897L63350K45512J00910O7473J40607K31505K52902J71661N6208K7120
2245.6H45700145J20103K26379K12609Q8930j430K7716J37806K23160J88708O3181
2265.9H46987307P689J28388K63036K54631J62244O0141L9458J14322J72674J53125
2286.3H48343015O0320p0095j15037L516J39058J05619p3671k02715j69933n4419P331
$$ plain form
2143.6 833849192 834031940 834136665 834117174 834067583 834133327 834362328 834643900 834827185 834904790 835023403
2164 835023403 835298121 835704863 836119354 836422563 836627901 836877167 837267816 837741911 838149726 838412702
2184.4 838412702 838608980 838875890 839260519 839685082 840027511 840241492 840424299 840705216 841088355 841473520
2204.8 841473520 841759205 841939211 842141151 842480123 842910051 843268931 843457043 843554318 843725145 844042897
2225.2 844042897 844406247 844651759 844752669 844820142 844960749 845192254 845445156 845616817 845673025 845700145
2245.6 845700145 845820248 846046627 846259236 846348166 846346736 846374452 846512258 846735418 846924126 846987307
2265.9 846987307 846994996 847123384 847386420 847641051 847803295 847863436 847902894 848017216 848189890 848343015
2286.3 848343015 848403335 848333240 848218203 848221719 848360777 848466396 848392725 848190010 848020077 847965658 847972989
2308.8H47972989o0797j85251k46644k41637k15590k13027k77162l62098l86476l11971
2329.2H45472336k08140k30968l58343l84450k43723l2902J96457M02093K77877k09510
2349.6H44680727o50704p53761o07967m80175m20272k68043M4167L07918M13954L74437
2370H42640281K85208K87235L84569M35531L28779J10925n8115q8513l9339l1114j27792
2392.4H44127655k78473l43561k61188j46508j38521k66910m06265m00245k66433j72436
2412.8H41447115k45273m30584n42760m81367l33488k67685l66330n26309n86629m94241
2433.2H37172449l50297l43144m93467o21020o05286m83274l81351m15086n45383o17623
2453.6H32316518n29528l63529l08871m26411n79536o00040m77672l40581l22819m30464
$$ plain form
2308.8 847972989 847912192 847726941 847480297 847238660 847023070 846810043 846532881 846170783 845784307 845472336
2329.2 845472336 845264196 845033228 844674885 844290435 844046712 844013810 844210267 844612360 844890237 844680727
2349.6 844680727 844030023 843276262 842668295 842188120 841767848 841499805 841543972 841851890 842265844 842640281
2370 842640281 842925489 843212724 843597293 844032824 844361603 844472528 844414413 844325900 844286561 844255447 844127655
2392.4 844127655 843849182 843505621 843244433 843097925 842959404 842692494 842286229 841885984 841619551 841447115
2412.8 841447115 841201842 840771258 840228498 839747131 839413643 839145958 838779628 838253319 837666690 837172449
2433.2 837172449 836822152 836479008 835985541 835364521 834759235 834275961 833894610 833479524 832934141 832316518
2453.6 832316518 831786990 831423461 831114590 830688179 830108643 829508603 829030931 828690350 828367531 827937067
2474H27937067n28813n11825l90947k80559l03864m33922n19216m63486l12030k15829
2494.4H23976576k76625m09365m39107l16560j87099j96815l30150m60029m50253l15845
2514.8H20594728k18689k71917m27365n22196m68791l48628l00824l88146n40435o24895
2535.2H16482842n66423m43578m13656n21064o40392o29842m92037l70979m03345n52117
2555.6H11449409o51777o03557m70996m04000m67718n71012o01948n26607m10437m03404
2576H06337953n14985o05404n67913m19617l16023l60549m91142n66125m82679l14831
2596.4H01698685k50638l52382n30839o31989n57124m30346m41551n87225p31289p60377
2616.8G96424925o87837o61969p70987r26435r98675r52125q67665q56161r44018j037419
$$ plain form
2474 827937067 827408254 826896429 826505482 826224923 825921059 825487137 824967921 824504435 824192405 823976576
2494.4 823976576 823699951 823290586 822851479 822534919 822347820 822151005 821820855 821360826 820910573 820594728
2514.8 820594728 820376039 820104122 819676757 819154561 818685770 818337142 818036318 817648172 817107737 816482842
2535.2 816482842 815916419 815472841 815059185 814538121 813897729 813267887 812775850 812404871 812001526 811449409
2555.6 811449409 810797632 810194075 809723079 809319079 808851361 808280349 807678401 807151794 806741357 806337953
2576 806337953 805822968 805217564 804649651 804230034 803914011 803553462 803062320 802496195 802013516 801698685
2596.4 801698685 801448047 801095665 800564826 799932837 799375713 798945367 798503816 797916591 797185302 796424925
2616.8 796424925 795737088 795075119 794304132 793377697 792379022 791426897 790559232 789703071 788759053 787721634
2637.1G87721634j045764r76801r04142r04203r93132j085163j060009r44316q85069
2655.5G78923035r22203r81749r99510r35793q26835p87199q64267r45091q95203p62462
2675.9G70002723o89268p29502q12828q24750p47025o65486o43253o93261p89285q40068
2696.3G62567997p96855p35104p55965q42393q99136q91983q43346q15511q60274r01461
2716.7G54225969q55207p88152p67768p70032p81894p99417p78974p11143o49690o46949
2737.1G46676743o95884p12991o60896n92411n79238o39438o77050o29663n62847n32210
2757.5G40394115n42044n72205n91576n87344n77211n89669o16491o49989o95347p39456
2777.9G34232783p87973q37803q75354r09686r56952j018286j092017j164973j205384
$$ plain form
2637.1 787721634 786675870 785699069 784794927 783890724 782897592 781812429 780752420 779808104 778923035
2655.5 778923035 778000832 777019083 776019573 775083780 774256945 773469746 772605479 771660388 770765185 770002723
2675.9 770002723 769313455 768583953 767771125 766946375 766199350 765533864 764890611 764197350 763408065 762567997
2696.3 762567997 761771142 761036038 760280073 759437680 758538544 757646561 756803215 755987704 755127430 754225969
2716.7 754225969 753370762 752582610 751814842 751044810 750262916 749463499 748684525 747973382 747323692 746676743
2737.1 746676743 745980859 745267868 744606972 744014561 743435323 742795885 742118835 741489172 740926325 740394115
2757.5 740394115 739852071 739279866 738688290 738100946 737523735 736934066 736317575 735667586 734972239 734232783
2777.9 734232783 733444810 732607007 731731653 730821967 729865015 728846729 727754712 726589739 725384355
2796.2G25384355j220644j257300j326442j404286j473903j534581j611710j697302
2812.5G13858187j759112j830876j918792j975954k032161k151310k316415k453328
2828.9F97420239k553939k683580k884507l215671l751159m467070n300701o202518
2845.2F66361094o964803p213950o595970n006492k816200p62999M91917P16806J57952
2863.5F38367355p36416j657605k386391k731860k756655k685547k605974k517343
2879.9F20289564k429366k340257k228916k060950j857459j683712j598597j635194
2896.2F04455113j765608j930118k141833k478659k952755l552139m274606n075992
2912.5E80283403n882144o467938o518841n922854m693866k939343r67443Q71360K419770
$$ plain form
2796.2 725384355 724163711 722906411 721579969 720175683 718701780 717167199 715555489 713858187
2812.5 713858187 712099075 710268199 708349407 706373453 704341292 702189982 699873567 697420239
2828.9 697420239 694866300 692182720 689298213 686082542 682331383 677864313 672563612 666361094
2845.2 666361094 659396291 652182341 645586371 640579879 637763679 637000680 637492597 638209403 638367355
2863.5 638367355 637630939 635973334 633586943 630855083 628098428 625412881 622806907 620289564
2879.9 620289564 617860198 615519941 613291025 611230075 609372616 607688904 606090307 604455113
2896.2 604455113 602689505 600759387 598617554 596138895 593186140 589634001 585359395 580283403
2912.5 580283403 574401259 567933321 561414480 555491626 550797760 547858417 546890974 547762334 550182104
2930.8E50182104L774405M965663N839824O330610O480157O296158N841493N256296
2947.2E94966710M633784M091799L722727L574431L734947M154086M613876M939437
2963.5F28431797N096376N137622N105496M973054M670739M215896L788710L458261
2979.8F64877951L097654K721428K417922K119065J781940J416564J005352N94675
2996.1F80032551J49846l32236p05719r29594r89079q85189p38680o73235o93440p03156
3016.5F73532069p18594q76725j141131j383960j563012j617432j612127j691162j880467
3034.9F61047459k058387k035856j915515j971364k189278k320886k255619k167046
3051.2F44133508k192318k248764k296806k332031k268911k116024k028346k117575
$$ plain form
2930.8 550182104 553956509 558922172 564761996 571092606 577572763 583868921 589710414 594966710
2947.2 594966710 599600494 603692293 607415020 610989451 614724398 618878484 623492360 628431797
2963.5 628431797 633528173 638665795 643771291 648744345 653415084 657630980 661419690 664877951
2979.8 664877951 667975605 670697033 673114955 675234020 677015960 678432524 679437876 680032551
2996.1 680032551 680182397 679850161 679144442 678214848 677225769 676340580 675601900 674928665 674235225 673532069
3016.5 673532069 672813475 671936750 670795619 669411659 667848647 666231215 664619088 662927926 661047459
3034.9 661047459 658989072 656953216 655037701 653066337 650877059 648556173 646300554 644133508
3051.2 644133508 641941190 639692426 637395620 635063589 632794678 630678654 628650308 626532733
3067.5F26532733k262532k285540k175808j999796j913905k056718k221286k197683
3083.8F09419465k136230k102793k094030k189875k241492k120674j974761j966655
3100.1E92592955k077580k112746k009928j935065j981080j991927j900733j893878
3116.4E76690018j974165k059877k125502k102434k026141j950860j929581j953185
3132.8E60568273j902163j806736j828015j955330j992047j908422j818239j726091
3149.1E45631230j669765j754701j871526j850724j767695j739800j761675j750708
3165.4E31464636j677155j629591j647115j669764j658559j624346j574516j558841
3181.7E18424749j596272j602292j535415j462281j455307j505196j542986j513540
$$ plain form
3067.5 626532733 624270201 621984661 619808853 617809057 615895152 613838434 611617148 609419465
3083.8 609419465 607283235 605180442 603086412 600896537 598655045 596534371 594559610 592592955
3100.1 592592955 590515375 588402629 586392701 584457636 582476556 580484629 578583896 576690018
3116.4 576690018 574715853 572655976 570530474 568428040 566401899 564451039 562521458 560568273
3132.8 560568273 558666110 556859374 555031359 553076029 551083982 549175560 547357321 545631230
3149.1 545631230 543961465 542206764 540335238 538484514 536716819 534977019 533215344 531464636
3165.4 531464636 529787481 528157890 526510775 524841011 523182452 521558106 519983590 518424749
3181.7 518424749 516828477 515226185 513690770 512228489 510773182 509267986 507725000 506211460
3198E06211460j433969j365721j334906j339793j376778j362294j288920j257003j242459
3216.4D94209617j240193j280368j281559j227618j189798j174092j121700j074642
3232.7D84619647j165062j264870j217246j143605j085490r99272r67890j043677j103014
3251.1D74629521j062542j001507r79423r58771r23514r03964q85725q03709o89835
3269.4D66420531p28994q94755r73851r47237q76933q18193q03471q12173q04215p26581
3289.8D58034128o84649p76082q95172r81987r94176q76546p24047p61747j023770
3308.2D50315952j254260j288533j190365j112312j124829j174360j199306j206994
3324.5D40764993j272887j366496j413971j432001j376093j281082j332492j485884
$$ plain form
3198 506211460 504777491 503411770 502076864 500737071 499360293 497997999 496709079 495452076 494209617
3216.4 494209617 492969424 491689056 490407497 489179879 487990081 486815989 485694289 484619647
3232.7 484619647 483454585 482189715 480972469 479828864 478743374 477744102 476776212 475732535 474629521
3251.1 474629521 473566979 472565472 471586049 470627278 469703764 468799800 467914075 467110366 466420531
3269.4 466420531 465691537 464796782 463822931 462875694 461998761 461180568 460377097 459564924 458760709 458034128
3289.8 458034128 457349479 456573397 455678225 454696238 453702062 452825516 452101469 451339722 450315952
3308.2 450315952 449061692 447773159 446582794 445470482 444345653 443171293 441971987 440764993
3324.5 440764993 439492106 438125610 436711639 435279638 433903545 432622463 431289971 429804087
3340.8D29804087j569778j608223j579255j467406j512558j736074j834303j720906
3357.1D16775584j590103j603007j643628j530945j422733j557827j813680j848728
3373.4D03764933j644492j486510j463264j472235j379251j209975j047313q71539
3389.7C93190354q91834j150102j191884q60423o45935r29296j258344j101166p85679
3408.1C84375691o78032o81728p11561p08401o06209n00023m70728m00871k20179j6630
3428.5C79381329N5820R8198J90467P8887j48476j04427J82778M10080M67717M47661
3448.9C81060034M85510N92440O99878P83086Q38488P96914Q09193J076787J262844
3467.2C88405174J018703O54757O34730Q66860J107484J166433R89259R57042J121371
$$ plain form
3340.8 429804087 428234309 426626086 425046831 423579425 422066867 420330793 418496490 416775584
3357.1 416775584 415185481 413582474 411938846 410407901 408985168 407427341 405613661 403764933
3373.4 403764933 402120441 400633931 399170667 397698432 396319181 395109206 394061893 393190354
3389.7 393190354 392298520 391148418 389956534 389096111 388450176 387520880 386262536 385161370 384375691
3408.1 384375691 383697659 383015931 382304370 381595969 380989760 380489737 380019009 379618138 379397959 379381329
3428.5 379381329 379437149 379535347 379725814 379804701 379656225 379551798 379734576 380144656 380612373 381060034
3448.9 381060034 381545544 382137984 382837862 383620948 384459436 385256350 386065543 387142330 388405174
3467.2 388405174 389423877 390078634 390713364 391580224 392687708 393854141 394843400 395800442 396921813
3485.6C96921813J111746J043082J117110J168519J186431J202404J216888J234472
3501.9D06202465J135469J012057J067042J252562J429707J405984J224786J192033
3518.2D15922105J335800J502544J474112J301378J308322J487553J631171J716822
3534.5D27679807J700401J609564J677185J827747J852840J744926J707167J798570
3550.9D41598207J916915K023876K110302K201736K245635K154827K059370K383232
3567.2D58694100K890468K914429K750188K807081K934604L078998L271877L293276
3583.5D82635021L088862L055066L409862L573776L543645L666252L803014L815949
3599.8E10591447L844500L815353L608942L606498L834129L957450M025936L922582
$$ plain form
3485.6 396921813 398033559 399076641 400193751 401362270 402548701 403751105 404967993 406202465
3501.9 406202465 407337934 408349991 409417033 410669595 412099302 413505286 414730072 415922105
3518.2 415922105 417257905 418760449 420234561 421535939 422844261 424331814 425962985 427679807
3534.5 427679807 429380208 430989772 432666957 434494704 436347544 438092470 439799637 441598207
3550.9 441598207 443515122 445538998 447649300 449851036 452096671 454251498 456310868 458694100
3567.2 458694100 461584568 464498997 467249185 470056266 472990870 476069868 479341745 482635021
3583.5 482635021 485723883 488778949 492188811 495762587 499306232 502972484 506775498 510591447
3599.8 510591447 514435947 518251300 521860242 525466740 529300869 533258319 537284255 541206837
3616.1E41206837L867507M206419M258513L811836L303588L432512M240394M270136
3632.4E72597742L934622L841936L790737L755986L620088L231347K878964L232539
3648.8F00883961M006326L881335L351629L465652L667236L325581K970279K811491
3665.1F28363490K501071K364695K739608K556324K306640K886176L055334K763927
3681.4F49537265K507866K198815J969993J998007K239824K354622K188623J867771
3697.7F66862786J563549J541495J773656J681566J242995J014412J461327K060651
3714F79202437J892746J416743J166522J114190J123786J205921J268625J025141P45773
3732.4F90161884Q43882J325429J642406J184225L36111L59892J090110Q42273O47843
$$ plain form
3616.1 541206837 545074344 549280763 553539276 557351112 560654700 564087212 568327606 572597742
3632.4 572597742 576532364 580374300 584165037 587921023 591541111 594772458 597651422 600883961
3648.8 600883961 604890287 608771622 612123251 615588903 619256139 622581720 625551999 628363490
3665.1 628363490 630864561 633229256 635968864 638525188 640831828 643718004 646773338 649537265
3681.4 649537265 652045131 654243946 656213939 658211946 660451770 662806392 664995015 666862786
3697.7 666862786 668426335 669967830 671741486 673423052 674666047 675680459 677141786 679202437
3714 679202437 681095183 682511926 683678448 684792638 685916424 687122345 688390970 689416111 690161884
3732.4 690161884 691005766 692331195 693973601 695157826 695493937 695853829 696943939 697786212 698434055
3750.7F98434055J363516J591444J123011Q88228J089335J056254Q02576O97017P24554
3769.1G07769990R54330J076400Q48770O29843O87897Q24749P32839O90401P98225
3787.5G15013444Q00670P04169N11289L92437M19318K31385L41475Q37565P39038P41839
3807.8G20732629J039446P91192J86622O3360L88980L39508O27219J035393Q14735
3826.2G26019084N59688M03702L51131L84808K28882K39551O16669P96915P74025O69122
3846.6G31043577L43025k77102o01053N07474J332104Q86798L71873J74999L15071
3865G34096766L33726J17004K99394O28352P49827N87701K01345K30431L95894L64125
3885.4G38004565M18842K62022J80662M61757M80056J59979p2539n5611K18987O28471
$$ plain form
3750.7 698434055 699797571 701389015 702512026 703400254 704489589 705545843 706348419 707045436 707769990
3769.1 707769990 708724320 709800720 710649490 711279333 711967230 712791979 713524818 714215219 715013444
3787.5 715013444 715814114 716518283 717029572 717422009 717841327 718072712 718414187 719251752 719990790 720732629
3807.8 720732629 721772075 722563267 722749889 722813249 723202229 723541737 724168956 725204349 726019084
3826.2 726019084 726578772 726982474 727333605 727718413 727947295 728186846 728803515 729600430 730374455 731043577
3846.6 731043577 731386602 731109500 730508447 731015921 732348025 733234823 733606696 733781695 734096766
3865 734096766 734430492 734547496 734846890 735475242 736225069 736812770 737014115 737244546 737640440 738004565
3885.4 738004565 738423407 738685429 738866091 739327848 739807904 739967883 739895344 739839733 740058720 740687191
3905.7G40687191P23959N01632K81096R4652j2696R5546K91229L27766K74121K51353
3926.1G43515849J68085R5010K10226L34501K67804J50084R3758J44839K62917K55763
3946.5G45498836J72734J87993K40207K33471J77205J17481J15752J84059K34544K14100
3966.9G47376382J50442J05680J44481K18451K45750J83523J04606J04189J29223J58131
3987.3G48920858K04682J87755J02699Q6605J58072
3997.5G49660671
$$ plain form
3905.7 740687191 741411150 741912782 742193878 742288530 742275834 742371380 742662609 742990375 743264496 743515849
3926.1 743515849 743683934 743778944 743989170 744323671 744591475 744741559 744835317 744980156 745243073 745498836
3946.5 745498836 745671570 745859563 746099770 746333241 746510446 746627927 746743679 746927738 747162282 747376382
3966.9 747376382 747526824 747632504 747776985 747995436 748241186 748424709 748529315 748633504 748762727 748920858
3987.3 748920858 749125540 749313295 749415994 749502599 749660671
3997.5 749660671
##END=$$ End of the data block
