##TITLE=4 meg-com $$ Begin of the data block
##JCAMP-DX=5.00 $$ ACD/SpecManager v 10.08
##SPECTROMETER/DATA SYSTEM=Alpha
##DATE=16 Oct 2013 10:19:56
##DATA TYPE=INFRARED SPECTRUM
##DATA CLASS=XYDATA
##ORIGIN=
##OWNER=
##NPOINTS=1765
##FIRSTX=399.75695801
##LASTX=3997.56933594
##MAXX=3997.56933594
##MINX=399.75695801
##MAXY=0.85042137
##MINY=0.36482909
##XFACTOR=1.0000000000
##YFACTOR=1.000000000000000e-9
##FIRSTY=0.60857373
##DELTAX=2.03957629
##XUNITS=1/CM
##YUNITS=ARBITRARY UNITS
##XYDATA=(X++(Y..Y))
$$ plain form
399.8 608573735 605221987 600775838 598177850 599060237 601751566 603365481 602800846 601422071 601187050
418.1 601187050 602424920 602688253 600250363 596154392 593090594 592227578 592181623 590784371 587871671
436.5 587871671 585891604 586986780 591013670 595454693 597694457 598117054 598940134 601080418 603056490
454.8 603056490 602804363 600112259 597168267 595694482 595297873 594128251 590829194 586177886 582546592
473.2 582546592 581333995 581302345 580499291 578392982 576411664 576366186 577880502 578759491 577658415
491.5 577658415 575156689 573061287 572521448 572475910 571087956 568065584 564552724 561871588 560352743
509.9 560352743 558662236 555304170 550451040 545923531 543296993 542148530 541043341 539422929
526.2 539422929 538192570 538681328 541305304 545113444 548650324 551574290 554760695 558652341 562288880
$$ packed form
399.8F08573735l351748m446149k597988Q82387K691329J613915n64635j378775k35021
418.1F01187050J237870K63333k437890m095971l063798q63016m5955j397252k912700
436.5E87871671j980067J095176M026890M441023K239764M22597Q23080K140284J976072
454.8F03056490k52127k692104k943992j473785l96609j169622l299057m651308l631294
473.2E82546592j212597l1650q03054k106309j981318m5478J514316Q78989j101076
491.5E77658415k501726k095402n39839m5538j387954l022372l512860k681136j518845
509.9E60352743j690507l358066m853130m527509k626538j148463j105189j620412
526.2E39422929j230359M88758K623976L808140L536880K923966L186405L891646L636539
$$ plain form
544.6 562288880 564160824 563538194 561274409 559160411 557956874 556669712 553849518 549235463 543987036
562.9 543987036 539415896 535584271 531479120 526803195 522891223 521600902 523715019 528290927
579.2 528290927 533592761 538505554 543067515 547887743 552927017 556997895 558625400 557941079 556882322
597.6 556882322 557116032 558466911 559412837 559049785 558138013 558327854 560397029 563383102 565734923
616 565734923 567099452 568771183 572127700 576940656 581538975 584451616 585783601 587116122 589663804
634.3 589663804 592857540 595109463 595638037 595446169 596268713 598585784 601195514 602510095 602255285
652.7 602255285 601856709 602847695 605095923 606977701 607329428 606664181 606553793 608790874 611522675
671 611522675 612917602 613154829 613187134 614442647 617133379 619739652 620642900 620038331 619590342 620378613
$$ packed form
544.6E62288880J871944o22630k263785k113998j203537j287162k820194m614055n248427
562.9E43987036m571140l831625m105151m675925l911972j290321K114117M575908
579.2E28290927N301834M912793M561961M820228N039274M070878J627505o84321j058757
597.6E56882322K33710J350879R45926l63052r11772J89841K069175K986073K351821
616E65734923J364529J671731L356517M812956M598319K912641J331985J332521K547682
634.3E89663804L193736K251923N28574j91868Q22544K317071K609730J314581k54810
652.7F02255285l98576R90986K248228J881778L51727o65247j10388K237081K731801
671F11522675J394927K37227L2305J255513K690732K606273R03248o04569m47989P88271
$$ plain form
691.4 620378613 621610045 621511579 619265616 615993440 613576174 612731934 612591743 611996531 611019254
709.8 611019254 611124754 613600314 618061364 622848749 626694500 629932463 634017825 639649272 645774364
728.1 645774364 650543511 653205216 654885471 657200873 660334408 662821233 663084745 661248744 658909619
746.5 658909619 657199621 655664027 653019726 648707032 643744290 639897466 638030827 637610793 637694418
764.8 637694418 638323128 640701592 645830989 653144181 660767734 667103231 672094524 676903725 682323933
783.2 682323933 687786281 691969156 694375277 696049869 698658586 702776253 707294285 710775495
799.5 710775495 713023126 715070367 717826962 720920086 723064244 723633289 723342180 723484576 724570274
817.9 724570274 725669324 725388944 723336339 720351696 717487931 714910865 711804748 707478583 702290952
$$ packed form
691.4F20378613J231432r8466k245963l272176k417266q44240j40191n95212r77277
709.8F11019254J05500K475560M461050M787385L845751L237963M085362N631447O125092
728.1F45774364M769147K661705J680255K315402L133535K486825K63512j836001k339125
746.5F58909619j709998j535594k644301m312694m962742l846824j866639m20034Q3625
764.8F37694418O28710K378464N129397P313192P623553O335497M991293M809201N420208
783.2F82323933N462348M182875K406121J674592K608717M117667M518032L481210
799.5G10775495K247631K047241K756595L093124K144158N69045k91109J42396J085698
817.9G24570274J099050k80380k052605k984643k863765k577066l106117m326165n187631
$$ plain form
836.2 702290952 697373927 693579137 690674365 687756181 684398055 681035280 678372741 676512003
852.5 676512003 674734890 672358990 669788957 668734789 670972824 676729202 684607148 692886412
868.9 692886412 700644314 707789898 714191914 719010651 721147239 720234931 716958463 712507188 707685232
887.2 707685232 702520192 696801364 690786600 685174644 680408597 676261425 671946585 666662812
903.5 666662812 660314143 653398395 646247506 638680816 630432129 621769667 613566637 606860340
919.8 606860340 602273941 599634409 598224342 597499967 597438574 598249257 599915266 602167130 604795218
938.2 604795218 607712805 610630155 612581730 612047791 607881188 599987030 589185894 576563537
954.5 576563537 562849045 548257887 532751024 516435325 499634624 482611448 465480417
$$ packed form
836.2G02290952m917025l794790k904772k918184l358126l362775k662539j860738
852.5F76512003j777113k375900k570033j054168K238035N756378P877946Q279264
868.9F92886412P757902P145584O402016M818737K136588r12308l276468m451275m821956
887.2G07685232n165040n718828o014764n611956m766047m147172m314840n283773
903.5F66662812o348669o915748p150889p566690q248687q662462q203030o706297
919.8F06860340m586399k639532j410067p24375o1393Q10683J666009K251864K628088
938.2F04795218K917587K917350J951575n33939m166603p894158j0801136j2622357
954.5E76563537j3714492j4591158j5506863j6315699j6800701j7023176j7131031
$$ plain form
968.8 465480417 448349833 431455761 415269822 400514841 387922972 377994001 370947868 366690606
985.1 366690606 364829093 364829659 366201460 368473083 371158600 373863637 376386464 378658921 380573124
1003.5 380573124 381923676 382593721 382713586 382574648 382518917 382829219 383621901 384869725 386552572
1021.8 386552572 388676167 391207337 394042939 396971226 399740875 402127504 403994530 405384988
1038.1 405384988 406491518 407457173 408339947 409246027 410384893 412042439 414474189 417783082 421933532
1056.5 421933532 426968664 433069736 440299749 448118746 454883516 458080322 455982596 449450582
1072.8 449450582 441528887 435125440 431426167 430233210 430953741 433094412 436262488 440119207
1089.1 440119207 444349617 448615640 452555597 455813468 458151013 459557086 460347503 461078703 462295949
$$ packed form
968.8D65480417j7130584j6894072j6185939j4754981j2591869r928971p046133m257262
985.1C66690606j861513N66J371801K271623K685517K705037K522827K272457J914203
1003.5C80573124J350552O70045J19865j38938n5731L10302P92682J247824J682847
1021.8C86552572K123595K531170K835602K928287K769649K386629J867026J390458
1038.1D05384988J106530R65655Q82774R06080J138866J657546K431750L308893M150450
1056.5D21933532N035132O101072P230013P818997O764770L196806k097726o532014
1072.8D49450582p921695o403447l699273j192957P20531K140671L168076L856719
1089.1D40119207M230410M266023L939957L257871K337545J406073P90417P31200J217246
$$ plain form
1107.5 462295949 464300811 467047751 470207453 473367512 476287097 478923917 481325418 483628392
1123.8 483628392 486073881 488922983 492284358 495819330 498690099 499912411 498806179 495347053
1140.1 495347053 490143478 484081984 477909863 472083122 466873407 462487221 459115505 456887841
1156.4 456887841 455798298 455719113 456616193 458718032 462375015 467831373 475103408 483953595 494036973
1174.8 494036973 505041003 516686738 528648019 540434241 551463902 561337888 569934607 577221215
1191.1 577221215 583107769 587479472 590388894 592233121 593677521 595296562 597317278 599752128
1207.4 599752128 602603555 605921090 609718800 613784313 617594242 620555103 622373998 623163998
1223.7 623163998 623218656 622735679 621761560 620356798 618753493 617297947 616254628 615687072 615499854
$$ packed form
1107.5D62295949K004862K746940L159702L160059K919585K636820K401501K302974
1123.8D83628392K445489K849102L361375L534972K870769J222312j106232l459126
1140.1D95347053n203575o061494o172121n826741n209715m386186l371716k227664
1156.4D56887841j089543p9185Q97080K101839L656983N456358P272035Q850187J0083378
1174.8D94036973J1004030J1645735J1961281J1786222J1029661R873986Q596719P286608
1191.1E77221215N886554M371703K909422J844227J444400J619041K020716K434850
1207.4E99752128K851427L317535L797710M065513L809929K960861J818895P90000
1223.7F23163998N4658m82977r74119j404762j603305j455546j043319n67556j87218
$$ plain form
1242.1 615499854 615629792 616205454 617414176 619209170 621244490 623113930 624633491 625918090 627261877
1260.4 627261877 628845930 630565464 632257164 633913755 635576487 637169361 638490915 639319539
1276.8 639319539 639592946 639509439 639406085 639491379 639645159 639545083 639009118 638115704 637074292 636048555
1297.2 636048555 635059893 634059131 633061469 632161498 631411433 630742371 629971862 628940880 627657771
1315.5 627657771 626272440 624929667 623523414 621671200 619082093 615858018 612425447 609204590
1331.8 609204590 606382072 603968561 601976454 600583911 599951267 599835634 599786162 599482238 598829150
1350.2 598829150 597945690 596996069 596013486 594860673 593404293 591778874 590408146 589428484 588701963
1368.5 588701963 588174105 587726712 587442100 587556779 588044286 588700950 589447916 590563715 592448592
$$ packed form
1242.1F15499854J29938N75662J208722J794994K035320J869440J519561J284599J343787
1260.4F27261877J584053J719534J691700J656591J662732J592874J321554Q28624
1276.8F39319539K73407q3507j03354Q5294J53780j00076n35965q93414j041412j025737
1297.2F36048555r88662j000762r97662q99971p50065o69062p70509j030982j283109
1315.5F27657771j385331j342773j406253j852214k589107l224075l432571l220857
1331.8F09204590k822518k413511j992107j392543o32644j15633m9472l03924o53088
1350.2E98829150q83460r49621r82583j152813j456380j625419j370728r79662p26521
1368.5E88701963n27858m47393k84612J14679M87507O56664P46966J115799J884877
$$ plain form
1386.9 592448592 594860911 596907675 598082840 598449647 598323166 597964823 597588420 597089469 596309841
1405.3 596309841 595342278 594211757 593009531 591974556 591126859 590283453 589736164 589849651 590315640
1423.6 590315640 590894938 591402233 591745436 592104971 592442393 592790782 593604982 594668627 595503330
1442 595503330 596028209 596250355 596187830 595784426 594751596 592929482 590483427 588967860 589257121
1460.3 589257121 590122342 591559827 594468772 598901927 604880035 613131881 622298121 630482614
1476.6 630482614 637695909 644329667 650601685 656204462 661101699 665685475 670148075 673925340
1493 673925340 676941335 679844677 682770669 685202956 686659396 687205493 688084781 689813018 691084087
1511.3 691084087 691549778 691578567 691838503 692526639 693521678 694751143 695750654 696462154 697006881 697211504
$$ packed form
1386.9E92448592K412319K046764J175165L66807j26481l58343l76403m98951p79628
1405.3E96309841r67563j130521j202226j034975q47697q43406n47289J13487M65989
1423.6E90315640N79298N07295L43203L59535L37422L48389Q14200J063645Q34703
1442E95503330N24879K22146o2525m03404j032830j822114k446055j515567K89261
1460.3E89257121Q65221J437485K908945M433155N978108Q251846R166240Q184493
1476.6F30482614P213295O633758O272018N602777M897237M583776M462600L777265
1493F73925340L015995K903342K925992K432287J456440N46097Q79288J728237J271069
1511.3F91084087M65691K8789K59936O88136R95039J229465R99511P11500N44727K04623
$$ plain form
1531.7 697211504 697246015 697272956 696605623 695353568 695191026 695947468 696505964 696508527 696054101 695466042
1552.1 695466042 694807649 693763852 692125201 691333354 691534281 691257358 690487623 689406633 688329577
1570.5 688329577 687502623 686338007 685179353 684926152 684804797 684166193 683197856 682146609 681140304
1588.8 681140304 680089235 678771317 677045524 675028682 672890365 670610964 668080211 665139079
1605.1 665139079 661699176 657905221 654112458 650317550 645901084 641119659 637432277 634040952
1621.4 634040952 630156338 626493514 622904480 619198799 615767300 612271428 608862579 607178628
1637.8 607178628 606761515 606511056 606305659 606591940 608116031 609911621 611409426 614297092 618147254
1656.1 618147254 621661425 625170827 629075289 633294344 637097120 640928388 645757616 650765717
$$ packed form
1531.7F97211504L4511K6941o67333j252055j62542P56442N58496K563m54426n88059
1552.1F95466042o58393j043797j638651p91847K00927k76923p69735j080990j077056
1570.5F88329577q26954j164616j158654k53201j21355o38604r68337j051247j006305
1588.8F81140304j051069j317918j725793k016842k138317k279401k530753k941132
1605.1F65139079l439903l793955l792763l794908m416466m781425l687382l391325
1621.4F34040952l884614l662824l589034l705681l431499l495872l408849j683951
1637.8F07178628m17113k50459k05397K86281J524091J795590J497805K887666L850162
1656.1F18147254L514171L509402L904462M219055L802776L831268M829228N008101
$$ plain form
1672.4 650765717 655648232 660811663 665650964 669881642 674146533 679889143 685933590 690902591
1688.8 690902591 695700049 700256348 704886138 709759772 714140236 718739510 722947061 726309597
1705.1 726309597 729483247 732112527 733930528 735237002 736523390 738578677 741357684 743536413
1721.4 743536413 744708657 745354712 745732665 745767951 745132089 743710279 742566407 741943240 741418540
1739.7 741418540 741570652 742613971 744467795 747552514 752555609 759256542 765811682 771545291
1756.1 771545291 776618779 780962706 785179973 789129198 792118788 794115543 795463324 797095895
1772.4 797095895 799487233 801716149 803233743 804241598 805140257 806233048 807541311 808614790
1788.7 808614790 809074342 809480667 810406566 811518967 812573195 813601315 814475656 815116763 815745234
$$ packed form
1672.4F50765717M882515N163431M839301M230678M264891N742610O044447M969001
1688.8F90902591M797458M556299M629790M873634M380464M599274M207551L362536
1705.1G26309597L173650K629280J818001J306474J286388K055287K779007K178729
1721.4G43536413J172244O46055L77953L5286o35862j421810j143872o23167n24700
1739.7G41418540J52112J043319J853824L084719N003095O700933O555140N733609
1756.1G71545291N073488M343927M217267L949225K989590J996755J347781J632571
1772.4G97095895K391338K228916J517594J007855Q98659J092791J308263J073479
1788.7H08614790M59552M06325R25899J112401J054228J028120Q74341O41107O28471
$$ plain form
1807 815745234 816540539 817485094 818327010 818859041 819266081 819899678 820704341 821334362 821688354 821818292
1827.4 821818292 822025716 822814822 823869407 824541450 824797213 824860036 824821234 824984491 825696051 826401591
1847.8 826401591 826647460 826719284 826966286 827446043 827907920 828100502 828050792 827973425 827979863 828217447
1868.2 828217447 828773975 829246998 829417229 829594612 830026746 830549538 830863357 830900490 830842078 830977380
1888.6 830977380 831506133 832088709 832298458 832269013 832332492 832632363 833048403 833306789 833259881 833087385
1909 833087385 833139896 833476901 833766818 833777726 833670855 833627164 833784640 834195852 834564865 834635198 834491968
1931.5 834491968 834416330 834615052 834973991 835132957 834968925 834793925 834904611 835279584 835688651 835869193
1951.9 835869193 835802734 835744023 835913122 836266935 836566389 836598933 836412668 836335003 836548686 836889088
$$ packed form
1807H15745234P95305R44555Q41916N32031M07040O33597Q04663O30021L53992J29938
1827.4H21818292K07424P89106J054585O72043K55763O2823l8802J63257P11560P05540
1847.8H26401591K45869P1824K47002M79757M61877J92582m9710p7367O438K37584
1868.2H28217447N56528M73023J70231J77383M32134N22792L13819L7133n8412J35302
1888.6H30977380N28753N82576K09749k9445O3479K99871M16040K58386m6908j72496
1909H33087385N2511L37005K89917J0908j06871m3691J57476M11212L69013P0333j43230
1931.5H34491968p5638J98722L58939J58966j64032j75000J10686L74973M09067J80542
1951.9H35869193o6459n8711J69099L53813K99454L2544j86265p7665K13683L40402
$$ plain form
1972.3 836889088 837095916 837052822 836914957 836927891 837153018 837411702 837462962 837260008 837031722 837070286
1992.6 837070286 837361038 837570965 837494969 837258577 837087572 837096512 837195575 837166727 836893022 836485147
2013 836485147 836184859 836120903 836122096 835902750 835442185 834975004 834717095 834652483 834553003 834219515 833712995
2035.5 833712995 833319187 833193243 833187401 833068073 832753241 832391262 832230866 832327068 832479656 832473755
2055.9 832473755 832313418 832204521 832305908 832551837 832744002 832752049 832624674 832580686 832762063 833037019
2076.3 833037019 833170831 833105564 832996249 833041251 833290994 833574414 833686411 833621025 833571374 833715916
2096.7 833715916 834031940 834312797 834394336 834346414 834380090 834592223 834861517 835001588 834959447 834862888
2117.1 834862888 834879696 835054874 835252762 835303247 835209787 835127473 835189521 835371375 835518122 835503221 835394442
$$ packed form
1972.3H36889088K06828m3094j37865J2934K25127K58684N1260k02954k28286L8564
1992.6H37070286K90752K09927p5996k36392j71005Q940R9063k8848k73705m07875
2013H36485147l00288o3956J193k19346m60565m67181k57909o4612r9480l33488n06520
2035.5H33712995l93808j25944n842j19328l14832l61979j60396R6202J52588n901
2055.9H32473755j60337j08897J01387K45929J92165Q047j27375m3988J81377K74956
2076.3H33037019J33812o5267j09315M5002K49743K83420J11997o5386m9651J44542
2096.7H33715916L16024K80857Q1539m7922L3676K12133K69294J40071m2141r6559
2117.1H34862888J6808J75178J97888N0485r3460q2314O2048J81854J46747j4901j08779
$$ plain form
2139.5 835394442 835372090 835498095 835670590 835753560 835721552 835682452 835762918 835984170 836247802 836418688
2159.9 836418688 836495757 836638033 836946189 837354720 837738872 838021040 838228703 838492274 838895321 839370847
2180.3 839370847 839779019 840054691 840272963 840559959 840956271 841380000 841712415 841923535 842119992 842418194
2200.7 842418194 842804670 843173981 843433201 843600035 843819678 844176233 844596267 844947994 845149338 845268488
2221.1 845268488 845447421 845749259 846107125 846380770 846514225 846578836 846692204 846908569 847161591 847335100
2241.5 847335100 847396433 847437739 847567379 847791970 848007619 848111033 848117471 848140538 848276794 848511040
2261.9 848511040 848712623 848777890 848783195 848906577 849166691 849422514 849579036 849640548 849704504 849850357
2282.3 849850357 850049376 850223243 850287020 850215137 850113094 850130320 850281239 850421369 850405097 850251317
$$ packed form
2139.5H35394442k2352J26005J72495Q2970l2008l9100Q0466K21252K63632J70886
2159.9H36418688P7069J42276L08156M08531L84152K82168K07663K63571M03047M75526
2180.3H39370847M08172K75672K18272K86996L96312M23729L32415K11120J96457K98202
2200.7H42418194L86476L69311K59220J66834K19643L56555M20034L51727K01344J19150
2221.1H45268488J78933L01838L57866K73645J33455O4611J13368K16365K53022J73509
2241.5H47335100O1333M1306J29640K24591K15649J03414O438K3067J36256K34246
2261.9H48511040K01583O5267N305J23382K60114K55823J56522O1512O3956J45853
2282.3H49850357J99019J73867O3777p1883j02043J7226J50919J40130j6272j53780
$$ plain form
2302.7 850251317 850109816 850102782 850199223 850219905 850063264 849830687 849653840 849525094 849363446 849111378
2323.1 849111378 848754942 848376513 848113835 847970665 847762108 847392261 847019970 846833229 846851170 847025931
2343.5 847025931 847299933 847426355 847183287 846655965 846101224 845649421 845249236 844846308 844557822 844564736
2363.8 844564736 844817042 845146239 845410168 845559061 845697045 845945835 846270978 846503913 846509457 846351266
2384.2 846351266 846206129 846156359 846126497 845973909 845656455 845302224 845065713 844953179 844830275 844560683
2404.6 844560683 844155371 843759358 843491137 843310475 843063056 842654824 842131793 841651678 841319799 841042161
2425 841042161 840656400 840127587 839550316 839058280 838693857 838333011 837847471 837250054 836650372 836162448
2445.4 836162448 835781038 835365176 834814131 834192574 833658695 833296776 832999289 832570732 831978977 831378281
$$ packed form
2302.7H50251317j41501p034R6441K0682j56641k32577j76847j28746j61648k52068
2323.1H49111378l56436l78429k62678j43170k08557l69847l72291j86741J7941J74761
2343.5H47025931K74002J26422k43068n27322n54741m51803m00185m02928k88486O914
2363.8H44564736K52306L29197K63929J48893J37984K48790L25143K32935N544j58191
2384.2H46351266j45137m9770k9862j52588l17454l54231k36511j12534j22904k69592
2404.6H44560683m05312l96013k68221j80662k47419m08232n23031m80115l31879k77638
2425H41042161l85761n28813n77271m92036l64423l60846m85540n97417n99682m87924
2445.4H36162448l81410m15862n51045o21557n33879l61919k97487m28557n91755o00696
$$ plain form
2465.8 831378281 830915689 830595374 830286145 829850018 829284012 828750789 828392863 828153014 827849150 827380240
2486.2 827380240 826840281 826396048 826108515 825901628 825624168 825211287 824782014 824476123 824271202 824051440
2506.6 824051440 823724926 823275030 822827458 822526455 822331011 822068810 821634591 821098924 820626915 820286274
2527 820286274 819988251 819595814 819047809 818420947 817871094 817459702 817071557 816549182 815893769 815259635
2547.4 815259635 814767480 814390659 813979387 813415885 812762976 812177420 811729848 811349511 810898602 810324073
2567.8 810324073 809710920 809189677 808785498 808377087 807869315 807291806 806746721 806308985 805950165 805569470
2588.2 805569470 805091739 804570854 804130018 803794324 803480327 803087533 802566171 801981509 801474273 801064551
2608.6 801064551 800603032 799977839 799235880 798503637 797840178 797170937 796390474 795464635 794460714
$$ packed form
2465.8H31378281m62592l20315l09229m36127n66006n33223l57926k39849l03864m68910
2486.2H27380240n39959m44233k87533k06887k77460m12881m29273l05891k04921k19762
2506.6H24051440l26514m49896m47572l01003j95444k62201m34219n35667m72009l40641
2527H20286274k98023l92437n48005o26862n49853m11392l88145n22375o55413o34134
2547.4H15259635m92155l76821m11272n63502o52909n85556m47572l80337m50909n74529
2567.8H10324073o13153n21243m04179m08411n07772n77509n45085m37736l58820l80695
2588.2H05569470m77731n20885m40836l35694l13997l92794n21362n84662n07236m09722
2608.6H01064551m61519o25193p41959p32243o63459o69241p80463r25839j003921
$$ plain form
2626.9 794460714 793505669 792648613 791805208 790858567 789803267 788748264 787791252 786919296 786010027
2645.3 786010027 784964800 783850849 782834768 781960309 781101108 780156612 779146552 778140426 777217805
2663.7 777217805 776405752 775621831 774752676 773801982 772898257 772124052 771426320 770705760 769928515 769130707
2684.1 769130707 768386245 767730713 767091751 766376376 765573919 764764249 764008999 763262331 762456357 761595726
2704.5 761595726 760712445 759831548 758997619 758208871 757374048 756463587 755576491 754772127 754004478 753229022
2724.8 753229022 752435446 751633406 750881135 750205100 749553323 748887420 748203874 747525632 746882498 746272802
2745.2 746272802 745664775 745023847 744361043 743742526 743200064 742689490 742154360 741565287 740953147 740380168
2765.6 740380168 739832819 739248514 738612592 737933815 737215459 736477971 735722423 734904885 734018326 733109415
$$ packed form
2626.9G94460714r55045q57056q43405r46641j055300j055003r57012q71956r09269
2645.3G86010027j045227j113951j016081q74459q59201r44496j010060j006126r22621
2663.7G77217805q12053p83921q69155r50694r03725p74205o97732p20560p77245p97808
2684.1G69130707p44462o55532o38962p15375q02457q09670p55250p46668q05974q60631
2704.5G61595726q83281q80897q33929p88748q34823r10461q87096q04364p67649p75456
2724.8G53229022p93576q02040p52271o76035o51777o65903o83546o78242o43134o09696
2745.2G46272802o08027o40928o62804o18517n42462n10574n35130n89073o12140n72979
2765.6G40380168n47349n84305o35922o78777p18356p37488p55548q17538q86559r08911
$$ plain form
2786 733109415 732181787 731191158 730116963 728974342 727781355 726549506 725278616 723944426 722521901
2804.4 722521901 721024334 719481051 717877626 716195643 714440644 712608993 710704982 708743930
2820.7 708743930 706701875 704520643 702185333 699737370 697194338 694516420 691615582 688356519
2837 688356519 684560180 680052459 674704492 668460965 661467254 654221117 647593081 642564297 639743030
2855.4 639743030 638986409 639476299 640196741 640370071 639618635 637901187 635448515 632674873 629884124
2873.7 629884124 627160013 624534070 622015476 619584620 617251277 615034640 612958312 611066580
2890.1 611066580 609357238 607736528 606078565 604311466 602426350 600342691 597874284 594871461
2906.4 594871461 591255784 586953521 581872106 575979829 569505215 562985361 557075918 552412987
$$ packed form
2786G33109415r27628r90629j074195j142621j192987j231849j270890j334190j422525
2804.4G22521901j497567j543283j603425j681983j754999j831651j904011j961052
2820.7G08743930k042055k181232k335310k447963k543032k677918k900838l259063
2837F88356519l796339m507721n347967o243527o993711p246137o628036n028784k821267
2855.4F39743030p56621M89890P20442J73330p51436j717448k452672k773642k790749
2873.7F29884124k724111k625943k518594k430856k333343k216637k076328j891732
2890.1F11066580j709342j620710j657963j767099j885116k083659k468407l002823
2906.4E94871461l615677m302263n081415n892277o474614o519854n909443m662931
$$ plain form
2922.7 552412987 549476743 548491538 549374104 551819563 555602670 560576856 566442430 572794080 579279780
2941 579279780 585584223 591453731 596745610 601405084 605499744 609207928 612801075 616586328 620783031
2959.4 620783031 625441790 630434155 635566950 640735090 645901322 650951803 655697525 659995437
2975.7 659995437 663851440 667354345 670523763 673331738 675787628 677920938 679734111 681180239
2992 681180239 682218254 682867527 683077991 682789028 682108700 681197464 680211544 679322064 678588271 677923262
3012.4 677923262 677251220 676568866 675848365 674988508 673895359 672548592 670996547 669359028 667730331
3030.8 667730331 666064024 664198637 662113190 660046995 658111334 656119227 653917432 651587784
3047.1 651587784 649311662 647121906 644925773 642695129 640406966 638064206 635770917 633597910
$$ packed form
2922.7E52412987k936244r85205Q82566K445459L783107M974186N865574O351650O485700
2941E79279780O304443N869508N291879M659474M094660L708184L593147L785253M196703
2959.4F20783031M658759M992365N132795N168140N166232N050481M745722M297912
2975.7F59995437L856003L502905L169418K807975K455890K133310J813173J446128
2992F81180239J038015O49273K10464k88963o80328r11236r85920q89480p33793o65009
3012.4F77923262o72042o82354p20501q59857j093149j346767j552045j637519j628697
3030.8F67730331j666307j865387k085447k066195j935661j992107k201795k329648
3047.1F51587784k276122k189756k196133k230644k288163k342760k293289k173007
$$ plain form
3063.4 633597910 631510079 629376411 627116561 624839842 622676790 620658576 618696570 616601825
3079.7 616601825 614375293 612173557 609991014 607826173 605701089 603511512 601272702 599143267
3096 599143267 597163081 595178664 593052983 590891480 588855743 586903334 584896445 582874835 580941617
3114.4 580941617 579005837 576975107 574866891 572714150 570589483 568560898 566602230 564633071
3130.7 564633071 562666535 560789645 558976829 557087362 555066109 553041577 551119566 549266279
3147 549266279 547475934 545755923 543975711 542067230 540170014 538360298 536560357 534745872 532991409
3165.4 532991409 531304896 529619217 527914464 526211858 524534047 522897661 521307886 519716024
3181.7 519716024 518078864 516445160 514883101 513381720 511869252 510307908 508724809 507175326
$$ packed form
3063.4F33597910k087831k133668k259850k276719k163052k018214j962006k094745
3079.7F16601825k226532k201736k182543k164841k125084k189577k238810k129435
3096E99143267j980186j984417k125681k161503k035737j952409k006889k021610j933218
3114.4E80941617j935780k030730k108216k152741k124667k028585j958668j969159
3130.7E64633071j966536j876890j812816j889467k021253k024532j922011j853287
3147E49266279j790345j720011j780212j908481j897216j809716j799941j814485j754463
3165.4E32991409j686513j685679j704753j702606j677811j636386j589775j591862
3181.7E19716024j637160j633704j562059j501381j512468j561344j583099j549483
$$ plain form
3198 507175326 505703747 504313231 502953887 501557767 500130475 498753846 497443587 496131003 494797915
3216.4 494797915 493495703 492243826 491002709 489750415 488496453 487261891 486099482 484988987
3232.7 484988987 483778864 482466400 481207401 480030298 478905797 477843642 476807624 475724518
3249 475724518 474607855 473542452 472550899 471572876 470581472 469607234 468680441 467811763 467011899 466313750
3269.4 466313750 465587735 464673162 463653833 462666005 461758971 460919231 460106820 459270746 458419293
3287.8 458419293 457658976 456959754 456151664 455197632 454174101 453176409 452318788 451579094 450731516
3306.1 450731516 449602902 448277086 446965784 445761234 444602430 443438441 442261249 441052526
3322.4 441052526 439797968 438432425 436949551 435459882 433989167 432554871 431219131 429858446
$$ packed form
3198E07175326j471579j390516j359344j396120j427292j376629j310259j312584j333088
3216.4D94797915j302212j251877j241117j252294j253962j234562j162409j110495
3232.7D84988987j210123j312464j258999j177103j124501j062155j036018j083106
3249D75724518j116663j065403r91553r78023r91404r74238r26793q68678p99864o98149
3269.4D66313750p26015r14573j019329r87828r07034q39740q12411q36074q51453
3287.8D58419293p60317o99222q08090r54032j023531r97692q57621p39694q47578
3306.1D50731516j128614j325816j311302j204550j158804j163989j177192j208723
3322.4D41052526j254558j365543j482874j489669j470715j434296j335740j360685
$$ plain form
3338.8 429858446 428332567 426726013 425105661 423497230 421973318 420395881 418589294 416692257
3355.1 416692257 414922595 413279563 411620915 409937441 408376902 406885684 405222833 403342545
3371.4 403342545 401481152 399825424 398283631 396760255 395269573 393889010 392691076 391656011
3387.7 391656011 390756249 389792293 388554662 387304842 386435479 385801852 384888679 383653432 382554144
3406.1 382554144 381730288 381010145 380304039 379571587 378847152 378242284 377742589 377271235 376901418 376705378
3426.5 376705378 376657099 376676351 376771003 376968563 377079189 376990825 376923233 377111971 377517581 377959788
3446.8 377959788 378385305 378900766 379541725 380254835 381054819 381942213 382793665 383643627 384715617
3465.2 384715617 385960668 387000084 387667209 388317406 389257133 390433341 391612887 392600000 393567830
$$ packed form
3338.8D29858446j525879j606554j620352j608431j523912j577437j806587j897037
3355.1D16692257j769662j643032j658648j683474j560539j491218j662851j880288
3371.4D03342545j861393j655728j541793j523376j490682j380563j197934j035065
3387.7C91656011q99762r63956j237631j249820q69363o33627r13173j235247j099288
3406.1C82554144q23856p20143p06106p32452p24435o04868m99695m71354l69817j96040
3426.5C76705378m8279J9252R4652J97560J10626q8364o7592J88738M05610M42207
3446.8C77959788M25517N15461O40959P13110P99984Q87394Q51452Q49962J071990
3465.2C84715617J245051J039416O67125O50197R39727J176208J179546R87113R67830
$$ plain form
3483.6 393567830 394715607 395870388 396950364 398084849 399277091 400525928 401806355 403063059
3499.9 403063059 404299051 405445069 406511873 407659262 408967763 410434395 411908388 413205326
3516.2 413205326 414417446 415761411 417314231 418853700 420215458 421592593 423134774 424794227
3532.5 424794227 426540732 428291678 429964900 431703836 433601558 435525984 437311530 439065427
3548.8 439065427 440964848 442981154 445057690 447239190 449566483 451904953 454078317 456188023
3565.1 456188023 458698481 461690605 464665532 467507184 470436960 473492950 476697415 480093718
3581.5 480093718 483463943 486587733 489755720 493383199 497132212 500764251 504508138 508417249
3597.8 508417249 512357533 516351938 520315111 524030030 527738452 531702816 535782456 539906263
$$ packed form
3483.6C93567830J147777J154781J079976J134485J192242J248837J280427J256704
3499.9D03063059J235992J146018J066804J147389J308501J466632J473993J296938
3516.2D13205326J212120J343965J552820J539469J361758J377135J542181J659453
3532.5D24794227J746505J750946J673222J738936J897722J924426J785546J753897
3548.8D39065427J899421K016306K076536K181500K327293K338470K173364K109706
3565.1D56188023K510458K992124K974927K841652K929776L055990L204465L396303
3581.5D80093718L370225L123790L167987L627479L749013L632039L743887L909111
3597.8E08417249L940284L994405L963173L714919L708422L964364M079640M123807
$$ plain form
3614.1 539906263 543897212 547823310 552153111 556569517 560468614 563777924 567236662 571619153
3630.4 571619153 576062024 580125868 584029436 587799489 591510236 595149040 598432958 601286173
3646.7 601286173 604475260 608578324 612572908 615934551 619392276 623079717 626427293 629458785
3663 629458785 632328570 634772956 636977494 639592886 642069280 644293129 647242427 650469244 653344035
3681.4 653344035 655885160 658032477 659867227 661783934 664088368 666558146 668841124 670744598
3697.7 670744598 672268510 673756599 675522923 677208781 678402185 679312348 680706739 682799041
3714 682799041 684755325 686181784 687301397 688374460 689486265 690704167 691988528 692968905 693606913
3732.4 693606913 694376707 695730507 697465181 698692679 698910177 699073017 700133741 700998306 701601565
$$ packed form
3614.1E39906263L990949L926098M329801M416406L899097L309310L458738M382491
3630.4E71619153M442871M063844L903568L770053L710747L638804L283918K853215
3646.7F01286173L189087M103064L994584L361643L457725L687441L347576L031492
3663F29458785K869785K444386K204538K615392K476394K223849K949298L226817K874791
3681.4F53344035K541125K147317J834750J916707K304434K469778K282978J903474
3697.7F70744598J523912J488089J766324J685858J193404R10163J394391K092302
3714F82799041J956284J426459J119613J073063J111805J217902J284361R80377O38008
3732.4F93606913P69794J353800J734674J227498K17498J62840J060724Q64565O03259
$$ plain form
3750.7 701601565 703031063 704791605 706004679 706867814 707956195 709073067 709897280 710561633 711236119
3769.1 711236119 712184012 713341475 714276195 714892626 715512097 716347933 717132688 717818558 718606889
3787.5 718606889 719431400 720139146 720590830 720873594 721172869 721268058 721549034 722477853 723317444 724136055
3807.8 724136055 725235164 726021886 726151526 726141274 726462305 726748347 727407575 728545427 729455948
3826.2 729455948 730084062 730461180 730697274 730970144 731121778 731344700 731998622 732843697 733702481 734464169
3846.6 734464169 734813392 734394610 733576477 734115183 735709906 736756206 737096965 737159550 737385750
3865 737385750 737640917 737705886 738084793 738868177 739701807 740283787 740412831 740575314 740965784 741381109
3885.4 741381109 741898060 742190778 742335796 742841959 743383586 743501365 743340790 743242443 743468523 744173169
$$ packed form
3750.7G01601565J429498J760542J213074Q63135J088381J116872Q24213O64353O74486
3769.1G11236119R47893J157463R34720O16431O19471Q35836P84755O85870P88331
3787.5G18606889Q24511P07746M51684K82764K99275R5189K80976R28819Q39591Q18611
3807.8G24136055J099109P86722J29640j0252L21031K86042O59228J137852R10521
3826.2G29455948O28114L77118K36094K72870J51634K22922O53922Q45075Q58784P61688
3846.6G34464169L49223m18782q18133N38706J594723J046300L40759O2585K26200
3865G37385750K55167O4969L78907P83384Q33630N81980J29044J62483L90470M15325
3885.4G41381109N16951K92718J45018N06163N41627J17779j60575r8347K26080P04646
$$ plain form
3905.7 744173169 745008230 745552003 745810151 745876849 745860398 746003032 746351659 746647179 746789157 746951699
3926.1 746951699 747161746 747337401 747572422 747889996 748153806 748335719 748463213 748614252 748879910 749128282
3946.5 749128282 749285102 749481082 749740362 749997139 750201344 750314891 750401020 750585079 750845373 751062691
3966.9 751062691 751204073 751314700 751450658 751649439 751897812 752086878 752199650 752341688 752498925 752634227
3987.3 752634227 752804637 752975166 753073454 753166139 753328383
3997.5 753328383
$$ packed form
3905.7G44173169Q35061N43773K58148O6698j6451J42634L48627K95520J41978J62542
3926.1G46951699K10047J75655K35021L17574K63810J81913J27494J51039K65658K48372
3946.5G49128282J56820J95980K59280K56777K04205J13547Q6129J84059K60294K17318
3966.9G51062691J41382J10627J35958J98781K48373J89066J12772J42038J57237J35302
3987.3G52634227J70410J70529R8288R2685J62244
3997.5G53328383
##END=$$ End of the data block
