##TITLE=4 e-com $$ Begin of the data block
##JCAMP-DX=5.00 $$ ACD/SpecManager v 10.08
##SPECTROMETER/DATA SYSTEM=Alpha
##DATE=16 Oct 2013 13:51:24
##DATA TYPE=INFRARED SPECTRUM
##DATA CLASS=XYDATA
##ORIGIN=
##OWNER=
##NPOINTS=1765
##FIRSTX=399.75695801
##LASTX=3997.56933594
##MAXX=3997.56933594
##MINX=399.75695801
##MAXY=0.82283384
##MINY=0.31276000
##XFACTOR=1.0000000000
##YFACTOR=1.000000000000000e-9
##FIRSTY=0.60317528
##DELTAX=2.03957629
##XUNITS=1/CM
##YUNITS=ARBITRARY UNITS
##XYDATA=(X++(Y..Y))
399.8F03175282k064764l770947l608823o78897J896441J558602o93202j414001M78983
$$ 603175282 601110518 597339571 593730748 593051851 594948292 596506894 595813692 594399691 594878674
418.1E94878674J566648n58913l006696l126085q00073N46395j218557l539979k971650
$$ 594878674 596445322 595886409 592879713 589753628 588953555 589499950 588281393 584741414 581769764
436.5E81769764K35379K511084J704335n9425M51445K410710K713323N68211j447678
$$ 581769764 582005143 584516227 586220562 586161137 586612582 589023292 591736615 592304826 590857148
454.8E90857148j127302M78506M01854j900375l508150k437592o17802q57651k904177
$$ 590857148 589729846 590208352 590610206 588709831 585201681 582764089 582146287 581288636 578384459
473.2E78384459l799796k279818k36690Q5950j341462k302289j156211N24521J88648
$$ 578384459 574584663 572304845 572068155 572154105 570812643 568510354 567354143 567878664 568067312
491.5E68067312j905441l027856j841009l06547q85129k934992l711462k644301j665115
$$ 568067312 566161871 563134015 561293006 560986459 560101330 557166338 553454876 550810575 549145460
509.9E49145460k328753l869951m255712l035844j949310k117514k703965k350986
$$ 549145460 546816707 542946756 538691044 535655200 533705890 531588376 528884411 526533425
526.2E26533425n89729J105309J233816N41210J169205L381908M769027L710449J254439
$$ 526533425 525943696 527049005 528282821 528824031 529993236 533375144 538144171 541854620 543109059
544.6E43109059j93357L18229R44853m6253j935661k721906j765370r31144k027571
$$ 543109059 542915702 543233931 544178784 544132531 542196870 539474964 537709594 536778450 534750879
562.9E34750879m155040n269885m686296l388882k672374k300560p95961K086818M576683
$$ 534750879 530595839 525325954 520639658 517250776 514578402 512277842 511481881 513568699 518145382
581.3E18145382N046249L936946L207445L490329L485680K080560l1054r57847p2479
$$ 518145382 523191631 527128577 530336022 533826351 537312031 539392591 539361537 538403690 538331211
599.6E38331211R82105O09815n71668q09431M63963J845956J906275R92239P39455
$$ 538331211 539313316 539923131 539351463 538542032 539005995 540851951 542758226 543750465 544489920
618E44489920K131581L906072M081189K750576J951039K597570L499389K977967J292110
$$ 544489920 546621501 550527573 554608762 557359338 559310377 561907947 565407336 568385303 569677413
636.3E69677413N44190J540422K802253K616525J100182K27809J107812K186954J650453
$$ 569677413 570221603 571762025 574564278 577180803 578280985 578508794 579616606 581803560 583454013
654.7E83454013l6419p68542K90871J508593J709760J310587n0545q941J633585K030015
$$ 583454013 583417594 582649052 582939923 584448516 586158276 587468863 587418318 587409377 589042962 591072977
675.1E91072977Q74281K58982J178801K260864J778841M3094q46088l8028P97808M4823
$$ 591072977 591947258 592206240 593385041 595645905 597424746 597467840 596621752 596583724 597381532 597426355
695.5E97426355j743674k569259j585602k15650j05262q53240p37250R07361K787292
$$ 597426355 595682681 593113422 591527820 591312170 591206908 590353668 589616418 590523779 593311071
713.8E93311071L299058K672672K542973L775418N279123N351365L928125K853155
$$ 593311071 596610129 599282801 601825774 605601192 610880315 616231680 620159805 623012960
730.2F23012960L283322M066706L566145J896024O84798Q51035J442492P39992j289189
$$ 623012960 626296282 630362988 633929133 635825157 636509955 637360990 638803482 639543474 638254285
748.5F38254285k637327k222836j403153j751184l022552l468573j955092L51668J655340
$$ 638254285 635616958 633394122 631990969 630239785 627217233 623748660 621793568 622145236 623800576
766.9F23800576J938820K546012M169107N890786O125808M705489L347814L454208
$$ 623800576 625739396 628285408 632454515 638345301 644471109 649176598 652524412 655978620
783.2F55978620M290044M128456K725840J545549J911520L266573L827036K985299
$$ 655978620 660268664 664397120 667122960 668668509 670580029 673846602 677673638 680658937
799.5F80658937K076268K325415L032923K782166J343846k4795j5617R58384J165270
$$ 680658937 682735205 685060620 688093543 690875709 692219555 692194760 692179143 693137527 694302797
817.9F94302797K325j284421j430749q09849q75950k078354l228962l202737k449453
$$ 694302797 694305122 693020701 691589952 690780103 689904153 687825799 684596837 681394100 678944647
836.2F78944647k208173k864480l509879l166080j984000j143396j541257k449631
$$ 678944647 676736474 673871994 670362115 667196035 665212035 664068639 662527382 660077751
852.5F60077751k545655j787722r41396j40309J233756L642500O358385P883191P540882
$$ 660077751 657532096 655744374 654802978 654662669 655896425 659538925 665897310 673780501 681321383
870.9F81321383O018459M558504L644764K587200O29782j730382l180981l381729l222406
$$ 681321383 687339842 691898346 695543110 698130310 698760092 697029710 693848729 690467000 687244594
889.3F87244594l522694m137933m190564l384591k624154k864539l919363m719973
$$ 687244594 683721900 679583967 675393403 672008812 669384658 666520119 662600756 657880783
905.6F57880783m728079m646718n342543o531358p014990o239176m930854l927409
$$ 657880783 653152704 648505986 643163443 636632085 629617095 623377919 618447065 614519656
921.9F14519656l248453k401889j138150J09910O75917N88000P30991J729548L053546
$$ 614519656 611271203 608869314 607731164 607841074 608516991 609104991 609835982 611565530 614619076
940.2F14619076L535509K546311P05182r61363k418399m281521o430566p947445q439898
$$ 614619076 618154585 620700896 621406078 620444715 618026316 613744795 607314229 599366784 590926886
958.6E90926886q576751r211123j0490835j1822939j2685835j3352871j4414251j5889496
$$ 590926886 582350135 573139012 562648177 550825238 538139403 524786532 510372281 494482785
974.9D94482785j7150342j7676532j7601848j7303079j6766072j5583247j3622224
$$ 494482785 477332443 459655911 442054063 424750984 407984912 392401665 378779441
989.2C78779441j1302024r165972p428796n916714m424602l102392k370059k447427
$$ 378779441 367477417 358311445 350882649 344965935 340541333 337438941 335068882 332621455
1005.5C32621455l042280l549070l613293l279120k686023j769752m37498J165718
$$ 332621455 329579175 326030105 322416812 319137692 316451669 314681917 314244419 315410137
1021.8C15410137K695769L807783M393280M605800M587442M112958K939791J416296
$$ 315410137 318105906 321913689 326306969 330912769 335500211 339613169 342552960 343969256
1038.1C43969256L70025K35230O38425J081139J603961K621979M318684O271839P735998
$$ 343969256 344339281 344574511 345212936 346294075 347898036 350520015 354838699 361110538 368846536
1056.5C68846536Q466184Q892119R268254Q753657N956888O35922n458921r638756
$$ 368846536 377312720 386204839 395473093 404226750 410183638 410819560 405360639 395721883
1072.8C95721883j0342151q073181m478067p77334K607762N335778O966800P488817
$$ 395721883 385379732 377306551 372828484 372051150 374658912 379994690 386961490 394450307
1089.1C94450307P326424O801933N834758M230082K313137Q91090O71685J582443K734810
$$ 394450307 401776731 408578664 414413422 418643504 420956641 421847731 422519416 424101859 426836669
1107.5D26836669L390760L592938L724605L779202L391713K565086J910746J990646
$$ 426836669 430227429 433820367 437544972 441324174 444715887 447280973 449191719 451182365
1123.8D51182365K690852L329963L351777K637566J391381k09272k250523m505545
$$ 451182365 453873217 457203180 460554957 463192523 464583904 464374632 462124109 457618564
1140.1D57618564o248146o908029o551326n702674m735410l492147j613736Q30501
$$ 457618564 451370418 444462389 437911063 432208389 427472979 423980832 422367096 423197597
1156.4D23197597L311336N407781P287770R339661J1421829J2925863J3417274J3079822
$$ 423197597 426508933 431916714 439204484 448544145 459965974 472891837 486309111 499388933
1172.7D99388933J2557209J2175560J1608600J0422647Q735359P248223O349563N534351
$$ 499388933 511946142 524121702 535730302 546152949 554888308 562136531 568486094 574020445
1189.1E74020445M184783K523124J383960J129270J222134J035332P02381Q44777J626968
$$ 574020445 578205228 580728352 582112312 583241582 584463716 585499048 586201429 587046206 588673174
1207.4E88673174K447367K560318J989603J438319J241088R75192J14083j157701k060890
$$ 588673174 591120541 593680859 595670462 597108781 598349869 599325061 599439144 598281443 596220553
1225.8E96220553k134264j785516j750470k078771k104759j441777m87089R3579K27273
$$ 596220553 594086289 592300773 590550303 588471532 586366773 584924996 584437907 584531486 584758759
1244.1E84758759M96447J238882K026856K177835J681506J239956J327574J651704
$$ 584758759 585255206 586494088 588520944 590698779 592380285 593620241 594947815 596599519
1260.4E96599519J645684J290858J108945J417279J848221J722216R58980K69949K33233
$$ 596599519 598245203 599536061 600645006 602062285 603910506 605632722 606591702 606861651 607094884
1278.8F07094884O44326Q51691N74767J85311J17839K36869p093p20203j316071j252413
$$ 607094884 607739210 608590901 609165668 609350979 609468818 609705687 609698594 608978391 607662320 606409907
1299.2F06409907o99818l53396o33538j113951j094401o72757n42760r38952j412511
$$ 606409907 605710089 605356693 604723155 603609204 602514803 601842046 601299286 600360334 598947823
1317.6E98947823j472533j184523j185596j810968k564311k734661k256870j683712
$$ 598947823 597475290 596290767 595105171 593294203 590729892 587995231 585738361 584054649
1333.9E84054649j423657j326621r68516k39431L03864J64092l44098n81860m26293
$$ 584054649 582630992 581304371 580335855 580096424 580400288 580564380 580220282 579638422 579212129
1352.2E79212129l70324p86423j310826j430690j275360j218081j287162j349449j040161
$$ 579212129 578841805 578055382 576744556 575313866 574038506 572820425 571533263 570183814 569143653
1370.6E69143653m79937m14192q30412j008094p51078j42812O72578J026929M57763
$$ 569143653 568663716 568249524 567419112 566411018 565659940 565517128 566189706 567216635 567674398
1388.9E67674398o3419m8339j73867o02722j041055r52065k15232K74896N5194m08888
$$ 567674398 567610979 567562640 567388773 566786051 565744996 564792931 564577699 564852595 564907789 564498901
1409.3E64498901o04033k01941O64533J253426J001417P70986J337886J794756J644730
$$ 564498901 563894868 563692927 564357460 565610886 566612303 567383289 568721175 570515931 572160661
1427.7E72160661R97126L71814N28455Q08060K63035k48253j07169K85983N96642J67013
$$ 572160661 573157787 573529601 574058056 574866116 575129151 574880898 574773729 575059712 575656354 575823367
1448.1E75823367q49724j384735q89123N4479M19795O85096J669049L135682M836678
$$ 575823367 574973643 573588908 572699785 572754264 573174059 573859155 575528204 578663886 583500564
1466.4E83500564O914556R550512J1602521J0496437Q319200P113039O002009M801094
$$ 583500564 590415120 599965632 611568153 622064590 630383790 637496829 643498838 648299932
1482.8F48299932L921807L575206K690852O98864n90503o20127p86721j474858j878857
$$ 648299932 652221739 655796945 658487797 659186661 658596158 657976031 657189310 655714452 653835595
1501.1F53835595j611472j616597l458023m654288m423082m285514l568828k301932
$$ 653835595 652224123 650607526 647149503 642495215 638072133 633786619 630217791 627915859
1517.4F27915859j155257j340270k311051k493143k361059j851976j510680k138555
$$ 627915859 626760602 625420332 623109281 620616138 618255079 616403103 614892423 612753868
1533.7F12753868k025545o44207k66373j427054j772463j204431j32025Q23677J195073
$$ 612753868 610728323 610084116 609817743 608390689 606618226 605413795 605281770 606105447 607300520
1552.1F07300520J331389J763701K051473N87702k91586R1493L98099O99223O23822
$$ 607300520 608631909 610395610 612447083 613034785 612743199 612834692 613232791 613932014 614555836
1570.5F14555836M33266N28395J2636m25279M2379K06232k36928p00951p84636p68482
$$ 614555836 614989102 615517497 615530133 615104854 615147233 615353465 615116537 614415586 613630950 612862468
1590.9F12862468j071871j812696k494395k712965k798199l236115l996134m678369
$$ 612862468 611790597 609977901 607483506 604770541 601972342 598736227 594740093 590061724
1607.2E90061724n156040n203605m876792n401433o961167o280064n116999n940974
$$ 590061724 584905684 579702079 574825287 569423854 562462687 556182623 551065624 545124650
1623.5E45124650o799638p062197p005394n731344m739701n656124n519032l359616
$$ 545124650 538325012 531262815 524257421 518526077 513786376 508130252 502611220 499251604
1639.8D99251604j432180P569N63562K62648O38545J704722J725972J124263J712561
$$ 499251604 497819424 497826993 498390555 498653203 499291748 500996470 502722442 503846705 505559266
1658.2E05559266K825796L842592M293859M377127M865170N104243M894555N509317
$$ 505559266 508385062 512227654 516521513 520898640 525763810 530868053 535762608 541271925
1674.5E41271925N831063N290746N383492O425440P347226O116093N349278N932331
$$ 541271925 547102988 552393734 557777226 564202666 571549892 577665985 583015263 588947594
1690.8E88947594O614745Q305192R218633Q249342P428945N776643N123020M781246
$$ 588947594 595562339 603867531 613086164 621335506 628764451 634541094 639664114 644445360
1707.1F44445360L641605L229678L731727M571855M600943L006398J810372J647174
$$ 644445360 648086965 651316643 655048370 659620225 664221168 667227566 669037938 670685112
1723.4F70685112J441241Q09431q5771r76026k406061l609300l155052l175497k962113
$$ 670685112 672126353 672935784 672850013 671873987 669467926 665858626 662703574 659528077 656565964
1741.8F56565964r58681K118886N419492Q262396R801090J0013521J0578811J0464668
$$ 656565964 655607283 657726169 663145661 671408057 681209147 691222668 701801479 712266147
1758.1G12266147Q803189P148027N572379M939020M902839M234910K985895J899838
$$ 712266147 721069336 728217363 733789742 738728762 743631601 747866511 750852406 752752244
1774.4G52752244J904011K356470K177954J510799J237869J508474J989067K033651
$$ 752752244 754656255 757012725 759190679 760701478 761939347 763447821 765436888 767470539
1790.7G67470539J211643N45502J007735J614750J393377O67871M74333R81927J436234
$$ 767470539 768682182 769227684 770235419 771850169 773243546 773911417 774385750 775367677 776803911
1809.1G76803911J217484N87523M01378P55191J158058J227856R70006O26087O95706
$$ 776803911 778021395 778608918 779010296 779765487 780923545 782151401 783121407 783747494 784443200
1827.4G84443200R91940O94871K30610J73510M48405R15706J219810P90834o1750q3566
$$ 784443200 785435140 786130011 786360621 786534131 786982536 787898242 789118052 789908886 789847136 789763570
1847.8G89763570M60803O78599L81708O3002J86623N79834O99639M98831L74019L37124
$$ 789763570 790224373 790902972 791284680 791347682 791534305 792114139 792813778 793312609 793686628 794023752
1868.2G94023752K61188K77877K11715n185R1254N16773P31170M94897J87218J73688
$$ 794023752 794284940 794562817 794774532 794769347 794860601 795377374 796108544 796603441 796790659 796964347
1888.6G96964347L64304N27918L68417m9353j20103K84671N79656M21524N6505q1361
$$ 796964347 797328651 797856569 798224986 798175633 798055530 798340201 798919857 799341381 799397886 799316525
1909G99316525J55688M54426M67002J38223j33633J07049M07935K32696j11043j90139
$$ 799316525 799472213 799926639 800393641 800531864 800398231 800505280 800913215 801145911 801034868 800844729
1929.4H00844729R6559M27127L56496o020j17541J90735M27187K54213j12891k59995
$$ 800844729 800941288 801368415 801724911 801718891 801601350 801792085 802219272 802473485 802360594 802100599
1949.8H02100599L1411M41909M56393O8605j83821J9670M06503M52638N4717k58565
$$ 802100599 802132010 802573919 803030312 803098917 802915096 802934766 803341269 803793907 803848624 803590059
1970.2H03590059r0599K97606L98278R3878k21908j41263K25424L84748J29939j85013
$$ 803590059 803499460 803797066 804195344 804289222 804067314 803926051 804151475 804536223 804666162 804481149
1990.6H04481149j95742P5221K45512K0265k91705k39968Q6367K06888o8069m06504
$$ 804481149 804285407 804360628 804606140 804626405 804334700 804094732 804181099 804387987 804319918 803913414
2011H03913414l70323m709J49429j55389n05984m60208j23799O2645j21415m27007
$$ 803913414 803543091 803538382 803687811 803532422 803026438 802566230 802442431 802505076 802383661 801956654
2031.4H01956654m66824j85907M4048o8545l25859l57807q4698J53065N0008k37048
$$ 801956654 801489830 801303923 801347971 801279426 800953567 800595760 800511062 800664127 800714135 800477087
2051.8H00477087l00228l5524K30312J83761o9499j59621K3067K39908J99557o2406
$$ 800477087 800176859 800141335 800371647 800555408 800485909 800326288 800349355 800589263 800788820 800726414
2072.2H00726414j91033o855K36690K19226k8610j84715j2278K76148K71022K981j31429
$$ 800726414 800535381 800528526 800765216 800984442 800955832 800771117 800758839 801034987 801306009 801308990 801177561
2094.6H01177561J3471K39670K76447O7591j32143l7015K35260K83360O8605j20163
$$ 801177561 801191032 801430702 801707149 801774740 801642597 801605582 801840842 802124202 802192807 802072644
2115H02072644q9645R8467J96218N5552j38581j08063R2208J98245P7605j09791r5189
$$ 802072644 801982999 802081466 802277684 802333236 802194655 802086592 802178800 802377045 802454650 802344859 802249670
2137.5H02249670P9393J50562O1095o1989q1659N6029K07126J71184m887m7505J07229
$$ 802249670 802329063 802479625 802540720 802478731 802397072 802453101 802660227 802831411 802826524 802779019 802886248
2159.9H02886248K51352K39313J07288N9069K05814L66927L47435J81258Q3506J79112
$$ 802886248 803137600 803376913 803484201 803543270 803749084 804116011 804463446 804644704 804728210 804907322
2180.3H04907322L20315L24369J89304Q2135J56880L27229L54469J81556J8179O6698
$$ 804907322 805227637 805552006 805741310 805823445 805980325 806307554 806662023 806843579 806861758 806928456
2200.7H06928456K60711L34262J88888L8981P9513K47955L33607K02835Q34M77J75118
$$ 806928456 807189167 807523429 807712317 807751298 807830811 808078766 808412373 808615208 808616042 808616519 808791637
2223.1H08791637K78414J73509l7313p7426J03772K29835J25945o1989r6798N5671
$$ 808791637 809070051 809243560 809206247 809128821 809232593 809462428 809588373 809526384 809429586 809485257
2243.5H09485257J94311J46508k3186q4281O1214K11060J67429J133p6890O4790K41816
$$ 809485257 809679568 809826076 809802890 809718609 809779823 809990883 810158312 810159445 810082555 810147345 810389161
2265.9H10389161J22368j47104j93119k0623J45137R2805j33396k08377o0K43485K67208
$$ 810389161 810511529 810364425 810171306 810150683 810295820 810388625 810255229 810046852 810046792 810290277 810557485
2288.4H10557485R6917j5021J31190L65675L66211J80065J29879L38733O14345O78003
$$ 810557485 810654402 810639381 810770571 811136246 811502457 811682522 811812401 812151134 812765479 813443482
2308.8H13443482M85063K63631L07381O81996J004219Q83878N33759M89712P45118
$$ 813443482 813928545 814192176 814499557 815181553 816185772 817069650 817603409 818093121 818838239
2327.1H18838239P69019K41875k71618j25527K90274L83020m2379r63211k004743j756012
$$ 818838239 819607258 819849133 819577515 819451988 819742262 820125282 820082903 819119692 817114949 815358937
2347.5H15358937j15037J520216K193809J954675J414477N06759n36799j295209j709521
$$ 815358937 815243900 816764116 818957925 820912600 822327077 822833836 822297037 821001828 819292307
2365.9H19292307j925647k107561k307236k299130j963496j602412j484513j452565
$$ 819292307 817366660 815259099 812951863 810652733 808689237 807086825 805602312 804149747
2382.2H04149747j238465q20756m01974k31445l04222l85940l34084k00868j53243
$$ 804149747 802911282 802090526 801688552 801457107 801152885 800766945 800432861 800231993 800078750
2400.6H00078750k76804m32134m28259l08872k73645l73601m63367m25220l16441l08394
$$ 800078750 799801946 799369812 798941553 798632681 798359036 797985435 797522068 797096848 796780407 796472013
2421G96472013m38333n51223n34237m27544l87788m84883n86391n60939m42803l75509
$$ 796472013 796033680 795482457 794948220 794520676 794132888 793648005 793061614 792500675 792057872 791682363
2441.3G91682363m44472n68271n86569m88699m48167n37038o05881n44548m28558l94761
$$ 791682363 791237891 790669620 790083051 789594352 789146185 788609147 788003266 787458718 787030160 786635399
2461.7G86635399m75407n66423n59568m76360m40836n01395n59747n21719m24981l75271
$$ 786635399 786159992 785593569 785034001 784557641 784116805 783615410 783055663 782533944 782108963 781733692
2482.1G81733692m18842m98235n22912m56154l74973l89695m49121m40538l63112l11017
$$ 781733692 781314850 780816615 780293703 779837549 779462576 779072881 778623760 778183222 777820110 777509093
2502.5G77509093l53992m29332m46916l96907l53753l74496m16697m33921m19975l97741
$$ 777509093 777155101 776725769 776278853 775881946 775528193 775153697 774737000 774303079 773883104 773485363
2522.9G73485363m16637m66525n14865n34118m97996m75765m93645m99010n05567n17666
$$ 773485363 773068726 772602201 772087336 771553218 771055222 770579457 770085812 769586802 769081235 768563569
2543.3G68563569n13971n33462n80251n88119n37634m86970m90904n26368n47707n49496
$$ 768563569 768049598 767516136 766935885 766347766 765810132 765323162 764832258 764305890 763758183 763208687
2563.7G63208687n28812n21302n63145n73933n29647n35846n75602n63919n14865m73321
$$ 763208687 762679875 762158573 761595428 761021495 760491848 759956002 759380400 758816481 758301616 757828295
2584.1G57828295m66048n03779n48720n55754n38886n12540m91381n07176n43057n57960
$$ 757828295 757362247 756858468 756309748 755753994 755215108 754702568 754211187 753704011 753160954 752602994
2604.5G52602994n86330o30022o47187o79374p16984p15792p25269p74026q15511q22127
$$ 752602994 752016664 751386642 750739455 750060081 749343097 748627305 747902036 747128010 746312499 745490372
2624.9G45490372q20398q53539r14275r47297r19640q83281q92639r10938r18210r23514
$$ 745490372 744669974 743816435 742902160 741954863 741035223 740151942 739259303 738348365 737430155 736506641
2645.3G36506641r25243r15766q98599r31740r91166r66489q83937q54731q73565q88169
$$ 736506641 735581398 734665632 733767033 732835293 731844127 730877638 729993701 729138970 728265405 727377236
2665.7G27377236q72731q24452q11338q44002q26776p65443p42376p51674p64608p45476
$$ 727377236 726504505 725680053 724868715 724024713 723197937 722432494 721690118 720938444 720173836 719428360
2686.1G19428360o81102o41286o83189p58409p94470p79748p51317p61211q12411q52525
$$ 719428360 718747258 718105972 717422783 716664374 715869904 715090156 714338839 713577628 712765217 711912692
2706.5G11912692q36850q11338q57174r13501q86202q30412q32021q69870q48592p57634
$$ 711912692 711075842 710264504 709407330 708493829 707607627 706777215 705945194 705075324 704226732 703469098
2726.9G03469098p10905p09593p11978p40528p61032p37190o73294o41644o71447o70254
$$ 703469098 702758193 702048600 701336622 700596094 699835062 699097872 698424578 697782934 697111487 696441233
2747.3F96441233o40035o24239o24001o72579o99520o58572o29305o29843o33120o40691
$$ 696441233 695801198 695176959 694552958 693880379 693180859 692522287 691892982 691263139 690630019 689989328
2767.7F89989328o53147o62566p04526p89762q62181q81910q80898r19997r88126j026213
$$ 689989328 689336181 688673615 687969089 687179327 686317146 685435236 684554338 683634341 682646215 681620002
2788.1F81620002j012266r93371j042962j161337j263738j305222j335800j411438
$$ 681620002 680607736 679614365 678571403 677410066 676146328 674841106 673505306 672093868
2804.4F72093868j512825j575709j597523j662016j810670j969338k059996k114594
$$ 672093868 670581043 669005334 667407811 665745795 663935125 661965787 659905791 657791197
2820.7F57791197k228498k422571k635897k818763k976715l185392l535151m077494
$$ 657791197 655562699 653140128 650504231 647685468 644708753 641523361 637988210 633910716
2837F33910716m897356o072641p603586r336471j0753989j1084736r687841o522596
$$ 633910716 629013360 622940719 615337133 606000662 595246673 584161937 574474096 567951500
2853.3E67951500k447784J200617L377437L845334L015042J459837k55406j521230
$$ 567951500 565503716 566704333 570081770 573927104 576942146 578401983 578146577 576625347
2869.7E76625347j883566j594603j349092j409232j645387j949548k248466k477706
$$ 576625347 574741781 573147178 571798086 570388854 568743467 566793919 564545453 562067747
2886E62067747k627730k720416k758503k772808k859115l059268l309966l637969m148483
$$ 562067747 559440017 556719601 553961098 551188290 548329175 545269907 541959941 538321972 534173489
2904.3E34173489m848600n711794o712556p860064r061724r884000r835690q738995
$$ 534173489 529324889 523613095 516900539 509040475 499978751 490094751 480259061 471520066
2920.6D71520066o679296m009247j200616J447260L768742N746871P358313Q422255
$$ 471520066 464840770 460831523 459630907 461078167 464846909 470593780 477952093 486374348
2937D86374348Q842290Q713573Q138716P099808N675852M179001K974868K285838K172827
$$ 486374348 495216638 503930211 512068927 519168735 524844587 529023588 531998456 534284294 536457121
2955.3E36457121K602876L413915M383028N301297O013572O417453O482542O313681
$$ 536457121 539059997 542473912 546856940 552158237 558171809 564589262 571071804 577385485
2971.6E77385485N934298N351782M765928M268825L776967L290952K829611K362192
$$ 577385485 583319783 588671565 593437493 597706318 601483285 604774237 607603848 609966040
2987.9F09966040J916706J452148Q49962J71543n21422j235306j810968k124369k138615
$$ 609966040 611882746 613334894 614184856 614356399 613834977 612599671 610788703 608664334 606525719
3006.3F06525719j750707r70960o7949O24954R54390R50098O88255K56300k00093n94497
$$ 606525719 604775012 603804052 603736103 604361057 605315447 606265545 606953800 607210100 607010007 606415510
3026.7F06415510q95381j070499j192987j346111j485408j544952j570761j644850
$$ 606415510 605520129 604449630 603256643 601910532 600425124 598880172 597309411 595664561
3043E95664561j757801j835823j852393j857579j862287j850605j870096j913011j887500
$$ 595664561 593906760 592070937 590218544 588360965 586498678 584648073 582777977 580864966 578977466
3061.4E78977466j792074j719594j717507j751066j765549j713514j565516j482725
$$ 578977466 577185392 575465798 573748291 571997225 570231676 568518162 566952646 565469921
3077.7E65469921j608849j741707j740039j721203j721382j740396j792491j785695
$$ 565469921 563861072 562119365 560379326 558658123 556936741 555196345 553403854 551618159
3094E51618159j707018j687109j775503j871765j877427j803040j786948j897633j922846
$$ 551618159 549911141 548224032 546448529 544576764 542699337 540896297 539109349 537211716 535288870
3112.4E35288870j806080j795411j943827k119660k203405k132475k034963k046167
$$ 535288870 533482790 531687379 529743552 527623892 525420487 523288012 521253049 519206882
3128.7E19206882k114356k147853k117932k052486k052605k164424k232492k193630
$$ 519206882 517092526 514944673 512826741 510774255 508721650 506557226 504324734 502131104
3145E02131104k157002k132476k103418k138614k225966k228528k178460k159506k137184
$$ 502131104 499974102 497841626 495738208 493599594 491373628 489145100 486966640 484807134 482669950
3163.4D82669950k136052k159089k176821k208799k210707k143174k090335k078205
$$ 482669950 480533898 478374809 476197988 473989189 471778482 469635308 467544973 465466768
3179.7D65466768k079756k093613k084851k041131k030939k071619k040833j936466
$$ 465466768 463387012 461293399 459208548 457167417 455136478 453064859 451024026 449087560
3196D49087560j905620j935005j915217j875400j844317j814723j799702j792968j783579
$$ 449087560 447181940 445246935 443331718 441456318 439612001 437797278 435997576 434204608 432421029
3214.3D32421029j761943j745284j735807j721561j702666j674801j626670j557887
$$ 432421029 430659086 428913802 427177995 425456434 423753768 422078967 420452297 418894410
3230.7D18894410j548946j686603j814216j762360j656890j593352j567602j583487
$$ 418894410 417345464 415658861 413844645 412082285 410425395 408832043 407264441 405680954
3247D05680954j615494j642674j617462j553774j520425j503467j481444j466006j446426
$$ 405680954 404065460 402422786 400805324 399251550 397731125 396227658 394746214 393280208 391833782
3265.3C91833782j378387j285344j314342j423985j408279j297653j212567j162648
$$ 391833782 390455395 389170051 387855709 386431724 385023445 383725792 382513225 381350577
3281.6C81350577j168192j197725j140058j007944r55791j034051j114786j122087
$$ 381350577 380182385 378984660 377844602 376836658 375880867 374846816 373732030 372609943
3298C72609943j091361j011431q92252r12070j092583j208067j202255j157672j123070
$$ 372609943 371518582 370507151 369614899 368702829 367610246 366402179 365199924 364042252 362919182
3316.3C62919182j088679j054049j085371j156330j228541j270979j229823j197100
$$ 362919182 361830503 360776454 359691083 358534753 357306212 356035233 354805410 353608310
3332.6C53608310j220435j200944j201331j304508j379758j375913j315773j219124
$$ 353608310 352387875 351186931 349985600 348681092 347301334 345925421 344609648 343390524
3348.9C43390524j250326j402647j465708j394599j321316j322448j318902j250833
$$ 343390524 342140198 340737551 339271843 337877244 336555928 335233480 333914578 332663745
3365.3C32663745j199454j263380j400561j407355j252442j143128j110166j071215
$$ 332663745 331464291 330200911 328800350 327392995 326140553 324997425 323887259 322816044
3381.6C22816044r86457q80956p57635n73546n58942p72626q11547n62757l86476n30482
$$ 322816044 321829587 320948631 320190996 319617450 319058508 318285882 317474335 316911578 316525102 315994620
3402C15994620p34985o37769m09216k82764k29657k65509l03030k03848j01358o6489
$$ 315994620 315259635 314621866 314212650 313929886 313700229 313434720 313131690 312927842 312826484 312759995
3422.4C12759995N2214K24531L47256L92586M69059N94348N25057L42936M00930O49095
$$ 312759995 312812209 313036740 313383996 313776582 314245641 314839989 315365046 315707982 316108912 316758007
3442.8C16758007Q29071Q83847Q53330Q80986J027227J177668J261592J308233J273483
$$ 316758007 317587078 318470925 319324255 320205241 321232468 322410136 323671728 324979961 326253444
3461.1C26253444J256078J458288J667410J534581J226574J218021J468033J696974
$$ 326253444 327509522 328967810 330635220 332169801 333396375 334614396 336082429 337779403
3477.4C37779403J762897J632720J570314J704663J756221J701444J766801J863420
$$ 337779403 339542300 341175020 342745334 344449997 346206218 347907662 349674463 351537883
3493.8C51537883J899958J908362J970112K041012J924724J808613J931638K072900
$$ 351537883 353437841 355346203 357316315 359357327 361282051 363090664 365022302 367095202
3510.1C67095202K132535K151907K127617K205849K375960K502650K425135K241432
$$ 367095202 369227737 371379644 373507261 375713110 378089070 380591720 383016855 385258287
3526.4C85258287K229482K384544K576291K749205K741068K606541K758920L084183
$$ 385258287 387487769 389872313 392448604 395197809 397938877 400545418 403304338 406388521
3542.7D06388521L148467K902060K818167L012121L089309L092349L277510L545374
$$ 406388521 409536988 412439048 415257215 418269336 421358645 424450994 427728504 431273878
3559D31273878L684252L724873L800065L848761L720283L693074L900826M129142M257351
$$ 431273878 434958130 438683003 442483068 446331829 450052112 453745186 457646012 461775154 466032505
3577.4D66032505M381865M527569M600704M648119M597724M457771M465878M617095
$$ 466032505 470414370 474941939 479542643 484190762 488788486 493246257 497712135 502329230
3593.7E02329230M681349M737079M834831M770815M666567M682660M729390M701257
$$ 502329230 507010579 511747658 516582489 521353304 526019871 530702531 535431921 540133178
3610E40133178M710555M734338M689455M730224M700899M374028M215181M452168M660726
$$ 540133178 544843733 549578071 554267526 558997750 563698649 568072677 572287858 576740026 581400752
3628.4E81400752M232943L727257L743232L823220L809631L787518L811121L962397
$$ 581400752 585633695 589360952 593104184 596927404 600737035 604524553 608335674 612298071
3644.7F12298071M188002M139602L382563K755940K909899L204703L089726K813757
$$ 612298071 616486073 620625675 624008238 626764178 629674077 632878780 635968506 638782263
3661F38782263K687096K801299L007114L033340K762318K570331K341509J776576J601338
$$ 638782263 641469359 644270658 647277772 650311112 653073430 655643761 657985270 659761846 661363184
3679.4F61363184J789928K049684K444804K752304K291084J383185J154304J390159
$$ 661363184 663153112 665202796 667647600 670399904 672690988 674074173 675228477 676618636
3695.7F76618636J584947J654446J538575J294493J276016J447022J441598R47237
$$ 676618636 678203583 679858029 681396604 682691097 683967113 685414135 686855733 687802970
3712F87802970N84901Q47757J185774J299441J222611J046002Q46207Q44478J134634
$$ 687802970 688387871 689235628 690421402 691720843 692943454 693989456 694835663 695680141 696814775
3730.3F96814775J443744J217365M56453J01208M79877J004339R55462O15180O98387
$$ 696814775 698258519 699475884 699932337 700033545 700513422 701517761 702473223 703088403 703786790
3748.7G03786790N31733Q7262K38657O04212N74767L60609M68552O61671O73890N59032
$$ 703786790 704318523 704405785 704644442 705248654 705823421 706184030 706652582 707314253 707988143 708547175
3769.1G08547175L20256K64108N13196P79390O75976L23892K90036M10915M04179M03285
$$ 708547175 708867431 709131539 709644735 710424125 711100101 711423993 711714029 712124944 712529123 712932408
3789.5G12932408M71711O07550O69778O70909P54297N18680K11239K78473J48415N245
$$ 712932408 713404119 714011669 714681447 715352356 716106653 716625333 716836572 717115045 717263460 717268705
3809.9G17268705L11673P15673P06673N64933N19454O3479j08004J70589K90274L81470
$$ 717268705 717580378 718296051 719002724 719567657 720087111 720150590 720042586 720213175 720503449 720884919
3830.3G20884919M98176O44624O35743K35498o2644o8128m7267Q6546M55976Q98599
$$ 720884919 721383095 722027719 722663462 722898960 722836316 722768188 722720921 722807467 723263443 724162042
3850.7G24162042P55668k07722m48048Q225L92139M64559K01880J70887L54409J99735
$$ 724162042 724917710 724709988 724261940 724270165 724662304 725126863 725328743 725499630 725854039 726053774
3871.1G26053774j5556m1366J34408L51489K71559K19464J55985j4662J30057J59442
$$ 726053774 726038218 725996852 726131260 726482749 726754308 726973772 727129757 727115095 727245152 727404594
3891.5G27404594j11341l0220L76106N82039L81351n2154l86417l63589j12295R2328
$$ 727404594 727293253 727263033 727639139 728221178 728602529 728550375 728163958 727800369 727688074 727780402
3911.9G27780402J96516K68579K24650J02222P9214M8518m9948M2975K49683J99974
$$ 727780402 727976918 728245497 728470147 728572369 728651583 728700101 728650153 728693128 728942811 729142785
3932.3G29142785l6478j37746n1797J00196J36375O2108O4433P1645K8848O2466J11043
$$ 729142785 729106307 728968561 728916764 729016960 729153335 729215443 729279876 729351521 729380369 729442835 729553878
3954.7G29553878P7844M9651O2167M8101K2471J6034L6478Q8513J11639N0962l636
$$ 729553878 729631722 729681373 729743540 729791641 729814112 729830146 729866624 729955137 730066776 730117738 730114102
3977.1G30114102K6644J13427J59800N5909l1590M1068J09791J04368P1943J8656
$$ 730114102 730140746 730254173 730413973 730469882 730438292 730479360 730589151 730693519 730765462 730784118
3997.5G30784118
$$ 730784118
##END=$$ End of the data block
