##TITLE=4 e-com $$ Begin of the data block
##JCAMP-DX=5.00 $$ ACD/SpecManager v 10.08
##SPECTROMETER/DATA SYSTEM=Alpha
##DATE=16 Oct 2013 13:51:24
##DATA TYPE=INFRARED SPECTRUM
##DATA CLASS=XYDATA
##ORIGIN=
##OWNER=
##NPOINTS=1765
##FIRSTX=399.75695801
##LASTX=3997.56933594
##MAXX=3997.56933594
##MINX=399.75695801
##MAXY=0.82358384
##MINY=0.31322894
##XFACTOR=1.0000000000
##YFACTOR=1.000000000000000e-9
##FIRSTY=0.60180783
##DELTAX=2.03957629
##XUNITS=1/CM
##YUNITS=ARBITRARY UNITS
##XYDATA=(X++(Y..Y))
399.8F01807833j528740l430069l895700r23693K388477K038181p50601j700938K70129
418.1E94274879J600980o87003l360867l193260n98847M88460j497269l486455k578735
436.5E80961883M86314K455771J595199p5101M85062K640903L072024O29127j566053
454.8E90685129j034677O41287M22120k055765l763675k562225n23091p02857k927721
473.2E78178525m012108k401829j75714R9122j424849k248585r88483N46217M2498
491.5E67614794k048552l035188j750469k43843q14080k828240l671587k658486j651049
509.9E48913300k307713l851950m242301l019810j909673k125561k779782k513528
526.2E26162982p83920J047432J339197P41422J251579L308654M772305L731430J266122
$$ plain form
399.8 601807833 600279093 596849024 592953324 592029631 594418108 596456289 595705688 594004750 594274879
418.1 594274879 595875859 595188856 591827989 588634729 588035882 588524342 587027073 583540618 580961883
436.5 580961883 581448197 583903968 585499167 585424066 585909128 588550031 591622055 592251182 590685129
454.8 590685129 589650452 590291739 590713859 588658094 584894419 582332194 581809103 581106246 578178525
473.2 578178525 574166417 571764588 571588874 571687996 570263147 568014562 567026079 567572296 567614794
491.5 567614794 565566242 562531054 560780585 560536742 559722662 556894422 553222835 550564349 548913300
509.9 548913300 546605587 542753637 538511336 535491526 533581853 531456292 528676510 526162982
526.2 526162982 525379062 526426494 527765691 528507113 529758692 533067346 537839651 541571081 542837203
544.6E42837203p5162M41015J042604N3048j823127k607226j872599j253903k203942
562.9E34537911m124283n278290m738688l348649k600074k303063q63314K023816M564881
581.3E17870247N129576M086912L296315L479004L447473K065778m828r09090p6771
599.6E38384616J036048Q34525m68493r90331K81573J827240J938402J031101Q79169
618E44753850K284348L892719M023195K681553J796186K620637L671587L009736J268030
636.3E70001841N61952J597643K866387K575994J032829K26081J105606K163708J625717
654.7E83757758j2696p78734J76072J496732J802981J363218N2273Q3506J644135K027273
675.1E91612518P98523J33753J183152K349258J833379J01984q18730n1617Q46326
$$ plain form
544.6 542837203 542762041 543203056 544245660 544298708 542475581 539868355 537995756 536741853 534537911
562.9 534537911 530413628 525135338 520396650 517048001 514447927 512144864 511281550 513305366 517870247
581.3 517870247 522999823 527086735 530383050 533862054 537309527 539375305 539370477 538461387 538384616
599.6 538384616 539420664 540255189 539786696 538796365 539077938 540905178 542843580 543874681 544753850
618 544753850 547038198 550930917 554954112 557635665 559431851 562052488 565724075 568733811 570001841
636.3 570001841 570563793 572161436 575027823 577603817 578636646 578862727 579968333 582132041 583757758
654.7 583757758 583745062 582966328 583142400 584639132 586442113 587805331 587857604 587941110 589585245 591612518
675.1 591612518 592411041 592544794 593727946 596077204 597910583 598012567 597193837 597142220 597988546
693.5E97988546Q2374j794398k600134j589954k62498j73748r33349p96378R51886
711.8E90872347K943397L458381K677738K423168L683507N227745N336940L951251
728.1F20574474K880276L337681M135966L558755J807928O20365Q74102J491964P19428
746.5F40000939j336753k663732k250254j438796j816035l047823l406406j930416
762.8F22110724L09170J647591J970470K560258M138649N875766O171942M739761L386259
781.2F52910590L532946M325390M092276K682984J528025J917004L285885L802955
797.5F78078055K964497K142072K363205K963483K678871J306176M7982P510Q10266
815.8F93362117R84847m2438j184523j331747p81298q60393k028644l165424l195464
$$ plain form
693.5 597988546 598070920 596276522 593676388 592086434 591823936 591650188 590716839 589920461 590872347
711.8 590872347 593815744 597274125 599951863 602375031 606058538 611286283 616623223 620574474
728.1 620574474 623454750 626792431 630928397 634487152 636295080 636915445 637789547 639281511 640000939
746.5 640000939 638664186 636000454 633750200 632311404 630495369 627447546 624041140 622110724
762.8 622110724 622419894 624067485 626037955 628598213 632736862 638612628 644784570 649524331 652910590
781.2 652910590 656443536 660768926 664861202 667544186 669072211 670989215 674275100 678078055
797.5 678078055 681042552 683184624 685547829 688511312 691190183 692496359 692544341 692551851 693362117
815.8 693362117 694346964 694304526 693120003 691788256 691006958 690146565 688117921 684952497 681757033
834.2F81757033k503276k303302k973914l539980l049552j866520j209318j668394
850.5F62642777k458572k473474j756191j020611k48730J222313L691494O416559P956863
868.9F73972428P565677O002665M551649L610432K516329N38588j836598l269375l370404
887.2F90281391l082454l414035m192650m304826l429950k604186k818227l866613
903.5F62568450m690707m764139m717112n349696o478548o987929o267667m967570
919.8F18345082l921628l224313k394557j147390Q8751O72341O39021Q12114J769065
938.2F11638486K996803L435909K550960P81715r87887k538741m377782o444514p891357
956.6E99163592q377552q524656r213090j0596633j1903227j2632668j3262510j4411449
$$ plain form
834.2 681757033 679253757 676950455 673976541 670436561 667387009 665520489 664311171 662642777
850.5 662642777 660184205 657710731 655954540 654933929 654685199 655907512 659599006 666015565 673972428
868.9 673972428 681538105 687540770 692092419 695702851 698219180 698757768 696921170 693651795 690281391
887.2 690281391 687198937 683784902 679592252 675287426 671857476 669253290 666435063 662568450
903.5 662568450 657877743 653113604 648396492 643046796 636568248 629580319 623312652 618345082
919.8 618345082 614423454 611199141 608804584 607657194 607745945 608418286 609057307 609869421 611638486
938.2 611638486 614635289 618071198 620622158 621403873 620415986 617877245 613499463 607054949 599163592
956.6 599163592 590786040 582261384 573048294 562451661 550548434 537915766 524653256 510241807
972.9E10241807j5965671j7219007j7703831j7601311j7258942j6686619j5531659
987.1C92274767j3605416j1290550r152025p411450n904377m411160l068775k329797
1003.5C35101217k438843l051669l536939l606618l302604k697438j776695m66198
1019.8C14224213J160264K717406L806859M383236M610032M558116M054696K905756
1036.1C42420578J421839M15623K85357O58513J070886J570762K612412M357725O282389
1054.5C61096084P693142Q462399Q960784R305208Q688897N887747O66320n370855
1070.8D05389726r599715j0351599q046358m425228p76708K547979N254179O905020
1087.1C86897296P482707P363677O849706N880684M249960K279192Q63851O96212J598447
$$ plain form
972.9 510241807 494276136 477057129 459353298 441751987 424493045 407806426 392274767
987.1 392274767 378669351 367378801 358226776 350815326 344910949 340499789 337431014 335101217
1003.5 335101217 332662374 329610705 326073766 322467148 319164544 316467106 314690411 314224213
1019.8 314224213 315384477 318101883 321908742 326291978 330902010 335460126 339514822 342420578
1036.1 342420578 343842417 344258040 344543397 345201910 346272796 347843558 350455970 354813695 361096084
1054.5 361096084 368789226 377251625 386212409 395517617 404206514 410094261 410760581 405389726
1070.8 405389726 395790011 385438412 377392054 372966826 372190118 374738097 379992276 386897296
1087.1 386897296 394380003 401743680 408593386 414474070 418724030 421003222 421867073 422563285 424161732
1105.4D24161732K744258L427416L607630L684074L729314L382087K598583J959056
1121.8D49294150J994908K661258L333777L351748K597123J338631k46793k228468
1138.1D62096334m449755o220550o891072o513387n657821m712046l482967j592636
1154.4D22576100Q46445L305942N412012P288039R308189J1402190J2925118J3414174
1170.7D86478209J3096810J2574196J2162745J1599362J0434508Q740485P237374O332934
1187E68656623N503953M153013K520442J401961J129508J198590J017689O91653Q32855
1205.4E87106287J622677K457619K593219K024949J449227J230955R50814J04069j142382
1223.7E98397434k034307k105295j798630j802504k106846k084851j391649m55976
$$ plain form
1105.4 424161732 426905990 430333406 433941036 437625110 441354424 444736511 447335094 449294150
1121.8 449294150 451289058 453950316 457284093 460635841 463232964 464571595 464324802 462096334
1138.1 462096334 457646579 451426029 444534957 438021570 432363749 427651703 424168736 422576100
1154.4 422576100 423422545 426728487 432140499 439428538 448736727 460138917 473064035 486478209
1170.7 486478209 499575019 512149215 524311960 535911322 546345830 555086315 562323689 568656623
1187 568656623 574160576 578313589 580834031 582235992 583365500 584564090 585581779 586273432 587106287
1205.4 587106287 588728964 591186583 593779802 595804751 597253978 598484933 599435747 599539816 598397434
1223.7 598397434 596363127 594257832 592459202 590656698 588549852 586465001 585073352 584617376
1240.1E84617376R0361K19405M90605J224936K007484K170980J677513J217127J316369
1258.4E95032156J678407J677811J288533J080275J401722J850724J726985R65119
1274.7F06701732K82645K45452O40988Q36373N53667J63674Q5712K10404K6584o70612
1295.1F09076619j306653j238942o71744l45409o34671j098573j080096o77406n52714
1313.5F01470411r45449j408041j456439j168490j173436j816571k582371k726197
1329.8E88193417k220869j662732j425981j331210r66847k22504L32534J76489l57568
1348.1E80514729n93960m33445l92974q19385j328587j412928j250983j221776j289606
1366.5E71771085j344323j050174m78506m03285q34286r97961p51793j90020O17087
$$ plain form
1240.1 584617376 584707737 584927142 585417747 586642683 588650167 590821147 592498660 593715787 595032156
1258.4 595032156 596710563 598388374 599676907 600757182 602158904 604009628 605736613 606701732
1274.7 606701732 606984377 607229829 607870817 608707190 609260857 609424531 609510243 609720647 609747231 609076619
1295.1 609076619 607769966 606531024 605859280 605513871 604879200 603780627 602700531 602023125 601470411
1313.5 601470411 600524962 599116921 597660482 596491992 595318556 593501985 590919614 588193417
1329.8 588193417 585972548 584309816 582883835 581552625 580585778 580363274 580695808 580872297 580514729
1348.1 580514729 579920769 579487324 579094350 578274965 576946378 575533450 574282467 573060691 571771085
1366.5 571771085 570426762 569376588 568898082 568494797 567660511 566662550 565910757 565720737 566337824
1384.9E66337824R96232M67718k7776l0220j76430n98669j017212r14634k03848K50996
1405.3E65083981M3749l94344n88000j87099O70552J238943J000404P94351J363158
1423.6E69025695J812578J636982R82642L72827N25534Q08775K81394k20597q0526
1442E75145304K81930N65529J56105q27849j371563r14573R954M11927P15733J696229
1462.4E75868726L154695M872262O949187R536445J1544227J0445536Q307278P129967
1478.7F37808323O007850M787624L906667L544390K644062O72877n95271o46651q34406
1497F57295465j483500j858055j625121j679420l491104m614591m354954m218817l571689
1515.4F30398214k372980j215697j328170k250910k467572k348066j823783j498282
$$ plain form
1384.9 566337824 567334056 567801774 567773998 567743778 567567348 566968679 565951467 565036833 564832985 565083981
1405.3 565083981 565127730 564733386 564145386 563958287 564628839 565867782 566868186 567662537 569025695
1423.6 569025695 570838273 572475255 573457897 573830724 574356258 575165033 575446427 575225830 575145304
1442 575145304 575427234 575992763 576148868 575321019 573949456 573034883 573044837 573456764 574172497 575868726
1462.4 575868726 579023421 583895683 590844870 600381315 611925542 622371078 630678356 637808323
1478.7 637808323 643816173 648603797 652510464 656054854 658698916 659371793 658776522 658129871 657295465
1497 657295465 655811965 653953910 652328789 650649369 647158265 642543674 638188720 633969903 630398214
1515.4 630398214 628025234 626809537 625481367 623230457 620762885 618414819 616591036 615092754
1531.7F15092754k118230j982510o30080k55347j394152j756013j163244p5638Q46803
1550.1F06564343J175463J280129J706779K060235O98805k28703P8678L62098O71685
1568.4F14369512O28292M46797N08666j6094m28736M0353J90615k54392p03574p82668
1588.8F13998771p70569j075864j831770k518475k706528k771258l226817l994524
1605.1E95102966m655183n125105n185246m875839n419076o977439o291210n124033
1621.4E51449835n915820o768406p073462p035851n756736m756808n635202n476356
1637.8E03031194l356576j451224j0162N30839K53230O40601J672029J771331J240313
1656.1E04321575J755178K783001L808677M320621M364491M802227N095184M921555
$$ plain form
1531.7 615092754 612974524 610992014 610361934 610106587 608712435 606956422 605793178 605717540 606564343
1550.1 606564343 607739806 609019935 610726714 612786949 613485754 613257051 613335729 613697827 614369512
1568.4 614369512 614997804 615444601 615953267 615937173 615508437 615548790 615739405 615485013 614781439 613998771
1588.8 613998771 613228202 612152338 610320568 607802093 605095565 602324307 599097490 595102966
1605.1 595102966 590447783 585322678 580137432 575261593 569842517 562865078 556573868 551449835
1621.4 551449835 545534015 538765609 531692147 524656296 518899560 514142752 508507550 503031194
1637.8 503031194 499674618 498223394 498213232 498744071 498997301 499637902 501309931 503081262 504321575
1656.1 504321575 506076753 508859754 512668431 516989052 521353543 526155770 531250954 536172509
1672.4E36172509N510986N838692N302310N369604O381452P325530O128013N319059
1688.8E83348155N880654O559789Q228362R154975Q213103P430136N807757N133212
1705.1F39756143M776657L642559L245890L755689M559874M594088L111005J948535
1721.4F69390440J729727J472950Q22663p0810r74238k396107l548741l078819l079891
1739.7F60267174k845645q70108K156973N411207Q213520R735287R946942J0504842
1756.1G02520192J0413646Q791209P160961N587817M925251M863917M196704K980411
1772.4G51440108J927614J933754K377212K185285J504242J224041J490712J944483
1788.7G66027451J978516J218796O09696J050651J607358J378358O77883M73321R60410
$$ plain form
1672.4 536172509 541683495 547522187 552824497 558194101 564575553 571901083 578029096 583348155
1688.8 583348155 589228809 595788598 604016960 613171935 621385038 628815174 634622931 639756143
1705.1 639756143 644532800 648175359 651421249 655176938 659736812 664330900 667441905 669390440
1721.4 669390440 671120167 672593117 673415780 673344970 672370732 669974625 666425884 663347065 660267174
1739.7 660267174 657421529 656551421 658708394 664119601 672333121 682068408 692015350 702520192
1756.1 702520192 712933838 721725047 728886008 734473825 739399076 744262993 748459697 751440108
1772.4 751440108 753367722 755301476 757678688 759863973 761368215 762592256 764082968 766027451
1788.7 766027451 768005967 769224763 769834459 770885110 772492468 773870826 774548709 775022030 775982440
1807G75982440J449704J276791O25670M01318P55310J161277J195193Q96811N86212
1825.4G84330726P33912J048863P26044K49505J90198M58539R05871J181901P41481
1843.8G90567040p2419l1710N06759O57737L47376O3777K05576N98491P11858N04374
1864.2G94058859L54767L20137K85148L01183K24053K504P8976M97699P17044M75049
1884.6G97315419J78039J87933L81887N34058L51846n5850p9393L30150N91755M04775
1904.9H00140619K1994j10387J68502M90844M62473R3400j65462J14619M45426K59816
1925.3H01921844j06751j84298J03652M29035L53336n186j07109J83046M09603K62916
1945.7H03260088j04427k69711L4511M53233M61877Q3089j73092J7583M08054M40537
$$ plain form
1807 775982440 777432144 778708935 779334605 779735923 780491233 781652510 782847703 783744514 784330726
1825.4 784330726 785064638 786113501 786839545 787089050 787279248 787737787 788643658 789825559 790567040
1843.8 790567040 790494621 790462911 790969670 791627407 791974783 792038560 792244136 792842627 793554485 794058859
1864.2 794058859 794413626 794733763 795018911 795320094 795544147 795546651 795625627 796123326 796840370 797315419
1884.6 797315419 797493458 797681391 798063278 798597336 798949182 798893332 798813939 799144089 799735844 800140619
1904.9 800140619 800162613 800052226 800220728 800711572 801174045 801267445 801101983 801216602 801662028 801921844
1925.3 801921844 801815093 801630795 801734447 802163482 802516818 802511632 802404523 802587569 802997172 803260088
1945.7 803260088 803155661 802885950 802920461 803373694 803835571 803918660 803745568 803763151 804171205 804611742
1966.1H04611742K3664k67983o7651L14653L90827Q1301k15411j13130K46108L82781
1986.5H05386901J10149k07245j88410J02400K55704J2398l05354k66672N2870K06291
2006.9H05159032m0531l81708l57032k1636J25766j46509m77671m35651j21712M1783
2027.3H03344131j44780m33743m55022j82033L7969o5268l20017l53277r0658J30474
2047.7H01467776L1829k21193k48253q285K05815J56998p0929j45435L9339K28583
2068.1H01436245J77622m9829j70171j4902K14577K13444j1384j56999p748K59220
2088.5H01890075K89202L3259j51932j4126K53200K80738N7399j12235j7703K20478
2108.9H02728355K58565O0081j11162q2553R9063K00093O3419j15156p5579J05322
$$ plain form
1966.1 804611742 804635406 804367423 804299772 804614425 805005252 805086553 804871142 804758012 805004120 805386901
1986.5 805386901 805497050 805289805 805101395 805203795 805459499 805471897 805166543 804899871 804952741 805159032
2006.9 805159032 805118501 804736793 804379761 804358125 804483891 804337382 803859711 803424060 803302348 803344131
2027.3 803344131 803199351 802765608 802310586 802128553 802166522 802101254 801781237 801427960 801337302 801467776
2047.7 801467776 801499605 801278412 801030159 801021874 801227689 801384687 801313758 801168323 801207662 801436245
2068.1 801436245 801613867 801564038 801393867 801378965 801593542 801806986 801795602 801638603 801630855 801890075
2088.5 801890075 802179277 802212536 802060604 802046478 802299678 802580416 802637815 802525580 802507877 802728355
2108.9 802728355 802986920 803047001 802935839 802853286 802952349 803152442 803215861 803100705 803025126 803130448
2129.3H03130448J81496N2571j15215j03415N2870J45793Q3804n2691p1585R5368K20000
2151.7H03619444J40608j5855m2379R8944K51889K44677R7752L6001J87695L80099
2172.1H04998875L87311K16424R0301J59919L04282L35276J96815O0618J29282L13461
2192.5H07192564L51191J73986J7583P5996K66373L42906K05159O3002J13785K71797
2212.9H09074342L19600J85788L58j5080J66952K94209J76608m6372q0287R2327K19941
2235.4H10388386J40667l7551p6711O9857J79469R2328l6061j2994J21236K04146J35720
2257.8H11168492j5080p1883N4240J99437J03235j27256j57833K9326J66714N4240
2278.2H11403632j74045k08497J6689K60711K83122J06871l2783O8426L10243L76880
$$ plain form
2129.3 803130448 803311944 803364515 803249300 803145885 803198755 803344548 803428352 803375661 803304076 803399444 803619444
2151.7 803619444 803760052 803744197 803701818 803800762 804052651 804297328 804395080 804431081 804618776 804998875
2172.1 804998875 805386186 805602610 805692911 805852830 806157112 806492388 806689203 806749821 806879103 807192564
2192.5 807192564 807543755 807717741 807735324 807811320 808077693 808420599 808625758 808688760 808802545 809074342
2212.9 809074342 809393942 809579730 809580088 809565008 809731960 810026169 810202777 810156405 810076118 810168445 810388386
2235.4 810388386 810529053 810491502 810414791 810484648 810664117 810756445 810720384 810707390 810828626 811032772 811168492
2257.8 811168492 811153412 811081529 811135769 811335206 811438441 811311185 811153352 811182678 811349392 811403632
2278.2 811403632 811229587 811021090 811037779 811298490 811581612 811688483 811655700 811724126 812034369 812411249
2298.6H12411249K02834J03414L14892O41048P21573M81725K24650K89440O46651R35972
2319H16973448Q59439N32866M48405O96838P37429K60592k21193j49966K05934L50237
2339.4H20694029N126q74877j887023j676023j15037J463711K107740J922190J459241
2357.7H23099077M84764o24180j305818j631677j844585k092064k272725k201616j931549
2376.1H09679627j639545j484811j421034j235366q38041l99232k10703k95520l93152
2394.4H01762223l34561j81853j36257k94447m72903m48942l05653k62618l54469m31835
2414.8G98538685l96133l32236l48031m38393n12003n03600m54545m58241n15699n52177
2435.2G94027627n30720m62890m07696m41849n42700n83649n15103m63605n06044n57720
$$ plain form
2298.6 812411249 812614083 812717497 813032389 813673437 814395010 814876735 815101385 815390825 816037476 816973448
2319 816973448 817832887 818365753 818814158 819510996 820248425 820509017 820287824 820137858 820343792 820694029
2339.4 820694029 820699155 819824278 817937255 816261232 816146195 817609906 819717646 821639836 823099077
2357.7 823099077 823583841 822959661 821653843 820022166 818177581 816085517 813812792 811611176 809679627
2376.1 809679627 808040082 806555271 805134237 803898871 803060830 802661598 802450895 802155375 801762223
2394.4 801762223 801427662 801245809 801109552 800815105 800342202 799893260 799587607 799324989 798970520 798538685
2414.8 798538685 798142552 797810316 797462285 797023892 796511889 796008289 795553744 795095503 794579804 794027627
2435.2 794027627 793496907 793034017 792626321 792184472 791641772 791058123 790543020 790079415 789573371 789015651
2455.6G89015651n40555m61280l99828m31657n43117n95689n14210m40597m63307n25117
2476G84100294n29468m57525l99053m00544m72962n46873m97282l89277l69728m15862
2496.4G79621720m36544m01616l53575l54707m00424m22538l87311l62217l88622m17412
2516.8G75696754m06861l87192m03940m40419m70400m98354n09501n05090n18322n23805
2537.2G71032870n07474m99487n02348n13256n22017n41210n64993n57661n29587n27263
2557.6G65767574n54740n53012n28872n20051n13255n26250n59091n56350n35607n47767
2578G60372579n50687n24938n05329n07175n22912n32389n33402n32627n19216m90963
2598.4G55152941m96388n45442n68092n68628n87404o33001o96778p28488p15614p16746
$$ plain form
2455.6 789015651 788475096 788013816 787613988 787182331 786639214 786043525 785529315 785088718 784625411 784100294
2476 784100294 783570826 783113301 782714248 782313704 781840742 781293869 780796587 780407310 780037582 779621720
2496.4 779621720 779185176 778783560 778429985 778075278 777674854 777252316 776865005 776502788 776114166 775696754
2516.8 775696754 775289893 774902701 774498761 774058342 773587942 773089588 772580087 772074997 771556675 771032870
2537.2 771032870 770525396 770025909 769523561 769010305 768488288 767947078 767382085 766824424 766294837 765767574
2557.6 765767574 765212834 764659822 764130950 763610899 763097644 762571394 762012303 761455953 760920346 760372579
2578 760372579 759821892 759296954 758791625 758284450 757761538 757229149 756695747 756163120 755643904 755152941
2598.4 755152941 754656553 754111111 753543019 752974391 752386987 751753986 751057208 750328720 749613106 748896360
2618.8G48896360p66515q26002q39710q26955q48233r11951r67920r51052q94189q80241
2639.2G40183592r04739r15885r14693r14812q97467q94487r47356r94742r46045q69989
2659.6G30983377q77023q99673q82625q74222q50439p99715p95543q06809p67887p38203
2680G22691238p67231p82430p31588o82830o61672o90996p67112p80463p44880p60018
2700.4G15322018p97451q22544q39233q21174q01622q34048r00269r16898q59141q26300
2720.8G06903338q59975q79348q12590p25746o90103o78598o99759p54237p54833o87659
2741.2F99360490o60241o73413o46770o19114o28888o61135o89685o77824o44922o04690
2761.6F92853808n95390o62387p16328o87123o47604o88970p85828q55625q71479q73149
$$ plain form
2618.8 748896360 748129845 747303843 746464133 745637178 744788945 743876994 742909074 741958022 741063833 740183592
2639.2 740183592 739278853 738362968 737448275 736533463 735635996 734741509 733794153 732799411 731853366 730983377
2659.6 730983377 730106354 729206681 728324056 727449834 726599395 725799680 725004137 724197328 723429441 722691238
2680 722691238 721924007 721141577 720409989 719727159 719065487 718374491 717607379 716826916 716082036 715322018
2700.4 715322018 714524567 713702023 712862790 712041616 711239994 710405946 709505677 708588779 707729638 706903338
2720.8 706903338 706043363 705164015 704351425 703625679 702935576 702256978 701557219 700802982 700048149 699360490
2741.2 699360490 698700249 698026836 697380066 696760952 696132064 695470929 694781244 694103420 693458498 692853808
2761.6 692853808 692258418 691596031 690879703 690192580 689544976 688856006 688070178 687214553 686343074 685469925
2782F85469925r19461r88126j006424r90987j018107j108289j207172j249791j261294
2800.3F75720274j323103j430095j520574j558006j570522j648009j803220j950681
2816.6F62916064k052247k142310k251983k408564k607107k794028k961814l167391
2832.9F42530620l519475m096866m942119o126106p646978r338856j0734379j1081636
2849.3E85044205r708047o545365k455830J195490L380358L855765L002763J408279
2865.6E79177618l03328j509011j871526j619101j334011j361370j626194j953244
2881.9E67599833k254426k493263k643108k731264k790153k803206k852857l040612
2898.2E45990944l310919l648758m123509m787683n698979o776333p916689r073913
$$ plain form
2782 685469925 684550464 683562338 682555914 681564927 680546820 679438531 678231359 676981568 675720274
2800.3 675720274 674397171 672967076 671446502 669888496 668317974 666669965 664866745 662916064
2816.6 662916064 660863817 658721507 656469524 654060960 651453853 648659825 645698011 642530620
2832.9 642530620 639011145 634914279 629972160 623846054 616199076 606860220 596125841 585044205
2849.3 585044205 575336158 568790793 566334963 567530453 570910811 574766576 577769339 579177618
2865.6 579177618 578874290 577365279 575493753 573874652 572540641 571179271 569553077 567599833
2881.9 567599833 565345407 562852144 560209036 557477772 554687619 551884413 549031556 545990944
2898.2 545990944 542680025 539031267 534907758 530120075 524421096 517644763 509728074 500654161
2914.5E00654161r886205r828300q711576o665379m033565j230687J439869L790021
2930.8D65528339N784840P367193Q415103Q868337Q737981Q116007P060051N646229
2947.2E25524080M177272L037036K363860K198935K604127L431022M393995N291283
2963.5E53021610O021082O455720O537735O351590N926132N334795M778028M279851
2979.8E98706543L745378L258585K850831K404869J928329J426220Q29935K14398m48585
2998.1F14916503j197636j792490k135039k187073j767218r49919o1631O45816J006305
3016.5F06477618R78768O87957K61962j81377n90503r19223j099407j197338j321733
3034.9F03096724j464785j529991j552165j639783j760841j833379j868486j900018
$$ plain form
2914.5 500654161 490767956 480939656 472228080 465562701 461529136 460298449 461738318 465528339
2930.8 465528339 471313179 478680372 487095475 495963812 504701793 512817800 519877851 525524080
2947.2 525524080 529701352 532738388 535102248 537301183 539905310 543336332 547730327 553021610
2963.5 553021610 559042692 565498412 572036147 578387737 584313869 589648664 594426692 598706543
2979.8 598706543 602451921 605710506 608561337 610966206 612894535 614320755 615150690 615365088 614916503
2998.1 614916503 613718867 611926377 609791338 607604265 605837047 604887128 604825497 605471313 606477618
3016.5 606477618 607456386 608144343 608406305 608224928 607634425 606715202 605615795 604418457 603096724
3034.9 603096724 601631939 600101948 598549783 596910000 595149159 593315780 591447294 589547276
3051.2E89547276j890480j846850j856446j916826j890659j758755j666903j705706
3067.5E75014651j804650j811206j696408j545310j490593j601875j717508j725137
3083.8E61621964j719654j737475j758158j785517j761973j696885j688778j749575
3100.1E47723949j844227j886785j824081j790881j887441j950085j852870j789630
3116.4E32897949j911223k103865k199709k129674k041281k062380k116620k168656
3132.8E16164541k161383k044559k004266k143383k252519k217889k137601k080768
3149.1D99122173k087385k166062k272904k303064k229691k163321k132833k118527
3165.4D81648386k149910k192110k189696k164185k138764k115279k105087k105951
$$ plain form
3051.2 589547276 587656796 585809946 583953500 582036674 580146015 578387260 576720357 575014651
3067.5 575014651 573210001 571398795 569702387 568157077 566666484 565064609 563347101 561621964
3083.8 561621964 559902310 558164835 556406677 554621160 552859187 551162302 549473524 547723949
3100.1 547723949 545879722 543992937 542168856 540377975 538490534 536540449 534687579 532897949
3116.4 532897949 530986726 528882861 526683152 524553478 522512197 520449817 518333197 516164541
3132.8 516164541 514003158 511958599 509954333 507810950 505558431 503340542 501202941 499122173
3149.1 499122173 497034788 494868726 492595822 490292758 488063067 485899746 483766913 481648386
3165.4 481648386 479498476 477306366 475116670 472952485 470813721 468698442 466593355 464487404
3181.7D64487404k097518k079248k037883k019405k077371k088010j989454j926661
3198D48171854j930177j907379j864671j809419j792013j828760j835853j805752j743943
3216.4D31653887j692235j717061j761109j728147j662284j653582j641482j593143
3232.7D18204844j656443j779526j761735j677245j625836j567036j544892j621902
3249D04970229j668305j592338j523167j538991j567752j536876j463145j411229j378983
3267.4C91289443j310021j289517j363873j411170j384228j294762j200885j157135
3283.7C80877852j129537j093150j035034j016379j088589j135320j113206j064926
3300C72201711r76414q92013r34154j101821j209379j205533j158178j106024j097649
$$ plain form
3181.7 464487404 462389886 460310638 458272755 456253350 454175979 452087969 450098515 448171854
3198 448171854 446241677 444334298 442469627 440660208 438868195 437039435 435203582 433397830 431653887
3216.4 431653887 429961652 428244591 426483482 424755335 423093051 421439469 419797987 418204844
3232.7 418204844 416548401 414768875 413007140 411329895 409704059 408137023 406592131 404970229
3249 404970229 403301924 401709586 400186419 398647428 397079676 395542800 394079655 392668426 391289443
3267.4 391289443 389979422 388689905 387326032 385914862 384530634 383235872 382034987 380877852
3283.7 380877852 379748315 378655165 377620131 376603752 375515163 374379843 373266637 372201711
3300 372201711 371225297 370333284 369399130 368297309 367087930 365882397 364724219 363618195 362520546
3318.4C62520546j113296j150369j185090j210421j260013j255601j211703j179963
3334.7C52954090j136721j190751j344025j407892j378238j309604j206785j217127
3351C42762947j382142j503825j442701j315296j308650j350879j253188j131326j222938
3369.3C30852002j447201j505613j329959j141399j062214j070291j052886r35704
3385.7C21306735p30693n07981n43087q11816q37475n45561l79771n69940p72595o18994
3406.1C14988822l54827k72602k81840k74241k25514j59681j18196p2986L0935K03460
3426.5C13463330L66122M06027M72188N98967N43892L86417M13746O28203Q36611Q99493
3446.8C19014996Q62301R19670J036584J100868J177013J295507J303792J290083J492679
$$ plain form
3318.4 362520546 361407250 360256881 359071791 357861370 356601357 355345756 354134053 352954090
3334.7 352954090 351817369 350626618 349282593 347874701 346496463 345186859 343980074 342762947
3351 342762947 341380805 339876980 338434279 337118983 335810333 334459454 333206266 332074940 330852002
3369.3 330852002 329404801 327899188 326569229 325427830 324365616 323295325 322242439 321306735
3385.7 321306735 320576042 320068061 319524974 318713158 317875683 317330122 316950351 316380411 315607816 314988822
3406.1 314988822 314633995 314361393 314079553 313805312 313579798 313420117 313301921 313228935 313259870 313463330
3426.5 313463330 313829452 314235479 314707667 315306634 315850526 316236943 316650689 317278892 318115503 319014996
3446.8 319014996 319877297 320796967 321833551 322934419 324111432 325406939 326710731 328000814 329493493
3465.2C29493493J681000J544714J273870J262367J458585J667738J745165J606553
3481.5C41733485J530380J668602J735836J703441J798213J933247J997470J961857
3497.8C56062531J937211J966625J886368J817733J926631K100349K244889K237559
3514.2C72179896K121895K172321K370566K535910K445012K242953K249986K373993
3530.5C90692532K520889K710581K804995K776861K893597L096461L112495K890020
3546.8D13498431K785236K966404L116339L195525L371924L544032L603250L672630
3563.1D39753771L826648L938168L812075L697604L839075M096270M265398M386216
3579.4D71615225M549772M674971M722476M625529M469931M505515M703492M785180
$$ plain form
3465.2 329493493 331174493 332719207 333993077 335255444 336714029 338381767 340126932 341733485
3481.5 341733485 343263865 344932467 346668303 348371744 350169957 352103204 354100674 356062531
3497.8 356062531 357999742 359966367 361852735 363670468 365597099 367697448 369942337 372179896
3514.2 372179896 374301791 376474112 378844678 381380588 383825600 386068553 388318539 390692532
3530.5 390692532 393213421 395924002 398728997 401505858 404399455 407495916 410608411 413498431
3546.8 413498431 416283667 419250071 422366410 425561935 428933859 432477891 436081141 439753771
3563.1 439753771 443580419 447518587 451330662 455028266 458867341 462963611 467229009 471615225
3579.4 471615225 476164997 480839968 485562444 490187973 494657904 499163419 503866911 508652091
3595.7E08652091M783034M805923M732728M651129M696787M780709M726768M689932
3612.1E46519101M720330M702628M760146M724383M395902M240751M450024M660368
3628.4E83173633M280150L736376L710926L822267L848553L848016L829002L909350
3644.7F14158273M132151M115522L395379K801299K917826L147185L052056K849817
3661F40569508K714753K781213L001332L027141K753794K618313K411663J801372J592159
3679.4F63271248J785159K021909K385020K726913K298892J387894J186192J413881
3695.7F78477108J576126J660168J555085J256168J198173J413107J480102J017690
3712F89633727O10948Q39352J188457J290620J207113J033962Q06093Q15570J136482
$$ plain form
3595.7 508652091 513435125 518241048 522973776 527624905 532321692 537102401 541829169 546519101
3612.1 546519101 551239431 555942059 560702205 565426588 569822490 574063241 578513265 583173633
3628.4 583173633 587453783 591190159 594901085 598723352 602571905 606419921 610248923 614158273
3644.7 614158273 618290424 622405946 625801325 628602624 631520450 634667635 637719691 640569508
3661 640569508 643284261 646065474 649066806 652093947 654847741 657466054 659877717 661679089 663271248
3679.4 663271248 665056407 667078316 669463336 672190249 674489141 675877035 677063227 678477108
3695.7 678477108 680053234 681713402 683268487 684524655 685722828 687135935 688616037 689633727
3712 689633727 690244675 691084027 692272484 693563104 694770217 695804179 696610272 697425842 698562324
3730.3F98562324J398206J192987N63621K02298M89891R20236Q38995O30796P78318
3748.7G05577672N65052R3400K36332O22333N98013L34024M63009P19726O95944N04375
3769.1G10409880K60055K37643N40853Q38041O82593K95818K93314M55201M49776L84927
3789.5G14848101M07159N77569P20740P18713O64115L89039J78933K56837J55270R8884
3809.9G19015360M01676P44342P15316N98550N34474O8069j16944J13427K62082L79741
3830.3G22716093M74930O48081O88195K78354q0347o0618J6213J25527M79698R50754
3850.7G26236880P68602k76685m73261J79L07798L82602K16306K04205L70264K05338
3871.1G27942228k9862o5744J08839L77953L23534K23040J46151j4365J27792J33694
$$ plain form
3730.3 698562324 699960530 701153517 701717138 701919436 702409327 703329563 704168558 704799354 705577672
3748.7 705577672 706142724 706236124 706472456 707094789 707692802 708026826 708489835 709209561 709905505 710409880
3769.1 710409880 710669935 710907578 711448431 712286472 712969065 713264883 713558197 714013398 714463174 714848101
3789.5 714848101 715255260 715832829 716553569 717272282 717936397 718325436 718504369 718761206 718916476 719015360
3809.9 719015360 719417036 720161378 720876694 721475244 722009718 722077787 721960843 722074270 722336352 722716093
3830.3 722716093 723191023 723839104 724527299 724805653 724725306 724664688 724680901 724806428 725286126 726236880
3850.7 726236880 727005482 726728797 726255536 726255715 726563513 726946115 727162421 727366626 727736890 727942228
3871.1 727942228 727912366 727846622 727955461 728333414 728656948 728879988 729026139 729011774 729139566 729273260
3891.5G29273260j34826j7107L90530N81920L85583j9312l42608l48270j14262J04547
3911.9G29759455K33054K93851K06649O2287L7193J3113o0439M0531K47240K25127
3932.3G31058061j8239j54257l7312J70171J74582K9087N484M1306O3002J01089J09375
3954.7G31542349P9095O1751N7816J8656m0650m3273K8729J00434J27316J08361N0962
3977.1G32091546K0564J00553J89185J11818j6093j8418Q0526J48952O8843p0333
3997.5G32707143
$$ plain form
3891.5 729273260 729138434 729121327 729511857 730093777 730479360 730460048 730117440 729769170 729654908 729759455
3911.9 729759455 729992509 730286360 730493009 730555296 730592489 730605602 730545163 730585694 730832934 731058061
3932.3 731058061 731039822 730885565 730848253 731018424 731193006 731222093 731227577 731268883 731331885 731432974 731542349
3954.7 731542349 731621444 731683195 731741011 731759667 731719017 731675744 731704473 731804907 731932223 732040584 732091546
3977.1 732091546 732112110 732212663 732401848 732513666 732497573 732479155 732559681 732708633 732777476 732707143
3997.5 732707143
##END=$$ End of the data block
